Cyclohexene
- Formula: C6H10
- Molecular weight: 82.1436
- IUPAC Standard InChIKey: HGCIXCUEYOPUTN-UHFFFAOYSA-N
- CAS Registry Number: 110-83-8
- Chemical structure:

Gas phase thermochemistry data

Data compiled as indicated in comments:
ALS - Hussein Y. Afeefy, Joel F. Liebman, and Stephen E. Stein
DRB - Donald R. Burgess, Jr.
GT - Glushko Thermocenter, Russian Academy of Sciences, Moscow
Quantity | Value | Units | Method | Reference | Comment |
---|---|---|---|---|---|
ΔfH°gas | -4.32 ± 0.98 | kJ/mol | Ccr | Steele, Chirico, et al., 1996 | ALS |
ΔfH°gas | -4.7 | kJ/mol | N/A | Good and Smith, 1969 | Value computed using ΔfHliquid° value of -38.2±0.6 kj/mol from Good and Smith, 1969 and ΔvapH° value of 33.5 kj/mol from Steele, Chirico, et al., 1996.; DRB |
ΔfH°gas | -5.3 | kJ/mol | N/A | Labbauf and Rossini, 1961 | Value computed using ΔfHliquid° value of -38.8±0.6 kj/mol from Labbauf and Rossini, 1961 and ΔvapH° value of 33.5 kj/mol from Steele, Chirico, et al., 1996.; DRB |
ΔfH°gas | -7.1 | kJ/mol | N/A | Epstein, Pitzer, et al., 1949 | Value computed using ΔfHliquid° value of -40.6±0.8 kj/mol from Epstein, Pitzer, et al., 1949 and ΔvapH° value of 33.5 kj/mol from Steele, Chirico, et al., 1996.; DRB |
Quantity | Value | Units | Method | Reference | Comment |
S°gas | 310.45 | J/mol*K | N/A | Beckett C.W., 1948 | GT |
Constant pressure heat capacity of gas
Cp,gas (J/mol*K) | Temperature (K) | Reference | Comment |
---|---|---|---|
35.12 | 50. | Dorofeeva O.V., 1986 | Recommended S(298.15 K) value agrees well with experimental one [ Beckett C.W., 1948], however calculated Cp(T) values are about 5 J/mol*K lower than those obtained from experimental measurements [ Montgomery J.B., 1942]. To fit calculated Cp(T) values to experiment, [ Beckett C.W., 1948] suggested existence of stable half-boat conformation. This suggestion was found to be incorrect later. [ Dorofeeva O.V., 1986] used more reliable data on molecular structure and their S(T) and Cp(T) values are in good agreement with results of detail force-field calculations [ Lenz T.G., 1990].; GT |
43.06 | 100. | ||
53.78 | 150. | ||
67.35 | 200. | ||
92.14 | 273.15 | ||
101.5 ± 3.0 | 298.15 | ||
102.16 | 300. | ||
139.70 | 400. | ||
173.27 | 500. | ||
201.44 | 600. | ||
224.91 | 700. | ||
244.65 | 800. | ||
261.38 | 900. | ||
275.63 | 1000. | ||
287.83 | 1100. | ||
298.29 | 1200. | ||
307.29 | 1300. | ||
315.06 | 1400. | ||
321.78 | 1500. |
Constant pressure heat capacity of gas
Cp,gas (J/mol*K) | Temperature (K) | Reference | Comment |
---|---|---|---|
133.47 | 370. | Montgomery J.B., 1942 | GT |
141.42 | 390. | ||
148.53 | 410. |

Reaction thermochemistry data

Data compiled as indicated in comments:
ALS - Hussein Y. Afeefy, Joel F. Liebman, and Stephen E. Stein
B - John E. Bartmess
M - Michael M. Meot-Ner (Mautner) and Sharon G. Lias
Individual Reactions
By formula: C6H10 + H2 = C6H12
Quantity | Value | Units | Method | Reference | Comment |
---|---|---|---|---|---|
ΔrH° | -118. ± 6. | kJ/mol | AVG | N/A | Average of 8 values; Individual data points |
C6H9- + =
By formula: C6H9- + H+ = C6H10
Quantity | Value | Units | Method | Reference | Comment |
---|---|---|---|---|---|
ΔrH° | 1617. ± 21. | kJ/mol | G+TS | Lee and Squires, 1986 | gas phase; Between H2O, MeOH; B |
Quantity | Value | Units | Method | Reference | Comment |
ΔrG° | 1586. ± 21. | kJ/mol | IMRB | Lee and Squires, 1986 | gas phase; Between H2O, MeOH; B |
By formula: C3H9Si+ + C6H10 = (C3H9Si+ • C6H10)
Quantity | Value | Units | Method | Reference | Comment |
---|---|---|---|---|---|
ΔrH° | 138. | kJ/mol | PHPMS | Li and Stone, 1989 | gas phase; condensation; M |
Quantity | Value | Units | Method | Reference | Comment |
ΔrS° | 191. | J/mol*K | PHPMS | Li and Stone, 1989 | gas phase; condensation; M |
By formula: CH6N+ + C6H10 = (CH6N+ • C6H10)
Quantity | Value | Units | Method | Reference | Comment |
---|---|---|---|---|---|
ΔrH° | 48.5 | kJ/mol | PHPMS | Deakyne and Meot-Ner (Mautner), 1985 | gas phase; M |
Quantity | Value | Units | Method | Reference | Comment |
ΔrS° | 70.7 | J/mol*K | PHPMS | Deakyne and Meot-Ner (Mautner), 1985 | gas phase; M |
By formula: C6H10 + C2HF3O2 = C8H11F3O2
Quantity | Value | Units | Method | Reference | Comment |
---|---|---|---|---|---|
ΔrH° | -43.3 ± 0.1 | kJ/mol | Cac | Wiberg, Wasserman, et al., 1985 | liquid phase; solvent: Trifluoroacetic acid; Triflouroacetolysis; ALS |
By formula: C6H10 + Br2 = C6H10Br2
Quantity | Value | Units | Method | Reference | Comment |
---|---|---|---|---|---|
ΔrH° | -140.71 | kJ/mol | Cm | Lister, 1941 | gas phase; Heat of bromination at 300 K; ALS |

Gas phase ion energetics data

Data evaluated as indicated in comments:
HL - Edward P. Hunter and Sharon G. Lias
L - Sharon G. Lias
Data compiled as indicated in comments:
B - John E. Bartmess
LBLHLM - Sharon G. Lias, John E. Bartmess, Joel F. Liebman, John L. Holmes, Rhoda D. Levin, and W. Gary Mallard
LLK - Sharon G. Lias, Rhoda D. Levin, and Sherif A. Kafafi
RDSH - Henry M. Rosenstock, Keith Draxl, Bruce W. Steiner, and John T. Herron
Quantity | Value | Units | Method | Reference | Comment |
---|---|---|---|---|---|
IE (evaluated) | 8.95 ± 0.01 | eV | N/A | N/A | L |
Quantity | Value | Units | Method | Reference | Comment |
Proton affinity (review) | 784.5 | kJ/mol | N/A | Hunter and Lias, 1998 | HL |
Quantity | Value | Units | Method | Reference | Comment |
Gas basicity | 752.0 | kJ/mol | N/A | Hunter and Lias, 1998 | HL |
Ionization energy determinations
IE (eV) | Method | Reference | Comment |
---|---|---|---|
8.94 | PE | Kimura, Katsumata, et al., 1981 | LLK |
8.94 ± 0.02 | PE | Bieri, Burger, et al., 1977 | LLK |
8.95 | EI | Lossing and Traeger, 1975 | LLK |
8.94 ± 0.01 | PE | Rang, Paldoia, et al., 1974 | LLK |
9.57 ± 0.05 | EI | Praet, 1970 | RDSH |
8.99 | EI | Lewis and Hamill, 1970 | RDSH |
8.92 | PE | Demeo and Yencha, 1970 | RDSH |
8.95 ± 0.01 | PI | Demeo and El-Sayed, 1970 | RDSH |
8.94 | PE | Bischof and Heilbronner, 1970 | RDSH |
8.92 ± 0.02 | EI | Winters and Collins, 1969 | RDSH |
8.95 ± 0.01 | PI | Watanabe, 1957 | RDSH |
9.09 | PE | Lambert, Xue, et al., 1986 | Vertical value; LBLHLM |
9.12 | PE | Kobayashi, 1978 | Vertical value; LLK |
9.12 | PE | Hentrich, Gunkel, et al., 1974 | Vertical value; LLK |
9.12 | PE | Clary, Lewis, et al., 1974 | Vertical value; LLK |
9.11 | PE | Asmus and Klessinger, 1974 | Vertical value; LLK |
Appearance energy determinations
Ion | AE (eV) | Other Products | Method | Reference | Comment |
---|---|---|---|---|---|
C3H3+ | 13.45 ± 0.18 | ? | EI | Winters and Collins, 1969 | RDSH |
C3H5+ | 13.68 ± 0.05 | ? | EI | Praet, 1970 | RDSH |
C3H5+ | 12.12 ± 0.12 | ? | EI | Winters and Collins, 1969 | RDSH |
C4H5+ | 13.31 ± 0.15 | ? | EI | Winters and Collins, 1969 | RDSH |
C4H6+ | 11.91 ± 0.05 | C2H4 | EI | Praet, 1970 | RDSH |
C4H6+ | 10.67 ± 0.06 | ? | EI | Winters and Collins, 1969 | RDSH |
C5H5+ | 13.57 ± 0.11 | ? | EI | Winters and Collins, 1969 | RDSH |
C5H7+ | 8.95 | CH3 | EI | Lossing and Traeger, 1975, 2 | LLK |
C5H7+ | 10.27 | CH3 | EI | Lossing and Traeger, 1975 | LLK |
C5H7+ | 11.22 ± 0.05 | CH3 | EI | Praet, 1970 | RDSH |
C5H7+ | 10.18 ± 0.12 | CH3 | EI | Winters and Collins, 1969 | RDSH |
C6H7+ | 12.13 ± 0.10 | H2+H | EI | Winters and Collins, 1969 | RDSH |
C6H9+ | 11.8 ± 0.05 | H | EI | Praet, 1970 | RDSH |
C6H9+ | 10.62 ± 0.07 | H | EI | Winters and Collins, 1969 | RDSH |
De-protonation reactions
C6H9- + =
By formula: C6H9- + H+ = C6H10
Quantity | Value | Units | Method | Reference | Comment |
---|---|---|---|---|---|
ΔrH° | 1617. ± 21. | kJ/mol | G+TS | Lee and Squires, 1986 | gas phase; Between H2O, MeOH; B |
Quantity | Value | Units | Method | Reference | Comment |
ΔrG° | 1586. ± 21. | kJ/mol | IMRB | Lee and Squires, 1986 | gas phase; Between H2O, MeOH; B |

Ion clustering data

Data compiled by: Michael M. Meot-Ner (Mautner) and Sharon G. Lias
Clustering reactions
By formula: CH6N+ + C6H10 = (CH6N+ • C6H10)
Quantity | Value | Units | Method | Reference | Comment |
---|---|---|---|---|---|
ΔrH° | 48.5 | kJ/mol | PHPMS | Deakyne and Meot-Ner (Mautner), 1985 | gas phase |
Quantity | Value | Units | Method | Reference | Comment |
ΔrS° | 70.7 | J/mol*K | PHPMS | Deakyne and Meot-Ner (Mautner), 1985 | gas phase |
By formula: C3H9Si+ + C6H10 = (C3H9Si+ • C6H10)
Quantity | Value | Units | Method | Reference | Comment |
---|---|---|---|---|---|
ΔrH° | 138. | kJ/mol | PHPMS | Li and Stone, 1989 | gas phase; condensation |
Quantity | Value | Units | Method | Reference | Comment |
ΔrS° | 191. | J/mol*K | PHPMS | Li and Stone, 1989 | gas phase; condensation |

Kovats' RI, non-polar column, isothermal

Column type | Active phase | Temperature (C) | I | Reference | Comment |
---|---|---|---|---|---|
Packed | C78, Branched paraffin | 130. | 705.0 | Dallos, Sisak, et al., 2000 | He; Column length: 3.3 m |
Capillary | BPX-5 | 30. | 685. | Aflalaye, Sternberg, et al., 1995 | 12. m/0.15 mm/0.25 μm, H2 |
Capillary | BPX-5 | 30. | 689. | Aflalaye, Sternberg, et al., 1995 | 12. m/0.15 mm/0.25 μm, H2 |
Capillary | CP Sil 5 CB | 20. | 671. | Do and Raulin, 1992 | 25. m/0.15 mm/2. μm, H2 |
Packed | C78, Branched paraffin | 130. | 704.4 | Reddy, Dutoit, et al., 1992 | Chromosorb G HP; Column length: 3.3 m |
Capillary | OV-101 | 100. | 688. | Diez, Guillen, et al., 1990 | N2; Column length: 25. m; Column diameter: 0.23 mm |
Capillary | OV-101 | 80. | 683. | Diez, Guillen, et al., 1990 | N2; Column length: 25. m; Column diameter: 0.23 mm |
Capillary | Squalane | 100. | 680.5 | Diez, Guillen, et al., 1990 | N2; Column length: 45. m; Column diameter: 0.5 mm |
Capillary | Squalane | 80. | 676.8 | Diez, Guillen, et al., 1990 | N2; Column length: 45. m; Column diameter: 0.5 mm |
Capillary | SE-54 | 100. | 698. | Diez, Guillen, et al., 1990 | N2; Column length: 25. m; Column diameter: 0.22 mm |
Capillary | SE-54 | 80. | 693. | Diez, Guillen, et al., 1990 | N2; Column length: 25. m; Column diameter: 0.22 mm |
Capillary | BP-1 | 100. | 688. | Bermejo, Blanco, et al., 1987 | N2; Column length: 12. m; Column diameter: 0.22 mm |
Capillary | BP-1 | 80. | 684. | Bermejo, Blanco, et al., 1987 | N2; Column length: 12. m; Column diameter: 0.22 mm |
Capillary | OV-101 | 100. | 688. | Bermejo, Blanco, et al., 1987 | N2; Column length: 25. m; Column diameter: 0.23 mm |
Capillary | OV-101 | 80. | 683. | Bermejo, Blanco, et al., 1987 | N2; Column length: 25. m; Column diameter: 0.23 mm |
Capillary | OV-1 | 100. | 687.5 | Engewald, Billing, et al., 1987 | Column length: 50. m; Column diameter: 0.3 mm |
Capillary | DB-1 | 40. | 674. | Lubeck and Sutton, 1984 | 60. m/0.264 mm/0.25 μm, H2 |
Capillary | HP-PONA | 40. | 674. | Lubeck and Sutton, 1984 | 50. m/0.21 mm/0.5 μm, H2 |
Packed | SE-30 | 150. | 700. | Tiess, 1984 | Ar, Gas Chrom Q (80-100 mesh); Column length: 3. m |
Packed | SE-30 | 100. | 690. | Winskowski, 1983 | Gaschrom Q; Column length: 2. m |
Capillary | SE-30 | 130. | 694. | Bredael, 1982 | Column length: 100. m; Column diameter: 0.5 mm |
Capillary | SE-30 | 80. | 681. | Bredael, 1982 | Column length: 100. m; Column diameter: 0.5 mm |
Capillary | SE-30 | 80. | 685.1 | Albaigés and Guardino, 1980 | He; Column length: 64. m; Column diameter: 0.25 mm |
Capillary | Squalane | 80. | 675.9 | Albaigés and Guardino, 1980 | He; Column length: 100. m; Column diameter: 0.25 mm |
Capillary | Apiezon L | 100. | 704. | Morishita, Okano, et al., 1980 | Column length: 45. m; Column diameter: 0.25 mm |
Packed | Squalane | 100. | 682. | Nabivach and Kirilenko, 1980 | He, Chromaton N-AW-HMDS; Column length: 1. m |
Capillary | Squalane | 50. | 671. | Bajus, Veselý, et al., 1979 | Column length: 100. m; Column diameter: 0.25 mm |
Capillary | Squalane | 70. | 675.7 | Bajus, Veselý, et al., 1979 | Column length: 100. m; Column diameter: 0.25 mm |
Packed | Squalane | 30. | 667. | Bogoslovsky, Anvaer, et al., 1978 | |
Packed | Squalane | 42. | 669. | Bogoslovsky, Anvaer, et al., 1978 | |
Packed | Squalane | 50. | 673. | Bogoslovsky, Anvaer, et al., 1978 | |
Packed | Squalane | 80. | 676. | Bogoslovsky, Anvaer, et al., 1978 | |
Packed | Squalane | 80. | 677. | Bogoslovsky, Anvaer, et al., 1978 | |
Capillary | Squalane | 100. | 683. | Rang, Orav, et al., 1977 | Nitrogen or helium; Column length: 100. m; Column diameter: 0.25 mm |
Capillary | Squalane | 100. | 670.5 | Lulova, Leont'eva, et al., 1976 | He; Column length: 120. m; Column diameter: 0.25 mm |
Capillary | Squalane | 100. | 670.4 | Lulova, Leont'eva, et al., 1976 | He; Column length: 120. m; Column diameter: 0.25 mm |
Capillary | Squalane | 100. | 672.4 | Lulova, Leont'eva, et al., 1976 | He; Column length: 120. m; Column diameter: 0.25 mm |
Capillary | Squalane | 55. | 672.4 | Lulova, Leont'eva, et al., 1975 | He; Column length: 120. m; Column diameter: 0.25 mm |
Capillary | Squalane | 42.5 | 669. | Engewald, Epsch, et al., 1974 | N2; Column length: 100. m; Column diameter: 0.23 mm |
Capillary | Squalane | 70. | 677. | Engewald, Epsch, et al., 1974 | N2; Column length: 100. m; Column diameter: 0.23 mm |
Capillary | Apiezon L | 120. | 685. | Agr, Tesaric, et al., 1973 | |
Capillary | Squalane | 120. | 687. | Agr, Tesaric, et al., 1973 | |
Capillary | Squalane | 86. | 666. | Agr, Tesaric, et al., 1973 | |
Capillary | Squalane | 100. | 683. | Besson and Gäumann, 1973 | Column length: 50. m; Column diameter: 0.25 mm |
Capillary | Apiezon L | 100. | 702. | Besson and Gäumann, 1973 | Column length: 50. m; Column diameter: 0.25 mm |
Capillary | Squalane | 120. | 687. | Agrawal, Tesarík, et al., 1972 | N2, Celite 545; Column length: 50. m; Column diameter: 0.3 mm |
Capillary | Squalane | 86. | 666. | Agrawal, Tesarík, et al., 1972 | N2, Celite 545; Column length: 50. m; Column diameter: 0.3 mm |
Capillary | Apiezon L | 120. | 685. | Agrawal, Tesarík, et al., 1972 | N2; Column length: 100. m; Column diameter: 0.3 mm |
Capillary | Squalane | 30. | 668.3 | Eisen, Orav, et al., 1972 | Column length: 80. m; Column diameter: 0.25 mm |
Capillary | Squalane | 60. | 674.4 | Eisen, Orav, et al., 1972 | Column length: 80. m; Column diameter: 0.25 mm |
Capillary | Squalane | 80. | 679.0 | Eisen, Orav, et al., 1972 | Column length: 80. m; Column diameter: 0.25 mm |
Capillary | Squalane | 30. | 668. | Orav and Eisen, 1972 | Column length: 80. m; Column diameter: 0.25 mm |
Capillary | Squalane | 60. | 674. | Orav and Eisen, 1972 | Column length: 80. m; Column diameter: 0.25 mm |
Capillary | Squalane | 80. | 679. | Orav and Eisen, 1972 | Column length: 80. m; Column diameter: 0.25 mm |
Packed | SE-30 | 75. | 679. | Robinson and Odell, 1971 | N2, Chromosorb W; Column length: 6.1 m |
Packed | Squalane | 100. | 680. | Robinson and Odell, 1971 | N2, Embacel; Column length: 3.0 m |
Packed | Apiezon L | 100. | 707. | Wagaman and Smith, 1971 | CH4; Column length: 3. m |
Packed | Squalane | 27. | 667. | Hively and Hinton, 1968 | He, Chromosorb P; Column length: 15. m; Column diameter: 0.25 mm |
Packed | Squalane | 49. | 673. | Hively and Hinton, 1968 | He, Chromosorb P; Column length: 15. m; Column diameter: 0.25 mm |
Packed | Squalane | 67. | 677. | Hively and Hinton, 1968 | He, Chromosorb P; Column length: 15. m; Column diameter: 0.25 mm |
Packed | Squalane | 86. | 681. | Hively and Hinton, 1968 | He, Chromosorb P; Column length: 15. m; Column diameter: 0.25 mm |
Capillary | Squalane | 120. | 689. | Schomburg, 1966 | |
Capillary | Squalane | 70. | 677. | Schomburg, 1966 | |
Capillary | Squalane | 80. | 681. | Schomburg, 1966 | |
Packed | Apiezon L | 70. | 695. | Wehrli and Kováts, 1959 | Celite; Column length: 2.25 m |

Kovats' RI, non-polar column, temperature ramp

Column type | Active phase | I | Reference | Comment |
---|---|---|---|---|
Capillary | OV-101 | 667. | Hayes and Pitzer, 1982 | 110. m/0.25 mm/0.20 μm, He, 1. K/min; Tstart: 35. C; Tend: 200. C |

Kovats' RI, non-polar column, custom temperature program

Column type | Active phase | I | Reference | Comment |
---|---|---|---|---|
Capillary | Petrocol DH-100 | 673.6 | Haagen-Smit Laboratory, 1997 | He; Column length: 100. m; Column diameter: 0.2 mm; Program: 5C(10min) => 5C/min => 50C(48min) => 1.5C/min => 195C(91min) |
Capillary | DB-1 | 673. | Hoekman, 1993 | 60. m/0.32 mm/1.0 μm, He; Program: -40 C for 12 min; -40 - 125 C at 3 deg.min; 125-185 C at 6 deg/min; 185 - 220 C at 20 deg/min; hold 220 C for 2 min |

Kovats' RI, polar column, isothermal

Column type | Active phase | Temperature (C) | I | Reference | Comment |
---|---|---|---|---|---|
Capillary | PEG-20M | 80. | 822. | Rang, Orav, et al., 1988 | |
Capillary | PEG 4000 | 100. | 850. | Rang, Orav, et al., 1988 | |
Capillary | PEG 4000 | 60. | 832. | Rang, Orav, et al., 1988 | |
Capillary | PEG 4000 | 80. | 841. | Rang, Orav, et al., 1988 | |
Capillary | PEG-20M | 100. | 825. | Morishita, Okano, et al., 1980 | Column length: 75. m; Column diameter: 0.25 mm |
Capillary | PEG 4000 | 100. | 850. | Rang, Orav, et al., 1977 | Nitrogen or Helium; Column length: 45. m; Column diameter: 0.25 mm |
Capillary | Polyethylene Glycol 4000 | 100. | 849.7 | Eisen, Orav, et al., 1972 | Column length: 80. m; Column diameter: 0.25 mm |
Capillary | Polyethylene Glycol 4000 | 60. | 832.4 | Eisen, Orav, et al., 1972 | Column length: 80. m; Column diameter: 0.25 mm |
Capillary | Polyethylene Glycol 4000 | 80. | 840.9 | Eisen, Orav, et al., 1972 | Column length: 80. m; Column diameter: 0.25 mm |
Capillary | PEG 4000 | 100. | 849.7 | Orav and Eisen, 1972 | Column length: 80. m; Column diameter: 0.25 mm |
Capillary | PEG 4000 | 60. | 832.4 | Orav and Eisen, 1972 | Column length: 80. m; Column diameter: 0.25 mm |
Capillary | PEG 4000 | 80. | 840.9 | Orav and Eisen, 1972 | Column length: 80. m; Column diameter: 0.25 mm |

Van Den Dool and Kratz RI, non-polar column, temperature ramp

Column type | Active phase | I | Reference | Comment |
---|---|---|---|---|
Capillary | DB-1 | 667. | Osorio, Alarcon, et al., 2006 | 25. m/0.2 mm/0.33 μm, 4. K/min; Tstart: 50. C; Tend: 300. C |
Capillary | RTX-5 | 687.4 | Ádámová, Orinák, et al., 2005 | 30. m/0.25 mm/0.25 μm, N2, 40. C @ 2. min, 5. K/min, 300. C @ 10. min |
Capillary | RTX-5 | 701.1 | Ádámová, Orinák, et al., 2005 | 30. m/0.25 mm/0.25 μm, N2, 40. C @ 2. min, 5. K/min, 300. C @ 10. min |
Capillary | DB-5 | 677.1 | Song, Lai, et al., 2003 | 30. m/0.25 mm/0.25 μm, He, 2. K/min; Tstart: 40. C; Tend: 310. C |
Capillary | DB-5 | 676.7 | Song, Lai, et al., 2003 | 30. m/0.25 mm/0.25 μm, He, 4. K/min; Tstart: 40. C; Tend: 310. C |
Capillary | DB-5 | 678.8 | Song, Lai, et al., 2003 | 30. m/0.25 mm/0.25 μm, He, 6. K/min; Tstart: 40. C; Tend: 310. C |
Capillary | DB-5 | 677.1 | Lai and Song, 1995 | 30. m/0.25 mm/0.25 μm, He, 2. K/min; Tstart: 40. C; Tend: 310. C |
Capillary | DB-5 | 676.7 | Lai and Song, 1995 | 30. m/0.25 mm/0.25 μm, He, 4. K/min; Tstart: 40. C; Tend: 310. C |
Capillary | DB-5 | 678.8 | Lai and Song, 1995 | 30. m/0.25 mm/0.25 μm, He, 6. K/min; Tstart: 40. C; Tend: 310. C |
Capillary | Petrocol DH | 667.76 | White, Douglas, et al., 1992 | 100. m/0.25 mm/0.5 μm, He, 1. K/min; Tstart: 30. C; Tend: 220. C |
Capillary | Petrocol DH | 667.8 | White, Douglas, et al., 1992 | 100. m/0.25 mm/0.5 μm, He, 1. K/min; Tstart: 30. C; Tend: 220. C |
Packed | SE-30 | 667. | Buchman, Cao, et al., 1984 | He, Chromosorb AW, 40. C @ 10. min, 10. K/min, 210. C @ 30. min; Column length: 3.05 m |
Capillary | OV-101 | 667. | Hayes and Pitzer, 1981 | 108. m/0.25 mm/0.2 μm, 1. K/min; Tstart: 35. C; Tend: 200. C |

Van Den Dool and Kratz RI, non-polar column, custom temperature program

Column type | Active phase | I | Reference | Comment |
---|---|---|---|---|
Packed | SE-30 | 667. | Peng, Ding, et al., 1988 | Supelcoport; Chromosorb; Column length: 3.05 m; Program: 40C(5min) => 10C/min => 200C or 250C (60min) |
Packed | SE-30 | 667. | Peng, Ding, et al., 1988 | Supelcoport; Chromosorb; Column length: 3.05 m; Program: 40C(5min) => 10C/min => 200C or 250C (60min) |

Van Den Dool and Kratz RI, polar column, temperature ramp

Column type | Active phase | I | Reference | Comment |
---|---|---|---|---|
Packed | Carbowax 20M | 808. | Buchman, Cao, et al., 1984 | He, Supelcoport, 40. C @ 10. min, 10. K/min, 210. C @ 30. min; Column length: 3.05 m |

Normal alkane RI, non-polar column, isothermal

Column type | Active phase | Temperature (C) | I | Reference | Comment |
---|---|---|---|---|---|
Packed | Synachrom | 150. | 643. | Dufka, Malinsky, et al., 1971 | Helium, Synachrom (60-80 mesh); Column length: 1.5 m |
Packed | Polydimethyl siloxane | 110. | 683. | Ferrand, 1962 |

Normal alkane RI, non-polar column, temperature ramp

Column type | Active phase | I | Reference | Comment |
---|---|---|---|---|
Capillary | Polydimethyl siloxane: CP-Sil 5 CB | 674. | Bramston-Cook, 2013 | 60. m/0.25 mm/1.0 μm, Helium, 45. C @ 1.45 min, 3.6 K/min, 210. C @ 2.72 min |
Capillary | Petrocol DH | 666. | Supelco, 2012 | 100. m/0.25 mm/0.50 μm, Helium, 20. C @ 15. min, 15. K/min, 220. C @ 30. min |
Capillary | OV-101 | 675. | Zenkevich, Eliseenkov, et al., 2009 | 25. m/0.20 mm/0.25 μm, Nitrogen, 6. K/min; Tstart: 60. C; Tend: 240. C |
Capillary | PONA | 673. | Zhang, Ding, et al., 2009 | 50. m/0.20 mm/0.50 μm, Nitrogen, 35. C @ 15. min, 2. K/min, 200. C @ 10. min |
Capillary | BP-1 | 678. | Health Safety Executive, 2000 | 50. m/0.22 mm/0.75 μm, He, 5. K/min; Tstart: 50. C; Tend: 200. C |
Capillary | OV-101 | 677. | Orav, Kailas, et al., 1999 | 50. m/0.20 mm/0.50 μm, Helium, 30. C @ 6. min, 1. K/min; Tend: 100. C |
Capillary | OV-101 | 675. | Chupalov and Zenkevich, 1996 | N2, 3. K/min; Column length: 52. m; Column diameter: 0.26 mm; Tstart: 50. C; Tend: 220. C |
Capillary | DB-1 | 673. | Ramnas, Ostermark, et al., 1994 | 50. m/0.32 mm/1.0 μm, He, 2. K/min; Tstart: -20. C |
Capillary | OV-101 | 675. | Zenkevich and Kulikova, 1993 | He, 3. K/min; Column length: 54. m; Column diameter: 0.26 mm; Tstart: 50. C; Tend: 230. C |
Packed | Apiezon L | 667. | Dahlmann, Köser, et al., 1979 | Chromosorb G-AW-DMCS, 10. K/min; Column length: 2. m; Tstart: 25. C |

Normal alkane RI, non-polar column, custom temperature program

Column type | Active phase | I | Reference | Comment |
---|---|---|---|---|
Capillary | Squalane | 681. | Chen, 2008 | Program: not specified |
Capillary | Squalane | 683. | Chen, 2008 | Program: not specified |
Capillary | RTX-5 | 700. | Ádámová, Orinák, et al., 2005 | 30. m/0.25 mm/0.25 μm, N2; Program: not specified |
Capillary | RTX-5 | 700. | Ádámová, Orinák, et al., 2005 | 30. m/0.25 mm/0.25 μm, N2; Program: not specified |
Capillary | Methyl Silicone | 714. | N/A | Program: not specified |
Capillary | DB-5 MS | 687. | Luo and Agnew, 2001 | 30. m/0.25 mm/1.0 μm, Helium; Program: not specified |
Capillary | Methyl Silicone | 657. | Zenkevich, 2000 | Program: not specified |
Capillary | SPB-1 | 681. | Flanagan, Streete, et al., 1997 | 60. m/0.53 mm/5. μm, He; Program: 40C(6min) => 5C/min => 80C => 10C/min => 200C |
Capillary | Polydimethyl siloxanes | 675. | Zenkevich, Chupalov, et al., 1996 | Program: not specified |
Capillary | DB-1 | 665. | Ciccioli, Cecinato, et al., 1994 | 60. m/0.32 mm/0.25 μm; Program: not specified |
Capillary | SPB-1 | 681. | Strete, Ruprah, et al., 1992 | 60. m/0.53 mm/5.0 μm, Helium; Program: 40 0C (6 min) 5 0C/min -> 80 0C 10 0C/min -> 200 0C |
Capillary | SPB-1 | 703. | Strete, Ruprah, et al., 1992 | 60. m/0.53 mm/5.0 μm, Helium; Program: not specified |
Capillary | OV-1, SE-30, Methyl silicone, SP-2100, OV-101, DB-1, etc. | 661. | Waggott and Davies, 1984 | Hydrogen; Column length: 50. m; Column diameter: 0.32 mm; Program: not specified |
Capillary | OV-1, SE-30, Methyl silicone, SP-2100, OV-101, DB-1, etc. | 667. | Waggott and Davies, 1984 | Hydrogen; Column length: 50. m; Column diameter: 0.32 mm; Program: not specified |
Capillary | OV-1, SE-30, Methyl silicone, SP-2100, OV-101, DB-1, etc. | 681. | Waggott and Davies, 1984 | Hydrogen; Column length: 50. m; Column diameter: 0.32 mm; Program: not specified |
Capillary | OV-1 | 705. | Ramsey and Flanagan, 1982 | Program: not specified |
Packed | SE-30 | 689. | Robinson and Odell, 1971 | N2, Chromosorb W; Column length: 6.1 m; Program: 50C910min) => 20C/min => 90(6min) => 10C/min => 150C(hold) |
Packed | Squalane | 679. | Robinson and Odell, 1971 | N2, Embacel; Column length: 3.0 m; Program: 25C(5min) => 2C/min => 35 => 4C/min => 95C(hold) |
Packed | SE-30 | 689. | Robinson and Odell, 1971, 2 | Chrom W; Column length: 6.1 m; Program: 50C(10min) => 20C/min(2min) => 90C(6min) => 10C/min(6min) => (hold at 150C) |
Packed | Squalane | 679. | Robinson and Odell, 1971, 2 | Embacel; Column length: 3.0 m; Program: 25C(5min) => 2C/min(5min) => 4C/min(15min) => (hold at 95C) |

Normal alkane RI, polar column, custom temperature program

Column type | Active phase | I | Reference | Comment |
---|---|---|---|---|
Capillary | DB-Wax | 808. | Peng, Yang, et al., 1991 | Program: not specified |
Capillary | Carbowax 400, Carbowax 20M, Carbowax 1540, Carbowax 4000, Superox 06, PEG 20M, etc. | 808. | Waggott and Davies, 1984 | Hydrogen; Column length: 50. m; Column diameter: 0.32 mm; Program: not specified |
Capillary | Carbowax 20M | 811. | Ramsey and Flanagan, 1982 | Program: not specified |

Condensed phase thermochemistry data

Data compiled as indicated in comments:
ALS - Hussein Y. Afeefy, Joel F. Liebman, and Stephen E. Stein
DH - Eugene S. Domalski and Elizabeth D. Hearing
Quantity | Value | Units | Method | Reference | Comment |
---|---|---|---|---|---|
ΔfH°liquid | -37.8 ± 8.2 | kJ/mol | Ccr | Steele, Chirico, et al., 1996 | ALS |
ΔfH°liquid | -38.2 ± 0.59 | kJ/mol | Ccb | Good and Smith, 1969 | ALS |
ΔfH°liquid | -38.8 ± 0.59 | kJ/mol | Ccb | Labbauf and Rossini, 1961 | ALS |
ΔfH°liquid | -40.6 ± 0.79 | kJ/mol | Ccb | Epstein, Pitzer, et al., 1949 | Unpublished results; ALS |
Quantity | Value | Units | Method | Reference | Comment |
ΔcH°liquid | -3752.39 ± 0.49 | kJ/mol | Ccr | Steele, Chirico, et al., 1996 | Corresponding ΔfHºliquid = -37.82 kJ/mol (simple calculation by NIST; no Washburn corrections); ALS |
ΔcH°liquid | -3752.0 ± 0.50 | kJ/mol | Ccb | Good and Smith, 1969 | Corresponding ΔfHºliquid = -38.2 kJ/mol (simple calculation by NIST; no Washburn corrections); ALS |
ΔcH°liquid | -3751.5 ± 0.50 | kJ/mol | Ccb | Labbauf and Rossini, 1961 | Corresponding ΔfHºliquid = -38.7 kJ/mol (simple calculation by NIST; no Washburn corrections); ALS |
ΔcH°liquid | -3761. | kJ/mol | Ccb | Konovalon, 1926 | Heat of combustion at 15°C; Corresponding ΔfHºliquid = -30. kJ/mol (simple calculation by NIST; no Washburn corrections); ALS |
Quantity | Value | Units | Method | Reference | Comment |
S°liquid | 214.60 | J/mol*K | N/A | Haida, Suga, et al., 1977 | DH |
S°liquid | 216.19 | J/mol*K | N/A | Huffman, Eaton, et al., 1948 | DH |
S°liquid | 216.7 | J/mol*K | N/A | Parks and Huffman, 1930 | Extrapolation below 90 K, 49.20 J/mol*K.; DH |
Constant pressure heat capacity of liquid
Cp,liquid (J/mol*K) | Temperature (K) | Reference | Comment |
---|---|---|---|
148.8 | 298.15 | Steele, Chirico, et al., 1993 | DH |
152.90 | 298.12 | Kalinowska and Woycicki, 1988 | T = 183 to 298 K. Unsmoothed experimental datum.; DH |
148.35 | 298.15 | Haida, Suga, et al., 1977 | T = 15 to 293 K.; DH |
149.16 | 298.15 | Huffman, Eaton, et al., 1948 | T = 12 to 300 K.; DH |
145.6 | 293.2 | Parks and Huffman, 1930 | T = 92 to 293 K. Value is unsmoothed experimental datum.; DH |

Phase change data

Data compiled as indicated in comments:
TRC - Thermodynamics Research Center, NIST Boulder Laboratories, Chris Muzny director
BS - Robert L. Brown and Stephen E. Stein
ALS - Hussein Y. Afeefy, Joel F. Liebman, and Stephen E. Stein
DRB - Donald R. Burgess, Jr.
AC - William E. Acree, Jr., James S. Chickos
CAL - James S. Chickos, William E. Acree, Jr., Joel F. Liebman, Students of Chem 202 (Introduction to the Literature of Chemistry), University of Missouri -- St. Louis
DH - Eugene S. Domalski and Elizabeth D. Hearing
Quantity | Value | Units | Method | Reference | Comment |
---|---|---|---|---|---|
Tboil | 356. ± 2. | K | AVG | N/A | Average of 56 out of 57 values; Individual data points |
Quantity | Value | Units | Method | Reference | Comment |
Tfus | 169. ± 1. | K | AVG | N/A | Average of 9 values; Individual data points |
Quantity | Value | Units | Method | Reference | Comment |
Ttriple | 169.66 | K | N/A | Haida, Suga, et al., 1977, 2 | Crystal phase 1 phase; Uncertainty assigned by TRC = 0.02 K; TRC |
Ttriple | 169.67 | K | N/A | Huffman, Eaton, et al., 1948, 2 | Crystal phase 1 phase; Uncertainty assigned by TRC = 0.05 K; TRC |
Ttriple | 169.0 | K | N/A | Parks and Huffman, 1930, 2 | Crystal phase 1 phase; Uncertainty assigned by TRC = 0.2 K; TRC |
Quantity | Value | Units | Method | Reference | Comment |
Tc | 560.4 ± 0.1 | K | N/A | Tsonopoulos and Ambrose, 1996 | |
Tc | 560.4 | K | N/A | Majer and Svoboda, 1985 | |
Tc | 560.4 | K | N/A | Cheng, McCoubrey, et al., 1962 | Uncertainty assigned by TRC = 0.3 K; Visual (5-cm 2-mm bore tubes) in nitrate-nitrite bath, TE or TH cal. vs NPL thermometer; TRC |
Tc | 560.42 | K | N/A | Ambrose, Cox, et al., 1960 | Uncertainty assigned by TRC = 0.02 K; Visual, PRT, IPTS-48, with decomp.; TRC |
Tc | 553.5 | K | N/A | Ambrose and Grant, 1957 | Uncertainty assigned by TRC = 0.15 K; TRC |
Quantity | Value | Units | Method | Reference | Comment |
ΔvapH° | 33.57 | kJ/mol | N/A | Majer and Svoboda, 1985 | |
ΔvapH° | 33.50 ± 0.53 | kJ/mol | V | Steele, Chirico, et al., 1996 | ALS |
ΔvapH° | 33.5 | kJ/mol | N/A | Steele, Chirico, et al., 1996 | DRB |
ΔvapH° | 33.5 ± 0.5 | kJ/mol | EB | Steele, Chirico, et al., 1996 | Based on data from 285. to 357. K.; AC |
ΔvapH° | 30.5 ± 0.3 | kJ/mol | V | Mathews, 1926 | ALS |
Enthalpy of vaporization
ΔvapH (kJ/mol) | Temperature (K) | Method | Reference | Comment |
---|---|---|---|---|
30.46 | 356.2 | N/A | Majer and Svoboda, 1985 | |
32.8 | 330. | N/A | Marrufo, Aucejo, et al., 2009 | Based on data from 315. to 356. K.; AC |
32.9 | 325. | N/A | Steyer and Sundmacher, 2004 | Based on data from 310. to 356. K.; AC |
32.6 | 327. | N/A | Segura, Lam, et al., 2001 | Based on data from 312. to 356. K.; AC |
32.7 | 324. | A,EB | Stephenson and Malanowski, 1987 | Based on data from 309. to 365. K. See also Meyer and Hotz, 1973.; AC |
33.1 | 308. | MM | Letcher and Marsicano, 1974 | Based on data from 305. to 322. K.; AC |
32.7 ± 0.1 | 313. | C | Svoboda, Veselý, et al., 1973 | AC |
32.2 ± 0.1 | 323. | C | Svoboda, Veselý, et al., 1973 | AC |
31.7 ± 0.1 | 333. | C | Svoboda, Veselý, et al., 1973 | AC |
31.2 ± 0.1 | 343. | C | Svoboda, Veselý, et al., 1973 | AC |
30.7 ± 0.1 | 353. | C | Svoboda, Veselý, et al., 1973 | AC |
33.7 | 300. | MM | Forziati, Camin, et al., 1950 | Based on data from 285. to 357. K.; AC |
32.59 | 300. | V | Lister, 1941 | Heat of bromination at 300 K; ALS |
32.6 | 300. | N/A | Lister, 1941 | Based on data from 229. to 292. K.; AC |
Enthalpy of vaporization
ΔvapH =
A exp(-βTr) (1 − Tr)β
ΔvapH =
Enthalpy of vaporization (at saturation pressure)
(kJ/mol)
Tr = reduced temperature (T / Tc)
View plot Requires a JavaScript / HTML 5 canvas capable browser.
Temperature (K) | A (kJ/mol) | β | Tc (K) | Reference | Comment |
---|---|---|---|---|---|
313. to 353. | 47.19 | 0.2662 | 560.4 | Majer and Svoboda, 1985 |
Antoine Equation Parameters
log10(P) = A − (B / (T + C))
P = vapor pressure (bar)
T = temperature (K)
View plot Requires a JavaScript / HTML 5 canvas capable browser.
Temperature (K) | A | B | C | Reference |
---|---|---|---|---|
310.02 to 364.53 | 3.9973 ± 0.0018 | 1221.9 ± 1.0 | -49.98 ± 0.12 | Meyer and Hotz, 1973 |
Enthalpy of fusion
ΔfusH (kJ/mol) | Temperature (K) | Reference | Comment |
---|---|---|---|
3.28 | 169.7 | Domalski and Hearing, 1996 | AC |
Entropy of fusion
ΔfusS (J/mol*K) | Temperature (K) | Reference | Comment |
---|---|---|---|
30.5 | 138.7 | Domalski and Hearing, 1996 | CAL |
19.35 | 169.7 |
Enthalpy of phase transition
ΔHtrs (kJ/mol) | Temperature (K) | Initial Phase | Final Phase | Reference | Comment |
---|---|---|---|---|---|
1.483 | 112.3 | crystaline, III | crystaline, I | Haida, Suga, et al., 1977 | DH |
4.231 | 138.63 | crystaline, II | crystaline, I | Haida, Suga, et al., 1977 | DH |
3.284 | 169.66 | crystaline, I | liquid | Haida, Suga, et al., 1977 | DH |
4.2505 | 138.7 | crystaline, II | crystaline, I | Huffman, Eaton, et al., 1948 | DH |
3.2932 | 169.67 | crystaline, I | liquid | Huffman, Eaton, et al., 1948 | DH |
4.075 | 138.7 | crystaline, II | crystaline, I | Parks and Huffman, 1930 | DH |
3.289 | 169.0 | crystaline, I | liquid | Parks and Huffman, 1930 | DH |
Entropy of phase transition
ΔStrs (J/mol*K) | Temperature (K) | Initial Phase | Final Phase | Reference | Comment |
---|---|---|---|---|---|
13.2 | 112.3 | crystaline, III | crystaline, I | Haida, Suga, et al., 1977 | DH |
30.52 | 138.63 | crystaline, II | crystaline, I | Haida, Suga, et al., 1977 | DH |
19.36 | 169.66 | crystaline, I | liquid | Haida, Suga, et al., 1977 | DH |
30.65 | 138.7 | crystaline, II | crystaline, I | Huffman, Eaton, et al., 1948 | DH |
19.41 | 169.67 | crystaline, I | liquid | Huffman, Eaton, et al., 1948 | DH |
29.38 | 138.7 | crystaline, II | crystaline, I | Parks and Huffman, 1930 | DH |
19.46 | 169.0 | crystaline, I | liquid | Parks and Huffman, 1930 | DH |

Henry's Law data

Data compiled by: Rolf Sander
Henry's Law constant (water solution)
kH(T) = k°H exp(d(ln(kH))/d(1/T) ((1/T) - 1/(298.15 K)))
k°H = Henry's law constant for solubility in water at 298.15 K (mol/(kg*bar))
d(ln(kH))/d(1/T) = Temperature dependence constant (K)
k°H (mol/(kg*bar)) | d(ln(kH))/d(1/T) (K) | Method | Reference | Comment |
---|---|---|---|---|
0.026 | M | N/A | ||
0.022 | Q | N/A | missing citation give several references for the Henry's law constants but don't assign them to specific species. | |
0.022 | V | N/A |

References

Steele, Chirico, et al., 1996
Steele, W.V.; Chirico, R.D.; Knipmeyer, S.E.; Nguyen, A.; Smith, N.K.; Tasker, I.R.,
Thermodynamic properties and ideal-gas enthalpies of formation for cyclohexene, phthalan (2,5-dihydrobenzo-3,4-furan), isoxazole, octylamine, dioctylamine, trioctylamine, phenyl isocyanate, and 1,4,5,6-tetrahydropyrimidine,
J. Chem. Eng. Data, 1996, 41, 1269-1284. [all data]
Good and Smith, 1969
Good, W.D.; Smith, N.K.,
Enthalpies of combustion of toluene, benzene, cyclohexane, cyclohexene, methylcyclopentane, 1-methylcyclopentene, and n-hexane,
J. Chem. Eng. Data, 1969, 14, 102-106. [all data]
Labbauf and Rossini, 1961
Labbauf, A.; Rossini, F.D.,
Heats of combustion, formation, and hydrogenation of 14 selected cyclomonoolefin hydrocarbons,
J. Phys. Chem., 1961, 65, 476-480. [all data]
Epstein, Pitzer, et al., 1949
Epstein, M.B.; Pitzer, K.S.; Rossini, F.D.,
Heats, equilibrium constants, and free energies of formation of cyclopentene and cyclohexene,
J. Res. NBS, 1949, 42, 379-382. [all data]
Beckett C.W., 1948
Beckett C.W.,
The thermodynamic properties and molecular structure of cyclopentene and cyclohexene,
J. Am. Chem. Soc., 1948, 70, 4227-4230. [all data]
Dorofeeva O.V., 1986
Dorofeeva O.V.,
Thermodynamic properties of twenty-one monocyclic hydrocarbons,
J. Phys. Chem. Ref. Data, 1986, 15, 437-464. [all data]
Montgomery J.B., 1942
Montgomery J.B.,
The heat capacity of organic vapors. IV. Benzene, fluorobenzene, toluene, cyclohexane, methylcyclohexane and cyclohexene,
J. Am. Chem. Soc., 1942, 64, 2375-2377. [all data]
Lenz T.G., 1990
Lenz T.G.,
Force field calculation of equilibrium thermodynamic properties: Diels-Alder reaction of 1,3-butadiene and ethylene and Diels-Alder dimerization of 1,3-butadiene,
J. Comput. Chem., 1990, 11, 351-360. [all data]
Lee and Squires, 1986
Lee, R.E.; Squires, R.R.,
Anionic homoaromaticity: A gas phase experimental study,
J. Am. Chem. Soc., 1986, 105, 5078. [all data]
Li and Stone, 1989
Li, X.; Stone, J.A.,
Determination of the beta silicon effect from a mass spectrometric study of the association of trimethylsilylium ion with alkenes,
J. Am. Chem. Soc., 1989, 111, 15, 5586, https://doi.org/10.1021/ja00197a013
. [all data]
Deakyne and Meot-Ner (Mautner), 1985
Deakyne, C.A.; Meot-Ner (Mautner), M.,
Unconventional Ionic Hydrogen Bonds. 2. NH+ pi. Complexes of Onium Ions with Olefins and Benzene Derivatives,
J. Am. Chem. Soc., 1985, 107, 2, 474, https://doi.org/10.1021/ja00288a034
. [all data]
Wiberg, Wasserman, et al., 1985
Wiberg, K.B.; Wasserman, D.J.; Martin, E.J.; Murcko, M.A.,
Enthalpies of hydration of alkenes. 3. Cycloalkenes,
J. Am. Chem. Soc., 1985, 107, 6019-6022. [all data]
Lister, 1941
Lister, M.W.,
Heats of organic reactions. X. Heats of bromination of cyclic olefins,
J. Am. Chem. Soc., 1941, 63, 143-149. [all data]
Hunter and Lias, 1998
Hunter, E.P.; Lias, S.G.,
Evaluated Gas Phase Basicities and Proton Affinities of Molecules: An Update,
J. Phys. Chem. Ref. Data, 1998, 27, 3, 413-656, https://doi.org/10.1063/1.556018
. [all data]
Kimura, Katsumata, et al., 1981
Kimura, K.; Katsumata, S.; Achiba, Y.; Yamazaki, T.; Iwata, S.,
Ionization energies, Ab initio assignments, and valence electronic structure for 200 molecules
in Handbook of HeI Photoelectron Spectra of Fundamental Organic Compounds, Japan Scientific Soc. Press, Tokyo, 1981. [all data]
Bieri, Burger, et al., 1977
Bieri, G.; Burger, F.; Heilbronner, E.; Maier, J.P.,
Valence ionization enrgies of hydrocarbons,
Helv. Chim. Acta, 1977, 60, 2213. [all data]
Lossing and Traeger, 1975
Lossing, F.P.; Traeger, J.C.,
Stabilization in cyclopentadienyl, cyclopentenyl, and cyclopentyl cations,
J. Am. Chem. Soc., 1975, 97, 1579. [all data]
Rang, Paldoia, et al., 1974
Rang, S.; Paldoia, P.; Talvari, A.,
Ionization potentials of unsaturated hydrocarbons. 2. Mono-substituted cyclopentenes and cyclohexenes,
Eesti. NSV Tead. Akad. Toim., 1974, 354. [all data]
Praet, 1970
Praet, M.-Th.,
Ionisation et dissociation du 1-methyl-cyclopentene, du methylenecyclopentane et de quelques isomeres par impact d'electrons et de photons,
Org. Mass Spectrom., 1970, 4, 65. [all data]
Lewis and Hamill, 1970
Lewis, D.; Hamill, W.H.,
Excited states of neutral molecular fragments from appearance potentials by electron impact in a mass spectrometer,
J. Chem. Phys., 1970, 52, 6348. [all data]
Demeo and Yencha, 1970
Demeo, D.A.; Yencha, A.J.,
Photoelectron spectra of bicyclic and exocyclic olefins,
J. Chem. Phys., 1970, 53, 4536. [all data]
Demeo and El-Sayed, 1970
Demeo, D.A.; El-Sayed, M.A.,
Ionization potential and structure of olefins,
J. Chem. Phys., 1970, 52, 2622. [all data]
Bischof and Heilbronner, 1970
Bischof, P.; Heilbronner, E.,
Photoelektron-Spektren von Cycloalkenen und Cycloalkadienen,
Helv. Chim. Acta, 1970, 53, 1677. [all data]
Winters and Collins, 1969
Winters, R.E.; Collins, J.H.,
Mass spectrometric studies of structural isomers. II.Mono- and bicyclic C6H10 molecules,
Org. Mass Spectrom., 1969, 2, 299. [all data]
Watanabe, 1957
Watanabe, K.,
Ionization potentials of some molecules,
J. Chem. Phys., 1957, 26, 542. [all data]
Lambert, Xue, et al., 1986
Lambert, J.B.; Xue, L.; Bosch, R.J.; Taba, K.M.; Marko, D.E.; Urano, S.; LeBreton, P.R.,
Through space interactions of double bonds by photoelectron spectroscopy,
J. Am. Chem. Soc., 1986, 108, 7575. [all data]
Kobayashi, 1978
Kobayashi, T.,
A new rule for photoelectron angular distributions of molecules,
Phys. Lett. A, 1978, 69, 31. [all data]
Hentrich, Gunkel, et al., 1974
Hentrich, G.; Gunkel, E.; Klessinger, M.,
Photoelektronenspektren organischer verbindungen. 4. Photoelektronenspektren ungesattigter carbonylverbindungen,
J. Mol. Struct., 1974, 21, 231. [all data]
Clary, Lewis, et al., 1974
Clary, D.C.; Lewis, A.A.; Morland, D.; Murrell, J.N.; Heilbronner, E.,
Ionization potentials of cycloalkenes,
J. Chem. Soc. Faraday Trans. 2, 1974, 70, 1889. [all data]
Asmus and Klessinger, 1974
Asmus, P.; Klessinger, M.,
Photoelectron spectra of organic compounds. VI. Exocyclic methylene compounds,
Tetrahedron, 1974, 30, 2477. [all data]
Lossing and Traeger, 1975, 2
Lossing, F.P.; Traeger, J.C.,
Free radicals by mass spectrometry XLVI. Heats of formation of C5H7 and C5H9 radicals and cations.,
J. Am. Chem. Soc., 1975, 19, 9. [all data]
Dallos, Sisak, et al., 2000
Dallos, A.; Sisak, A.; Kulcsár, Z.; Kováts, E.,
Pair-wise interactions by gas chromatography VII. Interaction free enthalpies of solutes with secondary alcohol groups,
J. Chromatogr. A, 2000, 904, 2, 211-242, https://doi.org/10.1016/S0021-9673(00)00908-0
. [all data]
Aflalaye, Sternberg, et al., 1995
Aflalaye, A.; Sternberg, R.; Raulin, F.; Vidal-Madjar, C.,
Gas chromatography of Titan's atmosphere. VI. Analysis of low-molecular-mass hydrocarbons and nitriles with BPX5 capillary columns,
J. Chromatogr. A, 1995, 708, 2, 283-291, https://doi.org/10.1016/0021-9673(95)00410-O
. [all data]
Do and Raulin, 1992
Do, L.; Raulin, F.,
Gas chromatography of Titan's atmosphere. III. Analysis of low-molecular-weight hydrocarbons and nitriles with a CP-Sil-5 CB WCOT capillary column,
J. Chromatogr., 1992, 591, 1-2, 297-301, https://doi.org/10.1016/0021-9673(92)80247-R
. [all data]
Reddy, Dutoit, et al., 1992
Reddy, K.S.; Dutoit, J.-Cl.; Kovats, E. sz.,
Pair-wise interactions by gas chromatography. I. Interaction free enthalpies of solutes with non-associated primary alcohol groups,
J. Chromatogr., 1992, 609, 1-2, 229-259, https://doi.org/10.1016/0021-9673(92)80167-S
. [all data]
Diez, Guillen, et al., 1990
Diez, M.A.; Guillen, M.D.; Blanco, C.G.; Bermejo, J.,
Chromatographic study of methylcyclopentadiene dimers and iso-dimers and determination of their boiling points,
J. Chromatogr., 1990, 508, 363-374, https://doi.org/10.1016/S0021-9673(00)91279-2
. [all data]
Bermejo, Blanco, et al., 1987
Bermejo, J.; Blanco, C.G.; Diez, M.A.; Guillén, M.D.,
Kováts retention indices of selected mono and polycyclic olefins,
J. Hi. Res. Chromatogr. Chromatogr. Comm., 1987, 10, 8, 461-463, https://doi.org/10.1002/jhrc.1240100809
. [all data]
Engewald, Billing, et al., 1987
Engewald, W.; Billing, U.; Welsch, T.; Haufe, G.,
Structure-retention correlations of hydrocarbons in gas-liquid and gas-solid chromatography. Cycloalkenes and cycloalkadienes,
Chromatographia, 1987, 23, 8, 590-594, https://doi.org/10.1007/BF02324870
. [all data]
Lubeck and Sutton, 1984
Lubeck, A.J.; Sutton, D.L.,
Kovats Retention Indices of Selected Olefins on Bonded Phase Fused Silica Capillaries,
J. Hi. Res. Chromatogr. Chromatogr. Comm., 1984, 7, 9, 542-544, https://doi.org/10.1002/jhrc.1240070913
. [all data]
Tiess, 1984
Tiess, D.,
Gaschromatographische Retentionsindices von 125 leicht- bis mittelflüchtigen organischen Substanzen toxikologisch-analytischer Relevanz auf SE-30,
Wiss. Z. Wilhelm-Pieck-Univ. Rostock Math. Naturwiss. Reihe, 1984, 33, 6-9. [all data]
Winskowski, 1983
Winskowski, J.,
Gaschromatographische Identifizierung von Stoffen anhand von Indexziffem und unterschiedlichen Detektoren,
Chromatographia, 1983, 17, 3, 160-165, https://doi.org/10.1007/BF02271041
. [all data]
Bredael, 1982
Bredael, P.,
Retention indices of hydrocarbons on SE-30,
J. Hi. Res. Chromatogr. Chromatogr. Comm., 1982, 5, 6, 325-328, https://doi.org/10.1002/jhrc.1240050610
. [all data]
Albaigés and Guardino, 1980
Albaigés, J.; Guardino, X.,
Gas chromatographic-mass spectrometric identification of alkylcyclohexanes and cyclohexenes,
Chromatographia, 1980, 13, 12, 755-762, https://doi.org/10.1007/BF02265555
. [all data]
Morishita, Okano, et al., 1980
Morishita, F.; Okano, T.; Kojima, T.,
Retention indices of monocyclic monoterpene hydrocarbons,
Bunseki Kagaku, 1980, 29, 1, 48-53, https://doi.org/10.2116/bunsekikagaku.29.48
. [all data]
Nabivach and Kirilenko, 1980
Nabivach, V.M.; Kirilenko, A.V.,
Relationship between the gas chromatographic behaviour and the molecular structure of hydrocarbon samples and various stationary phases. Part II. Correlation between the retention index, physicochemical properties and molecular structure,
Chromatographia, 1980, 13, 2, 93-100, https://doi.org/10.1007/BF02263060
. [all data]
Bajus, Veselý, et al., 1979
Bajus, M.; Veselý, V.; Leclercq, P.A.; Rijks, J.A.,
Steam cracking of hydrocarbons. 2. Pyrolysis of methylcyclohexane,
Ind. Eng. Chem. Prod. Res. Dev., 1979, 18, 2, 135-142, https://doi.org/10.1021/i360070a012
. [all data]
Bogoslovsky, Anvaer, et al., 1978
Bogoslovsky, Yu.N.; Anvaer, B.I.; Vigdergauz, M.S.,
Chromatographic constants in gas chromatography (in Russian), Standards Publ. House, Moscow, 1978, 192. [all data]
Rang, Orav, et al., 1977
Rang, S.; Orav, A.; Kuningas, K.; Eisen, O.,
Capillary Gas Chromatography of Monosubstituted Cyclopentenes and Cyclohexenes,
Chromatographia, 1977, 10, 3, 115-122, https://doi.org/10.1007/BF02297862
. [all data]
Lulova, Leont'eva, et al., 1976
Lulova, N.I.; Leont'eva, S.A.; Timofeeva, A.N.,
Gas-chromatographic method of determination of individual hydrocarbons in catalytic cracking gasolines
in Proceedings of All-Union Research Institute on Oil Processes. Vol.18, All-Union Research Institute on Oil Processes, Moscow, 1976, 30-53. [all data]
Lulova, Leont'eva, et al., 1975
Lulova, N.I.; Leont'eva, S.A.; Fedosova, A.K.; Kvasova, V.A.,
Individual composition of hydrocarbons in naphthas from secondary processes,
Chem. Technol. Fuels Oils (Engl. Transl.), 1975, 11, 1/2, 59-64, https://doi.org/10.1007/BF00717315
. [all data]
Engewald, Epsch, et al., 1974
Engewald, W.; Epsch, K.; Graefe, J.; Welsch, Th.,
Molekülstruktur und retentionsverhalten. II. Retentionsverhalten cycloaliphatischer kohlenwasser-stoffe bei der gas-adsorptions- und gas-verteilungschromatographie,
J. Chromatogr., 1974, 91, 623-631, https://doi.org/10.1016/S0021-9673(01)97943-9
. [all data]
Agr, Tesaric, et al., 1973
Agr, X.X.; Tesaric, K.; Janak, J.,
Will be entered later,
J. Chromatogr., 1973, 95, 207-215. [all data]
Besson and Gäumann, 1973
Besson, R.; Gäumann, T.,
Indices de rétention de cycloalcanes, cycloalcènes, bicycloalkyles, cycloalkyl-cycloalcényles et bicycloalcényles en chromatographie en phase gazeuse,
Helv. Chim. Acta, 1973, 56, 3, 1159-1164, https://doi.org/10.1002/hlca.19730560339
. [all data]
Agrawal, Tesarík, et al., 1972
Agrawal, B.B.; Tesarík, K.; Janák, J.,
Gas chromatographic characterization of sulphur compounds in the 93-162° gasoline cut from Romashkino crude oil using Kováts retention indices,
J. Chromatogr., 1972, 65, 1, 207-215, https://doi.org/10.1016/S0021-9673(00)86933-2
. [all data]
Eisen, Orav, et al., 1972
Eisen, O.; Orav, A.; Rang, S.,
Identifizierung von Normal-Alkenen, Cyclopentenen und -Hexenen mittels Kapillar-Gas-Chromatographie. Identification des alcènes, cyclopentènes et -hexènes à l'aide de la chromatogrpahie en phase gazeuse sur colonne capillaire,
Chromatographia, 1972, 5, 11, 229-239, https://doi.org/10.1007/BF02270600
. [all data]
Orav and Eisen, 1972
Orav, A.; Eisen, O.,
The retention indexes for alkenes, alkynes and cyclenes on capillary columns,
Izv. Akad. Nauk Est. SSR, Khim. Geol., 1972, 21, 1, 39-47. [all data]
Robinson and Odell, 1971
Robinson, P.G.; Odell, A.L.,
A system of standard retention indices and its uses. The characterisation of stationary phases and the prediction of retention indices,
J. Chromatogr., 1971, 57, 1-10, https://doi.org/10.1016/0021-9673(71)80001-8
. [all data]
Wagaman and Smith, 1971
Wagaman, K.L.; Smith, T.G.,
Use of hydrocarbons as carrier gases in GLC,
J. Chromatogr. Sci., 1971, 9, 4, 241-244, https://doi.org/10.1093/chromsci/9.4.241
. [all data]
Hively and Hinton, 1968
Hively, R.A.; Hinton, R.E.,
Variation of the retention index with temperature on squalane substrates,
J. Gas Chromatogr., 1968, 6, 4, 203-217, https://doi.org/10.1093/chromsci/6.4.203
. [all data]
Schomburg, 1966
Schomburg, G.,
Gaschromatographische Retentionsdaten und struktur chemischer verbindungen. III. Alkylverzweigte und ungesättigte cyclische Kohlenwasserstoffe,
J. Chromatogr., 1966, 23, 18-41, https://doi.org/10.1016/S0021-9673(01)98653-4
. [all data]
Wehrli and Kováts, 1959
Wehrli, A.; Kováts, E.,
Gas-chromatographische Charakterisierung ogranischer Verbindungen. Teil 3: Berechnung der Retentionsindices aliphatischer, alicyclischer und aromatischer Verbindungen,
Helv. Chim. Acta, 1959, 7, 7, 2709-2736, https://doi.org/10.1002/hlca.19590420745
. [all data]
Hayes and Pitzer, 1982
Hayes, P.C., Jr.; Pitzer, E.W.,
Characterizing petroleum- and shale-derived jet fuel distillates via temperature-programmed Kováts indices,
J. Chromatogr., 1982, 253, 179-198, https://doi.org/10.1016/S0021-9673(01)88376-X
. [all data]
Haagen-Smit Laboratory, 1997
Haagen-Smit Laboratory,
Procedure for the detailed hydrocarbon analysis of gasolines by single column high efficiency (capillary) column gas chromatography, SOP NO. MLD 118, Revision No. 1.1, California Environmental Protection Agency, Air Resources Board, El Monte, California, 1997, 22. [all data]
Hoekman, 1993
Hoekman, S.K.,
Improved gas chromatography procedure for speciated hydrocarbon measurements of vehicle emissions,
J. Chromatogr., 1993, 639, 2, 239-253, https://doi.org/10.1016/0021-9673(93)80260-F
. [all data]
Rang, Orav, et al., 1988
Rang, S.A.; Orav, A.E.; Kuningas, K.R.; Meister, A.E.; Strense, T.V.; Eisen, O.G.,
Gas-Chromatographic Characteristics of unsaturated hydrocarbons, Academy of Sciences of Estonia SSR, Tallinn, Estonia SSR, 1988, 208. [all data]
Osorio, Alarcon, et al., 2006
Osorio, C.; Alarcon, M.; Moreno, C.; Bonilla, A.; Barrios, J.; Garzon, C.; Duque, C.,
Characterization of Odor-Active Volatiles in Champa ( Campomanesia lineatifolia R. P.),
J. Agric. Food Chem., 2006, 54, 2, 509-516, https://doi.org/10.1021/jf052098c
. [all data]
Ádámová, Orinák, et al., 2005
Ádámová, M.; Orinák, A.; Halás, L.,
Retention indices as identification tool in pyrolysis-capillary gas chromatography,
J. Chromatogr. A, 2005, 1087, 1-2, 131-141, https://doi.org/10.1016/j.chroma.2005.01.003
. [all data]
Song, Lai, et al., 2003
Song, C.; Lai, W.-C.; Madhusudan Reddy, K.; Wei, B.,
Chapter 7. Temperature-programmed retention indices for GC and GC-MS of hydrocarbon fuels and simulated distillation GC of heavy oils
in Analytical advances for hydrocarbon research, Hsu,C.S., ed(s)., Kluwer Academic/Plenum Publishers, New York, 2003, 147-193. [all data]
Lai and Song, 1995
Lai, W.-C.; Song, C.,
Temperature-programmed retention indices for g.c. and g.c.-m.s. analysis of coal- and petroleum-derived liquid fuels,
Fuel, 1995, 74, 10, 1436-1451, https://doi.org/10.1016/0016-2361(95)00108-H
. [all data]
White, Douglas, et al., 1992
White, C.M.; Douglas, L.J.; Hackett, J.P.; Anderson, R.R.,
Characterization of synthetic gasoline from the chloromethane-zeolite reaction,
Energy Fuels, 1992, 6, 1, 76-82, https://doi.org/10.1021/ef00031a012
. [all data]
Buchman, Cao, et al., 1984
Buchman, O.; Cao, G.-Y.; Peng, C.T.,
Structure assignment by retention index in gas-liquid radiochromatography of substituted cyclohexenes,
J. Chromatogr., 1984, 312, 75-90, https://doi.org/10.1016/S0021-9673(01)92765-7
. [all data]
Hayes and Pitzer, 1981
Hayes, P.C., Jr.; Pitzer, E.W.,
Kovats indices as a tool in characterizing hydrocarbon fuels in temperature programmed glass capillary gas chromatography. Part 1. Qualitative identification, Inhouse rpt. for Air Force Wright Aeronautical Labs., Air Force Wright Aeronautical Labs., Wright-Patterson AFB, Ohio, 1981, 75. [all data]
Peng, Ding, et al., 1988
Peng, C.T.; Ding, S.F.; Hua, R.L.; Yang, Z.C.,
Prediction of Retention Indexes I. Structure-Retention Index Relationship on Apolar Columns,
J. Chromatogr., 1988, 436, 137-172, https://doi.org/10.1016/S0021-9673(00)94575-8
. [all data]
Dufka, Malinsky, et al., 1971
Dufka, O.; Malinsky, J.; Vladyka, J.,
Sorpcni materialy pro plynovou chromatographii - III,
Chemicky promysl., 1971, 21/46, 9, 459-463. [all data]
Ferrand, 1962
Ferrand, R.,
Gas phase chromatography using retention indices for the analysis of tars and their hydrogenation products,
Journees internationales d'etude des methodes de separation immediate at de chromatographie; Org. sur l'initiative du IX., 1962, 132-140. [all data]
Bramston-Cook, 2013
Bramston-Cook, R.,
Kovats indices for C2-C13 hydrocarbons and selected oxygenated/halocarbons with 100 % dimethylpolysiloxane columns, 2013, retrieved from http://lotusinstruments.com/monographs/List .... [all data]
Supelco, 2012
Supelco, CatalogNo. 24160-U,
Petrocol DH Columns. Catalog No. 24160-U, 2012, retrieved from http://www.sigmaaldrich.com/etc/medialib/docs/Supelco/Datasheet/1/w97949.Par.0001.File.tmp/w97949.pdf. [all data]
Zenkevich, Eliseenkov, et al., 2009
Zenkevich, I.G.; Eliseenkov, E.V.; Kasatochkin, A.N.,
Chromatographic Identification of Cyclohexane Chlorination Products by an Additive Scheme for the Prediction of Retention Indices,
Chromatographia, 2009, 70, 5/6, 839-849, https://doi.org/10.1365/s10337-009-1213-x
. [all data]
Zhang, Ding, et al., 2009
Zhang, X.; Ding, L.; Sun, Z.; Song, L.; Sun, T.,
Study on quantitative structure-retention relationships for hydrocarbons in FCC gasoline,
Chromatographia, 2009, 70, 3/4, 511-518, https://doi.org/10.1365/s10337-009-1174-0
. [all data]
Health Safety Executive, 2000
Health Safety Executive,
MDHS 96 Volatile organic compounds in air - Laboratory method using pumed solid sorbent tubes, solvent desorption and gas chromatography
in Methods for the Determination of Hazardous Substances (MDHS) guidance, Crown, Colegate, Norwich, 2000, 1-24, retrieved from http://www.hse.gov.uk/pubns/mdhs/pdfs/mdhs96.pdf. [all data]
Orav, Kailas, et al., 1999
Orav, A.; Kailas, T.; Muurisepp, M.; Kann, J.,
Composition of the oil from waste tires. 1. Fraction boiling at yp to 160 0C,
Proc. Estonian Acad. Sci. Chem., 1999, 48, 1, 30-39. [all data]
Chupalov and Zenkevich, 1996
Chupalov, A.A.; Zenkevich, I.G.,
Chromatographic Characterization of Structural Transformations of Organic Compounds in Diels-Alder Reaction. Aliphatic Dienes and Dienophyls,
Zh. Org. Khim., 1996, 32, 6, 675-684. [all data]
Ramnas, Ostermark, et al., 1994
Ramnas, O.; Ostermark, U.; Peterson, G.,
Characterization of sixty alkenes in a cat-cracked gasoline naphtha by gas chromatography,
Chromatographia, 1994, 38, 3/4, 222-226, https://doi.org/10.1007/BF02290340
. [all data]
Zenkevich and Kulikova, 1993
Zenkevich, I.G.; Kulikova, S.N.,
GC-MS Analysis of Products of Reactions of Unsaturated Compounds with Dimethyl Disulfide for Determination of Position of Double Bonds C=C,
Vestnik St. Petersburg University. Ser. phys-khim., 1993, 2, 59-69. [all data]
Dahlmann, Köser, et al., 1979
Dahlmann, G.; Köser, H.J.K.; Oelert, H.H.,
Multiple korrelation von retentionsindizes,
Chromatographia, 1979, 12, 10, 665-671, https://doi.org/10.1007/BF02302943
. [all data]
Chen, 2008
Chen, H.-F.,
Quantitative prediction of gas chromatography retention indices with support vector machines, radial basis neutral networks and multiple linear regression,
Anal. Chim. Acta, 2008, 609, 1, 24-36, https://doi.org/10.1016/j.aca.2008.01.003
. [all data]
Luo and Agnew, 2001
Luo, J.; Agnew, M.P.,
Gas characteristics before and after biofiltration treating odorous emissions from animal rendering processes,
Environ. Technol., 2001, 22, 9, 1091-1103, https://doi.org/10.1080/09593332208618220
. [all data]
Zenkevich, 2000
Zenkevich, I.G.,
Mutual Correlation between Gas Chromatographic Retention Indices of Unsaturated and Saturated Hydrocarbons found by Molecular Dynamics,
Z. Anal. Chem., 2000, 55, 10, 1091-1097. [all data]
Flanagan, Streete, et al., 1997
Flanagan, R.J.; Streete, P.J.; Ramsey, J.D.,
Volatile Substance Abuse, UNODC Technical Series, No 5, United Nations, Office on Drugs and Crime, Vienna International Centre, PO Box 500, A-1400 Vienna, Austria, 1997, 56, retrieved from http://www.odccp.org/pdf/technicalseries1997-01-011.pdf. [all data]
Zenkevich, Chupalov, et al., 1996
Zenkevich, I.G.; Chupalov, A.A.; Herzschuh, R.,
Correlation of the Increments of Gas Chromatographic Retention Indices with the Differences of Innermolecular Energies of Reagents and Products of Chemical Reactions,
Zh. Org. Khim. (Rus.), 1996, 32, 11, 1685-1691. [all data]
Ciccioli, Cecinato, et al., 1994
Ciccioli, P.; Cecinato, A.; Brancaleoni, E.; Brachetti, A.; Frattoni, M.; Sparapani, R.,
Composition and Distribution of Polar and Non-Polar VOCs in Urban, Rural, Forest and Remote Areas,
Eur Commission EUR, 1994, 549-568. [all data]
Strete, Ruprah, et al., 1992
Strete, P.J.; Ruprah, M.; Ramsey, J.D.; Flanagan, R.J.,
Detection and identification of volatile substances by headspace capillary gas chromatography to aid the diagnosis of acute poisoning,
Analyst, 1992, 117, 7, 1111-1127, https://doi.org/10.1039/an9921701111
. [all data]
Waggott and Davies, 1984
Waggott, A.; Davies, I.W.,
Identification of organic pollutants using linear temperature programmed retention indices (LTPRIs) - Part II, 1984, retrieved from http://dwi.defra.gov.uk/research/completed-research/reports/dwi0383.pdf. [all data]
Ramsey and Flanagan, 1982
Ramsey, J.D.; Flanagan, R.J.,
Detection and Identification of Volatile Organic Compounds in Blood by Headspace Gas Chromatography as an Aid to the Diagnosis of Solvent Abuse,
J. Chromatogr., 1982, 240, 2, 423-444, https://doi.org/10.1016/S0021-9673(00)99622-5
. [all data]
Robinson and Odell, 1971, 2
Robinson, P.G.; Odell, A.L.,
Comparison of isothermal and non-linear temperature programmed gas chromatography. The temperature dependence of the retention indices of a number of hydrocarbons on squalane and SE-30,
J. Chromatogr., 1971, 57, 11-17, https://doi.org/10.1016/0021-9673(71)80002-X
. [all data]
Peng, Yang, et al., 1991
Peng, C.T.; Yang, Z.C.; Ding, S.F.,
Prediction of rentention idexes. II. Structure-retention index relationship on polar columns,
J. Chromatogr., 1991, 586, 1, 85-112, https://doi.org/10.1016/0021-9673(91)80028-F
. [all data]