Diethyl disulfide
- Formula: C4H10S2
- Molecular weight: 122.252
- IUPAC Standard InChIKey: CETBSQOFQKLHHZ-UHFFFAOYSA-N
- CAS Registry Number: 110-81-6
- Chemical structure:
View 3d structure (requires JavaScript / HTML 5) - Other names: Disulfide, diethyl; Ethyl disulfide; Ethyldithioethane; 3,4-Dithiahexane; Diethyl disulphide; (C2H5S)2; Diethyldisulfid; Ethyl disulphide; NSC 8839; 1-(Ethyldisulfanyl)ethane

Gas phase thermochemistry data

Data compiled by: Hussein Y. Afeefy, Joel F. Liebman, and Stephen E. Stein
Quantity | Value | Units | Method | Reference | Comment |
---|---|---|---|---|---|
ΔfH°gas | -74.6 ± 3.5 | kJ/mol | Ccb | Voronkov, Klyuchnikov, et al., 1989 | |
ΔfH°gas | -74.7 ± 1.0 | kJ/mol | Ccb | Hubbard, Douslin, et al., 1958 | Reanalyzed by Cox and Pilcher, 1970, Original value = -72.9 ± 1.0 kJ/mol |

Condensed phase thermochemistry data

Data compiled as indicated in comments:
ALS - Hussein Y. Afeefy, Joel F. Liebman, and Stephen E. Stein
DH - Eugene S. Domalski and Elizabeth D. Hearing
Quantity | Value | Units | Method | Reference | Comment |
---|---|---|---|---|---|
ΔfH°liquid | -120.0 ± 3.0 | kJ/mol | Ccb | Voronkov, Klyuchnikov, et al., 1989 | ALS |
ΔfH°liquid | -120.1 ± 1.0 | kJ/mol | Ccb | Hubbard, Douslin, et al., 1958 | Reanalyzed by Cox and Pilcher, 1970, Original value = -118.3 ± 1.0 kJ/mol; ALS |
Quantity | Value | Units | Method | Reference | Comment |
ΔcH°liquid | -4087.7 ± 0.79 | kJ/mol | Ccb | Hubbard, Douslin, et al., 1958 | Reanalyzed by Cox and Pilcher, 1970, Original value = -4085.3 ± 0.79 kJ/mol; ALS |
Quantity | Value | Units | Method | Reference | Comment |
S°liquid | 305.01 | J/mol*K | N/A | Scott, Finke, et al., 1952 | DH |
Constant pressure heat capacity of liquid
Cp,liquid (J/mol*K) | Temperature (K) | Reference | Comment |
---|---|---|---|
204.01 | 298.15 | Scott, Finke, et al., 1952 | T = 13 to 300 K.; DH |

Gas phase ion energetics data

Data compiled as indicated in comments:
LLK - Sharon G. Lias, Rhoda D. Levin, and Sherif A. Kafafi
RDSH - Henry M. Rosenstock, Keith Draxl, Bruce W. Steiner, and John T. Herron
B - John E. Bartmess
Electron affinity determinations
EA (eV) | Method | Reference | Comment |
---|---|---|---|
1.9 | LPES | Carles, Lecomte, et al., 2001 | EA is Vertical Detachment Energy. Adiabtic EA estimated as bound, but only by ca 0.1 eV; B |
Ionization energy determinations
IE (eV) | Method | Reference | Comment |
---|---|---|---|
8.30 ± 0.15 | EI | Hobrock and Kiser, 1963 | RDSH |
8.27 ± 0.03 | PI | Watanabe, Nakayama, et al., 1962 | RDSH |
8.77 | PE | Guimon, Guimon, et al., 1975 | Vertical value; LLK |
8.70 | PE | Wagner and Bock, 1974 | Vertical value; LLK |
8.85 | PE | Baker, Brisk, et al., 1974 | Vertical value; LLK |
8.70 | PE | Bock, Wagner, et al., 1972 | Vertical value; LLK |
Appearance energy determinations

Reaction thermochemistry data

Data compiled by: Hussein Y. Afeefy, Joel F. Liebman, and Stephen E. Stein
Individual Reactions
By formula: C4H10S2 + C2H6S2 = 2C3H8S2
Quantity | Value | Units | Method | Reference | Comment |
---|---|---|---|---|---|
ΔrH° | 0.0 ± 0.63 | kJ/mol | Eqk | Haraldson, Olander, et al., 1960 | liquid phase; solvent: Nonpolar solvent |
By formula: C8H18S2 + C4H10S2 = 2C6H14S2
Quantity | Value | Units | Method | Reference | Comment |
---|---|---|---|---|---|
ΔrH° | 0.0 ± 0.2 | kJ/mol | Eqk | Haraldson, Olander, et al., 1960 | liquid phase; solvent: Nonpolar solvent |

Phase change data

Data compiled as indicated in comments:
BS - Robert L. Brown and Stephen E. Stein
TRC - Thermodynamics Research Center, NIST Boulder Laboratories, Chris Muzny director
AC - William E. Acree, Jr., James S. Chickos
ALS - Hussein Y. Afeefy, Joel F. Liebman, and Stephen E. Stein
DRB - Donald R. Burgess, Jr.
DH - Eugene S. Domalski and Elizabeth D. Hearing
Quantity | Value | Units | Method | Reference | Comment |
---|---|---|---|---|---|
Tboil | 425.2 | K | N/A | Aldrich Chemical Company Inc., 1990 | BS |
Tboil | 427.2 | K | N/A | Weast and Grasselli, 1989 | BS |
Tboil | 427.2 | K | N/A | Majer and Svoboda, 1985 | |
Tboil | 427. | K | N/A | Mcallan, Cullum, et al., 1951 | Uncertainty assigned by TRC = 1.5 K; TRC |
Quantity | Value | Units | Method | Reference | Comment |
Tfus | 172. | K | N/A | Mcallan, Cullum, et al., 1951 | Uncertainty assigned by TRC = 0.2 K; TRC |
Quantity | Value | Units | Method | Reference | Comment |
Ttriple | 171.64 | K | N/A | Scott, Finke, et al., 1952, 2 | Uncertainty assigned by TRC = 0.02 K; TRC |
Quantity | Value | Units | Method | Reference | Comment |
Tc | 642. | K | N/A | Majer and Svoboda, 1985 | |
Quantity | Value | Units | Method | Reference | Comment |
ΔvapH° | 10.8 ± 0.1 | kcal/mol | AVG | N/A | Average of 10 values; Individual data points |
Enthalpy of vaporization
ΔvapH (kcal/mol) | Temperature (K) | Method | Reference | Comment |
---|---|---|---|---|
8.982 | 427.2 | N/A | Majer and Svoboda, 1985 | |
10.9 | 302. | A | Stephenson and Malanowski, 1987 | Based on data from 287. to 434. K.; AC |
9.78 | 388. | EB | Stephenson and Malanowski, 1987 | Based on data from 373. to 431. K. See also Osborn and Douslin, 1966 and Scott, Finke, et al., 1952.; AC |
9.78 ± 0.03 | 373.73 | V | Scott, Finke, et al., 1952, 3 | ALS |
9.92 | 374. | EB | White, Barnard--Smith, et al., 1952 | Based on data from 359. to 433. K.; AC |
Enthalpy of vaporization
ΔvapH =
A exp(-βTr) (1 − Tr)β
ΔvapH =
Enthalpy of vaporization (at saturation pressure)
(kcal/mol)
Tr = reduced temperature (T / Tc)
View plot Requires a JavaScript / HTML 5 canvas capable browser.
Temperature (K) | A (kcal/mol) | β | Tc (K) | Reference | Comment |
---|---|---|---|---|---|
298. to 400. | 14.56 | 0.2744 | 642. | Majer and Svoboda, 1985 |
Antoine Equation Parameters
log10(P) = A − (B / (T + C))
P = vapor pressure (atm)
T = temperature (K)
View plot Requires a JavaScript / HTML 5 canvas capable browser.
Temperature (K) | A | B | C | Reference | Comment |
---|---|---|---|---|---|
373.71 to 434.03 | 4.09426 | 1485.97 | -64.192 | Osborn and Douslin, 1966 | |
273. to 353. | 4.3119 | 1605.244 | -53.643 | Scott, Finke, et al., 1952 | Coefficents calculated by NIST from author's data. |
Enthalpy of fusion
ΔfusH (kcal/mol) | Temperature (K) | Reference | Comment |
---|---|---|---|
2.2477 | 171.64 | Scott, Finke, et al., 1952 | DH |
2.2 | 171.6 | Domalski and Hearing, 1996 | AC |
Entropy of fusion
ΔfusS (cal/mol*K) | Temperature (K) | Reference | Comment |
---|---|---|---|
13.10 | 171.64 | Scott, Finke, et al., 1952 | DH |

Kovats' RI, non-polar column, isothermal

Column type | Active phase | Temperature (C) | I | Reference | Comment |
---|---|---|---|---|---|
Capillary | OV-101 | 130. | 923. | Misharina and Golovnya, 1989 | He; Column length: 50. m; Column diameter: 0.32 mm |
Packed | Apiezon M | 130. | 935. | Garbuzov, Misharina, et al., 1985 | He or N2, Chromosorb W, AW-DMCS; Column length: 2.1 m |
Packed | SE-30 | 110. | 917. | Möckel and Zolg, 1977 | Chromosorb W AW (80-100 mesh); Column length: 2. m |
Packed | DC-200 | 120. | 923. | Golovnya and Arsen'ev, 1970 | Column length: 1.5 m |
Packed | DC-200 | 60. | 901. | Golovnya and Arsen'ev, 1970 | Column length: 1.5 m |
Packed | SE-30 | 130. | 921. | Golovnya and Arsen'ev, 1970 | Column length: 1.5 m |
Packed | SE-30 | 60. | 904. | Golovnya and Arsen'ev, 1970 | Column length: 1.5 m |

Kovats' RI, polar column, isothermal

Column type | Active phase | Temperature (C) | I | Reference | Comment |
---|---|---|---|---|---|
Packed | Carbowax 20M | 110. | 1244. | Möckel and Zolg, 1977 | He, Chromosorb W AW (80-100 mesh); Column length: 6. m |

Van Den Dool and Kratz RI, non-polar column, temperature ramp

Column type | Active phase | I | Reference | Comment |
---|---|---|---|---|
Capillary | DB-5 | 932. | Mahattanatawee K., Perez-Cacho P.R., et al., 2007 | 30. m/0.32 mm/0.5 μm, He, 7. K/min, 265. C @ 5. min; Tstart: 40. C |
Capillary | OV-101 | 910. | Misharina and Golovnya, 1989 | He, 4. K/min; Column length: 50. m; Column diameter: 0.32 mm; Tstart: 50. C; Tend: 250. C |

Van Den Dool and Kratz RI, non-polar column, custom temperature program

Column type | Active phase | I | Reference | Comment |
---|---|---|---|---|
Capillary | DB-5MS | 926. | Selli, Rannou, et al., 2006 | 30. m/0.32 mm/0.5 μm, He; Program: 50C => 5C/min => 200C => 8C/min => 260C(5min) |

Van Den Dool and Kratz RI, polar column, temperature ramp

Column type | Active phase | I | Reference | Comment |
---|---|---|---|---|
Capillary | DB-Wax | 1215. | Mahattanatawee K., Perez-Cacho P.R., et al., 2007 | 30. m/0.32 mm/0.5 μm, He, 7. K/min, 240. C @ 5. min; Tstart: 40. C |
Capillary | DB-Wax | 1217. | Selli, Rannou, et al., 2006 | 30. m/0.25 mm/0.5 μm, He, 4. K/min, 260. C @ 5. min; Tstart: 50. C |
Capillary | DB-Wax | 1192. | Karagül-Yüceer, Cadwallader, et al., 2002 | 30. m/0.25 mm/0.25 μm, 35. C @ 5. min, 10. K/min, 200. C @ 30. min |
Capillary | DB-FFAP | 1192. | Karagül-Yüceer, Cadwallader, et al., 2002 | 30. m/0.25 mm/0.25 μm, 35. C @ 5. min, 10. K/min, 200. C @ 30. min |
Capillary | FFAP | 1246. | Stephan and Steinhart, 1999 | 60. m/0.25 mm/0.5 μm, 50. C @ 3. min, 5. K/min, 230. C @ 15. min |

Normal alkane RI, non-polar column, isothermal

Column type | Active phase | Temperature (C) | I | Reference | Comment |
---|---|---|---|---|---|
Packed | Apiezon L | 100. | 935. | Kavan, 1973 | Column length: 3.2 m |

Normal alkane RI, non-polar column, temperature ramp

Column type | Active phase | I | Reference | Comment |
---|---|---|---|---|
Capillary | DB-5 | 925. | Savel'eva, Zenkevich, et al., 2003 | 25. m/0.20 mm/0.33 μm, Helium, 40. C @ 1. min, 5. K/min, 270. C @ 15. min |
Capillary | RSL-200 | 911. | Jirovetz, Ngassoum, et al., 2002 | 30. m/0.32 mm/0.25 μm, H2, 50. C @ 5. min, 6. K/min, 280. C @ 5. min |
Capillary | SPB-5 | 922. | Pino, Marbot, et al., 2002 | 30. m/0.25 mm/0.25 μm, Helium, 60. C @ 2. min, 4. K/min, 250. C @ 20. min |
Capillary | DB-5 | 916. | Schlüter, Steinhart, et al., 1999 | 34. C @ 3. min, 5. K/min, 200. C @ 10. min; Phase thickness: 0.25 μm |
Capillary | DB-1 | 910. | Rapior, Breheret, et al., 1997 | 30. m/0.2 mm/0.25 μm, He, 50. C @ 2. min, 4. K/min; Tend: 200. C |
Capillary | SE-54 | 927. | Weenen, Koolhaas, et al., 1996 | 50. m/0.32 mm/1.05 μm, He, 2. K/min; Tstart: 40. C; Tend: 300. C |
Capillary | SE-54 | 933. | Weenen, Koolhaas, et al., 1996 | 50. m/0.32 mm/1.05 μm, He, 2. K/min; Tstart: 40. C; Tend: 300. C |

Normal alkane RI, non-polar column, custom temperature program

Column type | Active phase | I | Reference | Comment |
---|---|---|---|---|
Capillary | SE-30 | 910. | Vinogradov, 2004 | Program: not specified |
Capillary | SE-30 | 952. | Vinogradov, 2004 | Program: not specified |
Capillary | Apieson M | 935. | Gao, Wang, et al., 2003 | Program: not specified |
Capillary | CP Sil 5 CB | 913. | Lermusieau, Bulens, et al., 2001 | 50. m/0.32 mm/1.2 μm; Program: 36C => 20C/min => 120C(20min) => 2C/min => 250C(30min) |
Capillary | CP Sil 5 CB | 912. | Lermusieau, Bulens, et al., 2001 | 50. m/0.32 mm/1.2 μm; Program: 36C => 20C/min => 120C(20min) => 2C/min => 250C(30min) |
Capillary | CP Sil 5 CB | 910. | Gijs, Piraprez, et al., 2000 | 50. m/0.32 mm/1.2 μm, He; Program: 33C (16.5min) => 2C/min => 160C => 20C/min => 200C (9min) |
Capillary | SPB-1 | 925. | Nedjma and Maujean, 1995 | 30. m/0.32 mm/4. μm, H2; Program: 35(1)-10 -> 55-25 ->250 |
Capillary | SE-52 | 903. | van Langenhove and Schamp, 1986 | Column length: 100. m; Column diameter: 0.50 mm; Program: not specified |
Capillary | OV-1, SE-30, Methyl silicone, SP-2100, OV-101, DB-1, etc. | 903. | Waggott and Davies, 1984 | Hydrogen; Column length: 50. m; Column diameter: 0.32 mm; Program: not specified |
Packed | Apiezon M | 936. | Golovnya, Misharina, et al., 1983 | N2, Chromosorb W AW/DMCS; Column length: 5.6 m; Program: 60C(7min), 100C(7min), 150C isothermal |

Normal alkane RI, polar column, temperature ramp

Column type | Active phase | I | Reference | Comment |
---|---|---|---|---|
Capillary | Supelcowax-10 | 1197. | Chin, Nazimah, et al., 2007 | 10. m/0.1 mm/0.1 μm, He, 40. C @ 1.5 min, 50. K/min, 240. C @ 2. min |
Capillary | PEG-20M | 1210. | Narain, Almeida, et al., 2004 | 50. m/0.20 mm/0.20 μm, 40. C @ 5. min, 3. K/min, 180. C @ 30. min |
Capillary | PEG-20M | 1210. | Narain, Almeida, et al., 2004 | 50. m/0.20 mm/0.20 μm, 40. C @ 5. min, 3. K/min, 180. C @ 30. min |
Capillary | DB-Wax | 1248. | Schlüter, Steinhart, et al., 1999 | 60. m/0.32 mm/0.5 μm, He, 34. C @ 3. min, 5. K/min, 200. C @ 10. min |
Capillary | DB-Wax | 1187. | Schlüter, Steinhart, et al., 1999 | 60. m/0.32 mm/0.25 μm, He, 34. C @ 3. min, 5. K/min, 200. C @ 10. min |
Capillary | DB-Wax | 1209. | Werkhoff, Güntert, et al., 1998 | 60. m/0.32 mm/0.25 μm, H2, 3. K/min; Tstart: 60. C; Tend: 220. C |

Normal alkane RI, polar column, custom temperature program

Column type | Active phase | I | Reference | Comment |
---|---|---|---|---|
Capillary | Carbowax 20M | 1232. | Vinogradov, 2004 | Program: not specified |
Capillary | PEG-1000 | 1257. | Gao, Wang, et al., 2003 | Program: not specified |

Henry's Law data

Data compiled by: Rolf Sander
Henry's Law constant (water solution)
kH(T) = k°H exp(d(ln(kH))/d(1/T) ((1/T) - 1/(298.15 K)))
k°H = Henry's law constant for solubility in water at 298.15 K (mol/(kg*bar))
d(ln(kH))/d(1/T) = Temperature dependence constant (K)
k°H (mol/(kg*bar)) | d(ln(kH))/d(1/T) (K) | Method | Reference | Comment |
---|---|---|---|---|
0.57 | Q | N/A | missing citation give several references for the Henry's law constants but don't assign them to specific species. Value at T = 293. K. | |
0.65 | 4000. | M | N/A | |
0.47 | M | N/A | Value at T = 293. K. |

References

Voronkov, Klyuchnikov, et al., 1989
Voronkov, M.G.; Klyuchnikov, V.A.; Kolabin, S.N.; Shvets, G.N.; Varusin, P.I.; Deryagina, E.N.; Korchevin, N.A.; Tsvetnitskaya, S.I.,
Thermochemical properties of diorganyl chalcogenides and dichalcogenides RMnR(M = S, Se, Te; n = 1, 2).,
Dokl. Phys. Chem. (Engl. Transl.), 1989, 307, 650-653, In original 1139. [all data]
Hubbard, Douslin, et al., 1958
Hubbard, W.N.; Douslin, D.R.; McCullough, J.P.; Scott, D.W.; Todd, S.S.; Messerly, J.F.; Hossenlopp, I.A.; George, A.; Waddington, G.,
2,3-dithiabutane, 3,4-dithiahexane and 4,5-dithiaoctane: Chemical thermodynamic properties from 0 to 1000°K,
J. Am. Chem. Soc., 1958, 80, 3547-3554. [all data]
Cox and Pilcher, 1970
Cox, J.D.; Pilcher, G.,
Thermochemistry of Organic and Organometallic Compounds, Academic Press, New York, 1970, 1-636. [all data]
Scott, Finke, et al., 1952
Scott, D.W.; Finke, H.L.; McCullough, J.P.; Gross, M.E.; Pennington, R.E.; Waddington, G.,
3,4-Dithiahexane: heat capacity, heats of fusion and vaporization, vapor pressure, entropy, and thermodynamic functions,
J. Am. Chem. Soc., 1952, 74, 2478-2483. [all data]
Carles, Lecomte, et al., 2001
Carles, S.; Lecomte, F.; Schermann, J.P.; Desfrancois, C.; Xu, S.; Nilles, J.M.; Bowen, K.H.; Berges, J.; Houe,
Nondissociative electron capture by disulfide bonds,
J. Phys. Chem. A, 2001, 105, 23, 5622-5626, https://doi.org/10.1021/jp0040603
. [all data]
Hobrock and Kiser, 1963
Hobrock, B.G.; Kiser, R.W.,
Electron impact investigations of sulfur compounds. II. 3-Methyl-2-thiabutane, 4-thia-1-pentene, and 3,4-dithiahexane,
J. Phys. Chem., 1963, 67, 648. [all data]
Watanabe, Nakayama, et al., 1962
Watanabe, K.; Nakayama, T.; Mottl, J.,
Ionization potentials of some molecules,
J. Quant. Spectry. Radiative Transfer, 1962, 2, 369. [all data]
Guimon, Guimon, et al., 1975
Guimon, M.-F.; Guimon, C.; Pfister-Guillouzo, G.,
Application of photoelectron spectroscopy to conformational analysis of 1,2,4-trithiolanes,
Tetrahedron Lett., 1975, 7, 441. [all data]
Wagner and Bock, 1974
Wagner, G.; Bock, H.,
Photoelektronenspektren und molekuleigenschaften, XXVI. Die delokalisation von schwefel-elektronenpaaren in alkylsulfiden und -disulfiden,
Chem. Ber., 1974, 107, 68. [all data]
Baker, Brisk, et al., 1974
Baker, A.D.; Brisk, M.; Gellender, M.,
Photoelectron spectra and dihedral angles of disulfides,
J. Electron Spectrosc. Relat. Phenom., 1974, 3, 227. [all data]
Bock, Wagner, et al., 1972
Bock, H.; Wagner, G.; Kroner, J.,
Photoelektronenspektren und molekuleigenschaften, XIV. Die delokalisation des schwefel-elektronenpaar in CH3S-substituierten aromaten,
Chem. Ber., 1972, 105, 3850. [all data]
Gal'perin, Bogolyubov, et al., 1969
Gal'perin, Ya.V.; Bogolyubov, G.M.; Grishin, N.N.; Petrov, A.A.,
Organic derivatives of elements of groups V and VI. VI. Mass spectra of compounds with S-S bonds,
Zh. Obshch. Khim., 1969, 39, 1599, In original 1567. [all data]
Gowenlock, Kay, et al., 1963
Gowenlock, B.G.; Kay, J.; Majer, J.R.,
Electron impact studies of some sulphides and disulphides,
J. Chem. Soc. Faraday Trans., 1963, 59, 2463. [all data]
Keyes and Harrson, 1968
Keyes, B.G.; Harrson, A.G.,
The fragmentation of aliphatic sulfur compounds by electron impact,
J. Am. Chem. Soc., 1968, 90, 5671. [all data]
Kiser and Hobrock, 1962
Kiser, R.W.; Hobrock, B.G.,
The ionization potential of hydrogen disulfide (H2S2),
J. Phys. Chem., 1962, 66, 1214. [all data]