Bis(η8-cyclooctatetraene)uranium
- Formula: C16H16U
- Molecular weight: 446.3271
- CAS Registry Number: 11079-26-8

Gas phase thermochemistry data

Data compiled by: José A. Martinho Simões
Quantity | Value | Units | Method | Reference | Comment |
---|---|---|---|---|---|
ΔfH°gas | 104.9 ± 3.2 | kcal/mol | Review | Martinho Simões | |
ΔfH°gas | 65.5 ± 5.0 | kcal/mol | Review | Martinho Simões |

Condensed phase thermochemistry data

Data compiled by: José A. Martinho Simões
Quantity | Value | Units | Method | Reference | Comment |
---|---|---|---|---|---|
ΔfH°solid | 77.9 ± 3.1 | kcal/mol | Review | Martinho Simões | |
ΔfH°solid | 31.5 ± 4.6 | kcal/mol | Review | Martinho Simões | |
Quantity | Value | Units | Method | Reference | Comment |
ΔcH°solid | -2368. ± 4.5 | kcal/mol | CC-SB | Kuznetsov, Kir'yanov, et al., 1986 | |
ΔcH°solid | -2414.0 ± 3.0 | kcal/mol | CC-SB | Tel'noi, Rabinovich, et al., 1979 |

Gas phase ion energetics data

Data compiled as indicated in comments:
LBLHLM - Sharon G. Lias, John E. Bartmess, Joel F. Liebman, John L. Holmes, Rhoda D. Levin, and W. Gary Mallard
LLK - Sharon G. Lias, Rhoda D. Levin, and Sherif A. Kafafi
Ionization energy determinations
IE (eV) | Method | Reference | Comment |
---|---|---|---|
6.15 | PE | Bruno, Ciliberto, et al., 1982 | Vertical value; LBLHLM |
6.15 | PE | Fragala, Condorelli, et al., 1976 | Vertical value; LLK |
6.20 | PE | Clark and Green, 1976 | Vertical value; LLK |

Phase change data

Data compiled as indicated in comments:
MS - José A. Martinho Simões
AC - William E. Acree, Jr., James S. Chickos
Quantity | Value | Units | Method | Reference | Comment |
---|---|---|---|---|---|
ΔsubH° | 34. ± 2. | kcal/mol | CC-SB | Kuznetsov, Kir'yanov, et al., 1986 | Another value for the enthalpy of sublimation has been reported: 27.0 ± 1.0 kcal/mol Bedford, 1977 Tel'noi, Rabinovich, et al., 1979; MS |
ΔsubH° | 27.3 ± 1.1 | kcal/mol | N/A | Tel'noi, Rabinovich, et al., 1979, 2 | See also Bedford, 1977, 2.; AC |
ΔsubH° | 27.0 ± 1.0 | kcal/mol | CC-SB | Bedford, 1977 | Please also see Tel'noi, Rabinovich, et al., 1979. Another value for the enthalpy of sublimation has been reported: 34. ± 2. kcal/mol Kuznetsov, Kir'yanov, et al., 1986; MS |
Enthalpy of sublimation
ΔsubH (kcal/mol) | Temperature (K) | Reference | Comment |
---|---|---|---|
25.79 ± 0.79 | 400. to 500. | Tel'noi, Rabinovich, et al., 1979, 2 | See also Bedford, 1977, 2.; AC |

References

Martinho Simões
Martinho Simões, J.A.,
Private communication (see http://webbook.nist.gov/chemistry/om/). [all data]
Kuznetsov, Kir'yanov, et al., 1986
Kuznetsov, N.T.; Kir'yanov, K.V.; Mitin, V.A.; Sevast'yanov, V.G.; Bogdanov, V.A.,
Radiokhimiya, 1986, 28, 709. [all data]
Tel'noi, Rabinovich, et al., 1979
Tel'noi, V.I.; Rabinovich, I.B.; Leonov, M.R.; Solov'eva, G.V.; Gramoteeva, N.I.,
Dokl. Akad. Nauk SSSR, 1979, 245, 1430. [all data]
Bruno, Ciliberto, et al., 1982
Bruno, G.; Ciliberto, E.; Fischer, R.D.; Fragala, I.; Spieg, A.W.,
Photoelectron spectroscopy of f-element organometallic complexes. 5. Comparative study of ring-substituted uranocenes,
Organometallics, 1982, 1, 1060. [all data]
Fragala, Condorelli, et al., 1976
Fragala, I.; Condorelli, G.; Zanella, P.; Tondello, E.,
Photoelectron spectroscopy of actinide organometallic compounds I. Bis (cyclooctatetraene)actinide(IV) complexes,
J. Organomet. Chem., 1976, 122, 357. [all data]
Clark and Green, 1976
Clark, J.P.; Green, J.C.,
The He-I photoelectron spectra of uranocene and thorocene,
J. Organomet. Chem., 1976, 112, 14. [all data]