Ethanol, 2-(ethylamino)-
- Formula: C4H11NO
- Molecular weight: 89.1362
- IUPAC Standard InChIKey: MIJDSYMOBYNHOT-UHFFFAOYSA-N
- CAS Registry Number: 110-73-6
- Chemical structure:
View 3d structure (requires JavaScript / HTML 5) - Other names: (2-Hydroxyethyl)ethylamine; Ethyl-2-hydroxyethylamine; Ethylaminoethanol; Monoethylaminoethanol; 2-(N-Ethylamino)ethanol; N-Ethyl-N-(β-hydroxyethyl)amine; N-Ethyl-N-(2-hydroxyethyl)amine; N-Ethyl-2-hydroxyethylamine; N-Ethylethanolamine; N-Ethylmonoethanolamine; 2-(Ethylamino)ethanol; 2-N-Monoethylaminoethanol; N-Ethyl-2-aminoethanol; 2-Ethylamino-1-ethanol

Phase change data

Data compiled as indicated in comments:
BS - Robert L. Brown and Stephen E. Stein
AC - William E. Acree, Jr., James S. Chickos
Quantity | Value | Units | Method | Reference | Comment |
---|---|---|---|---|---|
Tboil | 442.7 | K | N/A | Weast and Grasselli, 1989 | BS |
Quantity | Value | Units | Method | Reference | Comment |
ΔvapH° | 61.0 ± 0.4 | kJ/mol | GS | Kapteina, Slowik, et al., 2005 | Based on data from 282. to 321. K.; AC |

Gas phase ion energetics data

Data compiled by: Sharon G. Lias, Rhoda D. Levin, and Sherif A. Kafafi
Appearance energy determinations
Ion | AE (eV) | Other Products | Method | Reference | Comment |
---|---|---|---|---|---|
C3H8N+ | 8.89 | CH2OH | EI | Lossing, Lam, et al., 1981 |

Normal alkane RI, non-polar column, temperature ramp

Column type | Active phase | I | Reference | Comment |
---|---|---|---|---|
Capillary | OV-101 | 786. | Zenkevich, 2005 | 25. m/0.20 mm/0.10 μm, N2/He, 6. K/min; Tstart: 50. C; Tend: 250. C |

References

Weast and Grasselli, 1989
CRC Handbook of Data on Organic Compounds, 2nd Editon, Weast,R.C and Grasselli, J.G., ed(s)., CRC Press, Inc., Boca Raton, FL, 1989, 1. [all data]
Kapteina, Slowik, et al., 2005
Kapteina, Simon; Slowik, Krzysztof; Verevkin, Sergey P.; Heintz, Andreas,
Vapor Pressures and Vaporization Enthalpies of a Series of Ethanolamines,
J. Chem. Eng. Data, 2005, 50, 2, 398-402, https://doi.org/10.1021/je049761y
. [all data]
Lossing, Lam, et al., 1981
Lossing, F.P.; Lam, Y.-T.; Maccoll, A.,
Gas phase heats of formation of alkyl immonium ions,
Can. J. Chem., 1981, 59, 2228. [all data]
Zenkevich, 2005
Zenkevich, I.G.,
Experimentally measured retention indices., 2005. [all data]