Ethane, 1,2-dimethoxy-
- Formula: C4H10O2
- Molecular weight: 90.1210
- IUPAC Standard InChIKey: XTHFKEDIFFGKHM-UHFFFAOYSA-N
- CAS Registry Number: 110-71-4
- Chemical structure:
View 3d structure (requires JavaScript / HTML 5) - Other names: α,β-Dimethoxyethane; Dimethoxyethane; Dimethyl cellosolve; Ethylene dimethyl ether; Ethylene glycol dimethyl ether; Glycol dimethyl ether; Glyme; Monoethylene glycol dimethyl ether; Monoglyme; 1,2-Dimethoxyethane; 1,2-Ethanediol dimethyl ether; 2,5-Dioxahexane; CH3OCH2CH2OCH3; Egdme; UN 2252; Ansul ether 121; DME; DME (glycol ether); Hisolve MMM; NSC 60542

Gas phase thermochemistry data

Data compiled by: Hussein Y. Afeefy, Joel F. Liebman, and Stephen E. Stein
Quantity | Value | Units | Method | Reference | Comment |
---|---|---|---|---|---|
ΔfH°gas | -342.8 ± 0.7 | kJ/mol | Ccr | Steele, Chirico, et al., 1996 | |
ΔfH°gas | -390. ± 2. | kJ/mol | Eqk | Wiberg, Morgan, et al., 1994 | |
ΔfH°gas | -340.5 ± 0.63 | kJ/mol | Ccr | Loucks and Laidler, 1967 |

Condensed phase thermochemistry data

Data compiled as indicated in comments:
ALS - Hussein Y. Afeefy, Joel F. Liebman, and Stephen E. Stein
DH - Eugene S. Domalski and Elizabeth D. Hearing
Quantity | Value | Units | Method | Reference | Comment |
---|---|---|---|---|---|
ΔfH°liquid | -379.56 ± 0.64 | kJ/mol | Ccr | Steele, Chirico, et al., 1996 | ALS |
ΔfH°liquid | -420. ± 2. | kJ/mol | Eqk | Wiberg, Morgan, et al., 1994 | ALS |
ΔfH°liquid | -376.6 ± 0.2 | kJ/mol | Ccr | Loucks and Laidler, 1967 | ALS |
Quantity | Value | Units | Method | Reference | Comment |
ΔcH°liquid | -2623.6 ± 1.5 | kJ/mol | Ccr | Steele, Chirico, et al., 1996 | Corresponding ΔfHºliquid = -379.56 kJ/mol (simple calculation by NIST; no Washburn corrections); ALS |
Constant pressure heat capacity of liquid
Cp,liquid (J/mol*K) | Temperature (K) | Reference | Comment |
---|---|---|---|
191.14 | 298.15 | Trejo, Costas, et al., 1991 | DH |
193.3 | 298.15 | Kusano, Suurkuusk, et al., 1973 | DH |

Phase change data

Data compiled as indicated in comments:
TRC - Thermodynamics Research Center, NIST Boulder Laboratories, Chris Muzny director
BS - Robert L. Brown and Stephen E. Stein
ALS - Hussein Y. Afeefy, Joel F. Liebman, and Stephen E. Stein
DRB - Donald R. Burgess, Jr.
AC - William E. Acree, Jr., James S. Chickos
Quantity | Value | Units | Method | Reference | Comment |
---|---|---|---|---|---|
Tboil | 358. ± 1. | K | AVG | N/A | Average of 11 values; Individual data points |
Quantity | Value | Units | Method | Reference | Comment |
Tfus | 203.94 | K | N/A | Guanquan, Ott, et al., 1986 | Uncertainty assigned by TRC = 0.1 K; TRC |
Tfus | 204.15 | K | N/A | Anonymous, 1982 | TRC |
Quantity | Value | Units | Method | Reference | Comment |
Tc | 537. | K | N/A | Steele, Chirico, et al., 1996 | Uncertainty assigned by TRC = 2. K; TRC |
Tc | 539.2 | K | N/A | Quadri and Kudchadker, 1991 | Uncertainty assigned by TRC = 0.5 K; TRC |
Tc | 536. | K | N/A | Kobe, Ravicz, et al., 1956 | Uncertainty assigned by TRC = 2. K; TRC |
Quantity | Value | Units | Method | Reference | Comment |
Pc | 39.60 | bar | N/A | Steele, Chirico, et al., 1996 | Uncertainty assigned by TRC = 2.50 bar; from extraploation of obs. vapor pressures to Tc; TRC |
Pc | 38.60 | bar | N/A | Quadri and Kudchadker, 1991 | Uncertainty assigned by TRC = 0.20 bar; TRC |
Pc | 38.70 | bar | N/A | Kobe, Ravicz, et al., 1956 | Uncertainty assigned by TRC = 0.2757 bar; TRC |
Quantity | Value | Units | Method | Reference | Comment |
Vc | 0.271 | l/mol | N/A | Kobe, Ravicz, et al., 1956 | Uncertainty assigned by TRC = 0.005 l/mol; TRC |
Quantity | Value | Units | Method | Reference | Comment |
ρc | 3.25 | mol/l | N/A | Steele, Chirico, et al., 1996 | Uncertainty assigned by TRC = 0.13 mol/l; TRC |
Quantity | Value | Units | Method | Reference | Comment |
ΔvapH° | 36. ± 4. | kJ/mol | AVG | N/A | Average of 8 values; Individual data points |
Enthalpy of vaporization
ΔvapH (kJ/mol) | Temperature (K) | Method | Reference | Comment |
---|---|---|---|---|
32.42 | 358. | N/A | Majer and Svoboda, 1985 | |
34.5 | 304. to 358. | EB | Li, Fang, et al., 2009 | AC |
39.4 | 253. | A | Stephenson and Malanowski, 1987 | Based on data from 238. to 298. K.; AC |
39.1 | 253. | A | Stephenson and Malanowski, 1987 | Based on data from 238. to 363. K.; AC |
33.9 | 240. | N/A | Stull, 1947 | Based on data from 225. to 366. K.; AC |
Antoine Equation Parameters
log10(P) = A − (B / (T + C))
P = vapor pressure (bar)
T = temperature (K)
View plot Requires a JavaScript / HTML 5 canvas capable browser.
Temperature (K) | A | B | C | Reference | Comment |
---|---|---|---|---|---|
225. to 366. | 3.83775 | 1260.52 | -37.322 | Stull, 1947 | Coefficents calculated by NIST from author's data. |

Reaction thermochemistry data

Data compiled as indicated in comments:
M - Michael M. Meot-Ner (Mautner) and Sharon G. Lias
RCD - Robert C. Dunbar
ALS - Hussein Y. Afeefy, Joel F. Liebman, and Stephen E. Stein
Individual Reactions
(C4H11O2+ • 2 • 2
) +
= (C4H11O2+ • 3
• 2
)
By formula: (C4H11O2+ • 2H2O • 2C4H10O2) + H2O = (C4H11O2+ • 3H2O • 2C4H10O2)
Bond type: Hydrogen bond (positive ion to hydride)
Quantity | Value | Units | Method | Reference | Comment |
---|---|---|---|---|---|
ΔrH° | 38. | kJ/mol | PHPMS | Meot-Ner (Mautner), Sieck, et al., 1994 | gas phase; Entropy change calculated or estimated; M |
Quantity | Value | Units | Method | Reference | Comment |
ΔrS° | 105. | J/mol*K | N/A | Meot-Ner (Mautner), Sieck, et al., 1994 | gas phase; Entropy change calculated or estimated; M |
Free energy of reaction
ΔrG° (kJ/mol) | T (K) | Method | Reference | Comment |
---|---|---|---|---|
15. | 225. | PHPMS | Meot-Ner (Mautner), Sieck, et al., 1994 | gas phase; Entropy change calculated or estimated; M |
(C4H11O2+ • 3 •
) +
= (C4H11O2+ • 4
•
)
By formula: (C4H11O2+ • 3H2O • C4H10O2) + H2O = (C4H11O2+ • 4H2O • C4H10O2)
Bond type: Hydrogen bond (positive ion to hydride)
Quantity | Value | Units | Method | Reference | Comment |
---|---|---|---|---|---|
ΔrH° | 40. | kJ/mol | PHPMS | Meot-Ner (Mautner), Sieck, et al., 1994 | gas phase; Entropy change calculated or estimated; M |
Quantity | Value | Units | Method | Reference | Comment |
ΔrS° | 105. | J/mol*K | N/A | Meot-Ner (Mautner), Sieck, et al., 1994 | gas phase; Entropy change calculated or estimated; M |
Free energy of reaction
ΔrG° (kJ/mol) | T (K) | Method | Reference | Comment |
---|---|---|---|---|
16. | 225. | PHPMS | Meot-Ner (Mautner), Sieck, et al., 1994 | gas phase; Entropy change calculated or estimated; M |
(C4H11O2+ • 2) +
= (C4H11O2+ • 3
)
By formula: (C4H11O2+ • 2C4H10O2) + C4H10O2 = (C4H11O2+ • 3C4H10O2)
Bond type: Hydrogen bonds between protonated and neutral organics
Quantity | Value | Units | Method | Reference | Comment |
---|---|---|---|---|---|
ΔrH° | 42.7 | kJ/mol | PHPMS | Meot-Ner (Mautner), Sieck, et al., 1994 | gas phase; Entropy change calculated or estimated; M |
Quantity | Value | Units | Method | Reference | Comment |
ΔrS° | 105. | J/mol*K | N/A | Meot-Ner (Mautner), Sieck, et al., 1994 | gas phase; Entropy change calculated or estimated; M |
Free energy of reaction
ΔrG° (kJ/mol) | T (K) | Method | Reference | Comment |
---|---|---|---|---|
21. | 208. | PHPMS | Meot-Ner (Mautner), Sieck, et al., 1994 | gas phase; Entropy change calculated or estimated; M |
By formula: Na+ + C4H10O2 = (Na+ • C4H10O2)
Quantity | Value | Units | Method | Reference | Comment |
---|---|---|---|---|---|
ΔrH° | 158. ± 4.2 | kJ/mol | CIDT | Armentrout and Rodgers, 2000 | glyme; RCD |
ΔrH° | 241. ± 18. | kJ/mol | CIDT | Rodgers and Armentrout, 2000 | RCD |
ΔrH° | 161. ± 4.2 | kJ/mol | CIDT | More, Ray, et al., 1997 | RCD |
ΔrH° | 197. | kJ/mol | HPMS | Castleman, Peterson, et al., 1983 | gas phase; M |
Quantity | Value | Units | Method | Reference | Comment |
ΔrS° | 145. | J/mol*K | HPMS | Castleman, Peterson, et al., 1983 | gas phase; M |
Free energy of reaction
ΔrG° (kJ/mol) | T (K) | Method | Reference | Comment |
---|---|---|---|---|
133. | 298. | IMRE | McMahon and Ohanessian, 2000 | Anchor alanine=39.89; RCD |
By formula: K+ + C4H10O2 = (K+ • C4H10O2)
Bond type: Polydentate bonding in non-hydrogen-bonded positive ions
Quantity | Value | Units | Method | Reference | Comment |
---|---|---|---|---|---|
ΔrH° | 119. ± 4.2 | kJ/mol | CIDT | Rodgers and Armentrout, 2000 | RCD |
ΔrH° | 129. | kJ/mol | HPMS | Davidson and Kebarle, 1976 | gas phase; M |
Quantity | Value | Units | Method | Reference | Comment |
ΔrS° | 112. | J/mol*K | HPMS | Davidson and Kebarle, 1976 | gas phase; M |
By formula: (Na+ • C4H10O2) + C4H10O2 = (Na+ • 2C4H10O2)
Quantity | Value | Units | Method | Reference | Comment |
---|---|---|---|---|---|
ΔrH° | 116. ± 7.9 | kJ/mol | CIDT | Rodgers and Armentrout, 2000 | RCD |
ΔrH° | 114. ± 8.4 | kJ/mol | CIDT | More, Ray, et al., 1997 | RCD |
ΔrH° | 147. | kJ/mol | HPMS | Castleman, Peterson, et al., 1983 | gas phase; M |
Quantity | Value | Units | Method | Reference | Comment |
ΔrS° | 169. | J/mol*K | HPMS | Castleman, Peterson, et al., 1983 | gas phase; M |
(C4H11O2+ • • 2
) +
= (C4H11O2+ • 2
• 2
)
By formula: (C4H11O2+ • C4H10O2 • 2H2O) + C4H10O2 = (C4H11O2+ • 2C4H10O2 • 2H2O)
Bond type: Hydrogen bonds between protonated and neutral organics
Quantity | Value | Units | Method | Reference | Comment |
---|---|---|---|---|---|
ΔrH° | 82.8 | kJ/mol | PHPMS | Meot-Ner (Mautner), Sieck, et al., 1994 | gas phase; M |
Quantity | Value | Units | Method | Reference | Comment |
ΔrS° | 123. | J/mol*K | PHPMS | Meot-Ner (Mautner), Sieck, et al., 1994 | gas phase; M |
(C4H11O2+ • 2 •
) +
= (C4H11O2+ • 3
•
)
By formula: (C4H11O2+ • 2H2O • C4H10O2) + H2O = (C4H11O2+ • 3H2O • C4H10O2)
Bond type: Hydrogen bond (positive ion to hydride)
Quantity | Value | Units | Method | Reference | Comment |
---|---|---|---|---|---|
ΔrH° | 42.7 | kJ/mol | PHPMS | Meot-Ner (Mautner), Sieck, et al., 1994 | gas phase; M |
Quantity | Value | Units | Method | Reference | Comment |
ΔrS° | 104. | J/mol*K | PHPMS | Meot-Ner (Mautner), Sieck, et al., 1994 | gas phase; M |
(C4H11O2+ • • 2
) +
= (C4H11O2+ • 2
• 2
)
By formula: (C4H11O2+ • H2O • 2C4H10O2) + H2O = (C4H11O2+ • 2H2O • 2C4H10O2)
Bond type: Hydrogen bond (positive ion to hydride)
Quantity | Value | Units | Method | Reference | Comment |
---|---|---|---|---|---|
ΔrH° | 41. | kJ/mol | PHPMS | Meot-Ner (Mautner), Sieck, et al., 1994 | gas phase; M |
Quantity | Value | Units | Method | Reference | Comment |
ΔrS° | 102. | J/mol*K | PHPMS | Meot-Ner (Mautner), Sieck, et al., 1994 | gas phase; M |
(C4H11O2+ • •
) +
= (C4H11O2+ • 2
•
)
By formula: (C4H11O2+ • H2O • C4H10O2) + H2O = (C4H11O2+ • 2H2O • C4H10O2)
Bond type: Hydrogen bond (positive ion to hydride)
Quantity | Value | Units | Method | Reference | Comment |
---|---|---|---|---|---|
ΔrH° | 43.5 | kJ/mol | PHPMS | Meot-Ner (Mautner), Sieck, et al., 1994 | gas phase; M |
Quantity | Value | Units | Method | Reference | Comment |
ΔrS° | 104. | J/mol*K | PHPMS | Meot-Ner (Mautner), Sieck, et al., 1994 | gas phase; M |
By formula: C5H6N+ + C4H10O2 = (C5H6N+ • C4H10O2)
Bond type: Hydrogen bonds with polydentate bonding in positive ions
Quantity | Value | Units | Method | Reference | Comment |
---|---|---|---|---|---|
ΔrH° | 106. | kJ/mol | PHPMS | Meot-Ner (Mautner), 1983 | gas phase; glyme; M |
Quantity | Value | Units | Method | Reference | Comment |
ΔrS° | 131. | J/mol*K | PHPMS | Meot-Ner (Mautner), 1983 | gas phase; glyme; M |
By formula: (H4N+ • C4H10O2) + H3N = (H4N+ • H3N • C4H10O2)
Bond type: Hydrogen bond (positive ion to hydride)
Quantity | Value | Units | Method | Reference | Comment |
---|---|---|---|---|---|
ΔrH° | 58.6 | kJ/mol | PHPMS | Meot-Ner (Mautner), Sieck, et al., 1996 | gas phase; M |
Quantity | Value | Units | Method | Reference | Comment |
ΔrS° | 81.2 | J/mol*K | PHPMS | Meot-Ner (Mautner), Sieck, et al., 1996 | gas phase; M |
(C4H11O2+ • ) +
= (C4H11O2+ •
•
)
By formula: (C4H11O2+ • C4H10O2) + H2O = (C4H11O2+ • H2O • C4H10O2)
Bond type: Hydrogen bond (positive ion to hydride)
Quantity | Value | Units | Method | Reference | Comment |
---|---|---|---|---|---|
ΔrH° | 57.3 | kJ/mol | PHPMS | Meot-Ner (Mautner), Sieck, et al., 1994 | gas phase; M |
Quantity | Value | Units | Method | Reference | Comment |
ΔrS° | 115. | J/mol*K | PHPMS | Meot-Ner (Mautner), Sieck, et al., 1994 | gas phase; M |
By formula: C4H11O2+ + C4H10O2 = (C4H11O2+ • C4H10O2)
Bond type: Hydrogen bonds between protonated and neutral organics
Quantity | Value | Units | Method | Reference | Comment |
---|---|---|---|---|---|
ΔrH° | 115. | kJ/mol | PHPMS | Meot-Ner (Mautner), Sieck, et al., 1994 | gas phase; M |
Quantity | Value | Units | Method | Reference | Comment |
ΔrS° | 129. | J/mol*K | PHPMS | Meot-Ner (Mautner), Sieck, et al., 1994 | gas phase; M |
By formula: H4N+ + C4H10O2 = (H4N+ • C4H10O2)
Quantity | Value | Units | Method | Reference | Comment |
---|---|---|---|---|---|
ΔrH° | 160. ± 10. | kJ/mol | PHPMS | Meot-Ner (Mautner), Sieck, et al., 1996 | gas phase; possible ether decomposition; M |
Quantity | Value | Units | Method | Reference | Comment |
ΔrS° | 150. | J/mol*K | PHPMS | Meot-Ner (Mautner), Sieck, et al., 1996 | gas phase; possible ether decomposition; M |
By formula: C3H10N+ + C4H10O2 = (C3H10N+ • C4H10O2)
Bond type: Hydrogen bonds with polydentate bonding in positive ions
Quantity | Value | Units | Method | Reference | Comment |
---|---|---|---|---|---|
ΔrH° | 112. | kJ/mol | PHPMS | Meot-Ner (Mautner), 1983 | gas phase; M |
Quantity | Value | Units | Method | Reference | Comment |
ΔrS° | 146. | J/mol*K | PHPMS | Meot-Ner (Mautner), 1983 | gas phase; M |
By formula: C6H14N+ + C4H10O2 = (C6H14N+ • C4H10O2)
Bond type: Hydrogen bonds with polydentate bonding in positive ions
Quantity | Value | Units | Method | Reference | Comment |
---|---|---|---|---|---|
ΔrH° | 123. | kJ/mol | PHPMS | Meot-Ner (Mautner), 1983 | gas phase; M |
Quantity | Value | Units | Method | Reference | Comment |
ΔrS° | 149. | J/mol*K | PHPMS | Meot-Ner (Mautner), 1983 | gas phase; M |
By formula: CH6N+ + C4H10O2 = (CH6N+ • C4H10O2)
Bond type: Hydrogen bonds with polydentate bonding in positive ions
Quantity | Value | Units | Method | Reference | Comment |
---|---|---|---|---|---|
ΔrH° | 126. | kJ/mol | PHPMS | Meot-Ner (Mautner), 1983 | gas phase; M |
Quantity | Value | Units | Method | Reference | Comment |
ΔrS° | 126. | J/mol*K | PHPMS | Meot-Ner (Mautner), 1983 | gas phase; M |
By formula: (H4N+ • 2C4H10O2) + C4H10O2 = (H4N+ • 3C4H10O2)
Quantity | Value | Units | Method | Reference | Comment |
---|---|---|---|---|---|
ΔrH° | 60. ± 10. | kJ/mol | PHPMS | Meot-Ner (Mautner), Sieck, et al., 1996 | gas phase; M |
Quantity | Value | Units | Method | Reference | Comment |
ΔrS° | 114. | J/mol*K | PHPMS | Meot-Ner (Mautner), Sieck, et al., 1996 | gas phase; M |
By formula: (H4N+ • C4H10O2) + C4H10O2 = (H4N+ • 2C4H10O2)
Quantity | Value | Units | Method | Reference | Comment |
---|---|---|---|---|---|
ΔrH° | 97.1 | kJ/mol | PHPMS | Meot-Ner (Mautner), Sieck, et al., 1996 | gas phase; M |
Quantity | Value | Units | Method | Reference | Comment |
ΔrS° | 140. | J/mol*K | PHPMS | Meot-Ner (Mautner), Sieck, et al., 1996 | gas phase; M |
By formula: (Na+ • 2C4H10O2) + C4H10O2 = (Na+ • 3C4H10O2)
Quantity | Value | Units | Method | Reference | Comment |
---|---|---|---|---|---|
ΔrH° | 97.1 | kJ/mol | HPMS | Castleman, Peterson, et al., 1983 | gas phase; M |
Quantity | Value | Units | Method | Reference | Comment |
ΔrS° | 177. | J/mol*K | HPMS | Castleman, Peterson, et al., 1983 | gas phase; M |
By formula: C4H10O2 + H2O = 2CH4O + C2H4O
Quantity | Value | Units | Method | Reference | Comment |
---|---|---|---|---|---|
ΔrH° | 35.9 ± 0.8 | kJ/mol | Eqk | Wiberg, Morgan, et al., 1994 | liquid phase; ALS |
By formula: 2CH4O + C2H4O = C4H10O2 + H2O
Quantity | Value | Units | Method | Reference | Comment |
---|---|---|---|---|---|
ΔrH° | -62. ± 1. | kJ/mol | Cm | Wiberg, Morgan, et al., 1994 | gas phase; ALS |
By formula: (Li+ • C4H10O2) + C4H10O2 = (Li+ • 2C4H10O2)
Quantity | Value | Units | Method | Reference | Comment |
---|---|---|---|---|---|
ΔrH° | 139. ± 12. | kJ/mol | CIDT | Rodgers and Armentrout, 2000 | RCD |
By formula: (Cs+ • C4H10O2) + C4H10O2 = (Cs+ • 2C4H10O2)
Quantity | Value | Units | Method | Reference | Comment |
---|---|---|---|---|---|
ΔrH° | 54.0 ± 7.1 | kJ/mol | CIDT | Rodgers and Armentrout, 2000 | RCD |
By formula: (Rb+ • C4H10O2) + C4H10O2 = (Rb+ • 2C4H10O2)
Quantity | Value | Units | Method | Reference | Comment |
---|---|---|---|---|---|
ΔrH° | 49. ± 12. | kJ/mol | CIDT | Rodgers and Armentrout, 2000 | RCD |
By formula: (K+ • C4H10O2) + C4H10O2 = (K+ • 2C4H10O2)
Quantity | Value | Units | Method | Reference | Comment |
---|---|---|---|---|---|
ΔrH° | 89. ± 12. | kJ/mol | CIDT | Rodgers and Armentrout, 2000 | RCD |
By formula: (Cu+ • C4H10O2) + C4H10O2 = (Cu+ • 2C4H10O2)
Quantity | Value | Units | Method | Reference | Comment |
---|---|---|---|---|---|
ΔrH° | 180. ± 5.9 | kJ/mol | CIDT | Koizumi, 2001 | RCD |
By formula: Li+ + C4H10O2 = (Li+ • C4H10O2)
Quantity | Value | Units | Method | Reference | Comment |
---|---|---|---|---|---|
ΔrH° | 158. ± 4.2 | kJ/mol | CIDT | Rodgers and Armentrout, 2000 | RCD |
By formula: Cs+ + C4H10O2 = (Cs+ • C4H10O2)
Quantity | Value | Units | Method | Reference | Comment |
---|---|---|---|---|---|
ΔrH° | 56.9 ± 5.0 | kJ/mol | CIDT | Rodgers and Armentrout, 2000 | RCD |
By formula: Rb+ + C4H10O2 = (Rb+ • C4H10O2)
Quantity | Value | Units | Method | Reference | Comment |
---|---|---|---|---|---|
ΔrH° | 94.1 ± 9.2 | kJ/mol | CIDT | Rodgers and Armentrout, 2000 | RCD |
By formula: Cu+ + C4H10O2 = (Cu+ • C4H10O2)
Quantity | Value | Units | Method | Reference | Comment |
---|---|---|---|---|---|
ΔrH° | 264. ± 7.9 | kJ/mol | CIDT | Koizumi, 2001 | RCD |

Gas phase ion energetics data

Data evaluated as indicated in comments:
HL - Edward P. Hunter and Sharon G. Lias
L - Sharon G. Lias
Data compiled as indicated in comments:
MM - Michael M. Meot-Ner (Mautner)
LBLHLM - Sharon G. Lias, John E. Bartmess, Joel F. Liebman, John L. Holmes, Rhoda D. Levin, and W. Gary Mallard
LLK - Sharon G. Lias, Rhoda D. Levin, and Sherif A. Kafafi
Quantity | Value | Units | Method | Reference | Comment |
---|---|---|---|---|---|
IE (evaluated) | 9.3 | eV | N/A | N/A | L |
Quantity | Value | Units | Method | Reference | Comment |
Proton affinity (review) | 858.0 | kJ/mol | N/A | Hunter and Lias, 1998 | HL |
Quantity | Value | Units | Method | Reference | Comment |
Gas basicity | 820.2 | kJ/mol | N/A | Hunter and Lias, 1998 | HL |
Proton affinity at 298K
Proton affinity (kJ/mol) | Reference | Comment |
---|---|---|
846. ± 2. | Morlender-Vais and Holmes, 2001 | Plots of lnR (dissociation product ratio RH+/MH+) vs. PA(B) in metastable ion and CID experiments.; MM |
Ionization energy determinations
IE (eV) | Method | Reference | Comment |
---|---|---|---|
9.3 | PE | Baker, Armen, et al., 1983 | LBLHLM |
9.2 | PE | Kimura, Katsumata, et al., 1981 | LLK |
9.9 | PE | Baker, Armen, et al., 1983 | Vertical value; LBLHLM |
9.78 | PE | Kimura, Katsumata, et al., 1981 | Vertical value; LLK |
Appearance energy determinations
Ion | AE (eV) | Other Products | Method | Reference | Comment |
---|---|---|---|---|---|
C2H5O+ | 10.36 ± 0.05 | CH3OCH2 | EI | Holmes and Lossing, 1984 | LBLHLM |
C2H5O+ | 10.27 | CH3OCH2 | EI | Lossing, 1977 | LLK |

Ion clustering data

Data compiled as indicated in comments:
M - Michael M. Meot-Ner (Mautner) and Sharon G. Lias
RCD - Robert C. Dunbar
Clustering reactions
By formula: CH6N+ + C4H10O2 = (CH6N+ • C4H10O2)
Bond type: Hydrogen bonds with polydentate bonding in positive ions
Quantity | Value | Units | Method | Reference | Comment |
---|---|---|---|---|---|
ΔrH° | 126. | kJ/mol | PHPMS | Meot-Ner (Mautner), 1983 | gas phase; M |
Quantity | Value | Units | Method | Reference | Comment |
ΔrS° | 126. | J/mol*K | PHPMS | Meot-Ner (Mautner), 1983 | gas phase; M |
By formula: C3H10N+ + C4H10O2 = (C3H10N+ • C4H10O2)
Bond type: Hydrogen bonds with polydentate bonding in positive ions
Quantity | Value | Units | Method | Reference | Comment |
---|---|---|---|---|---|
ΔrH° | 112. | kJ/mol | PHPMS | Meot-Ner (Mautner), 1983 | gas phase; M |
Quantity | Value | Units | Method | Reference | Comment |
ΔrS° | 146. | J/mol*K | PHPMS | Meot-Ner (Mautner), 1983 | gas phase; M |
By formula: C4H11O2+ + C4H10O2 = (C4H11O2+ • C4H10O2)
Bond type: Hydrogen bonds between protonated and neutral organics
Quantity | Value | Units | Method | Reference | Comment |
---|---|---|---|---|---|
ΔrH° | 115. | kJ/mol | PHPMS | Meot-Ner (Mautner), Sieck, et al., 1994 | gas phase; M |
Quantity | Value | Units | Method | Reference | Comment |
ΔrS° | 129. | J/mol*K | PHPMS | Meot-Ner (Mautner), Sieck, et al., 1994 | gas phase; M |
(C4H11O2+ • 2) +
= (C4H11O2+ • 3
)
By formula: (C4H11O2+ • 2C4H10O2) + C4H10O2 = (C4H11O2+ • 3C4H10O2)
Bond type: Hydrogen bonds between protonated and neutral organics
Quantity | Value | Units | Method | Reference | Comment |
---|---|---|---|---|---|
ΔrH° | 42.7 | kJ/mol | PHPMS | Meot-Ner (Mautner), Sieck, et al., 1994 | gas phase; Entropy change calculated or estimated; M |
Quantity | Value | Units | Method | Reference | Comment |
ΔrS° | 105. | J/mol*K | N/A | Meot-Ner (Mautner), Sieck, et al., 1994 | gas phase; Entropy change calculated or estimated; M |
Free energy of reaction
ΔrG° (kJ/mol) | T (K) | Method | Reference | Comment |
---|---|---|---|---|
21. | 208. | PHPMS | Meot-Ner (Mautner), Sieck, et al., 1994 | gas phase; Entropy change calculated or estimated; M |
(C4H11O2+ • • 2
) +
= (C4H11O2+ • 2
• 2
)
By formula: (C4H11O2+ • C4H10O2 • 2H2O) + C4H10O2 = (C4H11O2+ • 2C4H10O2 • 2H2O)
Bond type: Hydrogen bonds between protonated and neutral organics
Quantity | Value | Units | Method | Reference | Comment |
---|---|---|---|---|---|
ΔrH° | 82.8 | kJ/mol | PHPMS | Meot-Ner (Mautner), Sieck, et al., 1994 | gas phase; M |
Quantity | Value | Units | Method | Reference | Comment |
ΔrS° | 123. | J/mol*K | PHPMS | Meot-Ner (Mautner), Sieck, et al., 1994 | gas phase; M |
By formula: C5H6N+ + C4H10O2 = (C5H6N+ • C4H10O2)
Bond type: Hydrogen bonds with polydentate bonding in positive ions
Quantity | Value | Units | Method | Reference | Comment |
---|---|---|---|---|---|
ΔrH° | 106. | kJ/mol | PHPMS | Meot-Ner (Mautner), 1983 | gas phase; glyme; M |
Quantity | Value | Units | Method | Reference | Comment |
ΔrS° | 131. | J/mol*K | PHPMS | Meot-Ner (Mautner), 1983 | gas phase; glyme; M |
By formula: C6H14N+ + C4H10O2 = (C6H14N+ • C4H10O2)
Bond type: Hydrogen bonds with polydentate bonding in positive ions
Quantity | Value | Units | Method | Reference | Comment |
---|---|---|---|---|---|
ΔrH° | 123. | kJ/mol | PHPMS | Meot-Ner (Mautner), 1983 | gas phase; M |
Quantity | Value | Units | Method | Reference | Comment |
ΔrS° | 149. | J/mol*K | PHPMS | Meot-Ner (Mautner), 1983 | gas phase; M |
By formula: Cs+ + C4H10O2 = (Cs+ • C4H10O2)
Quantity | Value | Units | Method | Reference | Comment |
---|---|---|---|---|---|
ΔrH° | 56.9 ± 5.0 | kJ/mol | CIDT | Rodgers and Armentrout, 2000 | RCD |
By formula: (Cs+ • C4H10O2) + C4H10O2 = (Cs+ • 2C4H10O2)
Quantity | Value | Units | Method | Reference | Comment |
---|---|---|---|---|---|
ΔrH° | 54.0 ± 7.1 | kJ/mol | CIDT | Rodgers and Armentrout, 2000 | RCD |
By formula: Cu+ + C4H10O2 = (Cu+ • C4H10O2)
Quantity | Value | Units | Method | Reference | Comment |
---|---|---|---|---|---|
ΔrH° | 264. ± 7.9 | kJ/mol | CIDT | Koizumi, 2001 | RCD |
By formula: (Cu+ • C4H10O2) + C4H10O2 = (Cu+ • 2C4H10O2)
Quantity | Value | Units | Method | Reference | Comment |
---|---|---|---|---|---|
ΔrH° | 180. ± 5.9 | kJ/mol | CIDT | Koizumi, 2001 | RCD |
By formula: H4N+ + C4H10O2 = (H4N+ • C4H10O2)
Quantity | Value | Units | Method | Reference | Comment |
---|---|---|---|---|---|
ΔrH° | 160. ± 10. | kJ/mol | PHPMS | Meot-Ner (Mautner), Sieck, et al., 1996 | gas phase; possible ether decomposition; M |
Quantity | Value | Units | Method | Reference | Comment |
ΔrS° | 150. | J/mol*K | PHPMS | Meot-Ner (Mautner), Sieck, et al., 1996 | gas phase; possible ether decomposition; M |
By formula: (H4N+ • C4H10O2) + C4H10O2 = (H4N+ • 2C4H10O2)
Quantity | Value | Units | Method | Reference | Comment |
---|---|---|---|---|---|
ΔrH° | 97.1 | kJ/mol | PHPMS | Meot-Ner (Mautner), Sieck, et al., 1996 | gas phase; M |
Quantity | Value | Units | Method | Reference | Comment |
ΔrS° | 140. | J/mol*K | PHPMS | Meot-Ner (Mautner), Sieck, et al., 1996 | gas phase; M |
By formula: (H4N+ • 2C4H10O2) + C4H10O2 = (H4N+ • 3C4H10O2)
Quantity | Value | Units | Method | Reference | Comment |
---|---|---|---|---|---|
ΔrH° | 60. ± 10. | kJ/mol | PHPMS | Meot-Ner (Mautner), Sieck, et al., 1996 | gas phase; M |
Quantity | Value | Units | Method | Reference | Comment |
ΔrS° | 114. | J/mol*K | PHPMS | Meot-Ner (Mautner), Sieck, et al., 1996 | gas phase; M |
By formula: K+ + C4H10O2 = (K+ • C4H10O2)
Bond type: Polydentate bonding in non-hydrogen-bonded positive ions
Quantity | Value | Units | Method | Reference | Comment |
---|---|---|---|---|---|
ΔrH° | 119. ± 4.2 | kJ/mol | CIDT | Rodgers and Armentrout, 2000 | RCD |
ΔrH° | 129. | kJ/mol | HPMS | Davidson and Kebarle, 1976 | gas phase; M |
Quantity | Value | Units | Method | Reference | Comment |
ΔrS° | 112. | J/mol*K | HPMS | Davidson and Kebarle, 1976 | gas phase; M |
By formula: (K+ • C4H10O2) + C4H10O2 = (K+ • 2C4H10O2)
Quantity | Value | Units | Method | Reference | Comment |
---|---|---|---|---|---|
ΔrH° | 89. ± 12. | kJ/mol | CIDT | Rodgers and Armentrout, 2000 | RCD |
By formula: Li+ + C4H10O2 = (Li+ • C4H10O2)
Quantity | Value | Units | Method | Reference | Comment |
---|---|---|---|---|---|
ΔrH° | 158. ± 4.2 | kJ/mol | CIDT | Rodgers and Armentrout, 2000 | RCD |
By formula: (Li+ • C4H10O2) + C4H10O2 = (Li+ • 2C4H10O2)
Quantity | Value | Units | Method | Reference | Comment |
---|---|---|---|---|---|
ΔrH° | 139. ± 12. | kJ/mol | CIDT | Rodgers and Armentrout, 2000 | RCD |
By formula: Na+ + C4H10O2 = (Na+ • C4H10O2)
Quantity | Value | Units | Method | Reference | Comment |
---|---|---|---|---|---|
ΔrH° | 158. ± 4.2 | kJ/mol | CIDT | Armentrout and Rodgers, 2000 | glyme; RCD |
ΔrH° | 241. ± 18. | kJ/mol | CIDT | Rodgers and Armentrout, 2000 | RCD |
ΔrH° | 161. ± 4.2 | kJ/mol | CIDT | More, Ray, et al., 1997 | RCD |
ΔrH° | 197. | kJ/mol | HPMS | Castleman, Peterson, et al., 1983 | gas phase; M |
Quantity | Value | Units | Method | Reference | Comment |
ΔrS° | 145. | J/mol*K | HPMS | Castleman, Peterson, et al., 1983 | gas phase; M |
Free energy of reaction
ΔrG° (kJ/mol) | T (K) | Method | Reference | Comment |
---|---|---|---|---|
133. | 298. | IMRE | McMahon and Ohanessian, 2000 | Anchor alanine=39.89; RCD |
By formula: (Na+ • C4H10O2) + C4H10O2 = (Na+ • 2C4H10O2)
Quantity | Value | Units | Method | Reference | Comment |
---|---|---|---|---|---|
ΔrH° | 116. ± 7.9 | kJ/mol | CIDT | Rodgers and Armentrout, 2000 | RCD |
ΔrH° | 114. ± 8.4 | kJ/mol | CIDT | More, Ray, et al., 1997 | RCD |
ΔrH° | 147. | kJ/mol | HPMS | Castleman, Peterson, et al., 1983 | gas phase; M |
Quantity | Value | Units | Method | Reference | Comment |
ΔrS° | 169. | J/mol*K | HPMS | Castleman, Peterson, et al., 1983 | gas phase; M |
By formula: (Na+ • 2C4H10O2) + C4H10O2 = (Na+ • 3C4H10O2)
Quantity | Value | Units | Method | Reference | Comment |
---|---|---|---|---|---|
ΔrH° | 97.1 | kJ/mol | HPMS | Castleman, Peterson, et al., 1983 | gas phase; M |
Quantity | Value | Units | Method | Reference | Comment |
ΔrS° | 177. | J/mol*K | HPMS | Castleman, Peterson, et al., 1983 | gas phase; M |
By formula: Rb+ + C4H10O2 = (Rb+ • C4H10O2)
Quantity | Value | Units | Method | Reference | Comment |
---|---|---|---|---|---|
ΔrH° | 94.1 ± 9.2 | kJ/mol | CIDT | Rodgers and Armentrout, 2000 | RCD |
By formula: (Rb+ • C4H10O2) + C4H10O2 = (Rb+ • 2C4H10O2)
Quantity | Value | Units | Method | Reference | Comment |
---|---|---|---|---|---|
ΔrH° | 49. ± 12. | kJ/mol | CIDT | Rodgers and Armentrout, 2000 | RCD |

Kovats' RI, non-polar column, isothermal

Column type | Active phase | Temperature (C) | I | Reference | Comment |
---|---|---|---|---|---|
Packed | SE-30 | 120. | 646. | García-Raso, Martínez-Castro, et al., 1987 | N2, Supelcoport; Column length: 3. m |
Packed | SE-30 | 150. | 635. | Tiess, 1984 | Ar, Gas Chrom Q (80-100 mesh); Column length: 3. m |
Packed | Apiezon L | 120. | 607. | Bogoslovsky, Anvaer, et al., 1978 | Celite 545 |
Packed | Apiezon L | 160. | 608. | Bogoslovsky, Anvaer, et al., 1978 | Celite 545 |

Kovats' RI, polar column, isothermal

Column type | Active phase | Temperature (C) | I | Reference | Comment |
---|---|---|---|---|---|
Capillary | Carbowax 20M | 120. | 918. | García-Raso, Martínez-Castro, et al., 1987 | N2, Supelcoport; Column length: 25. m; Column diameter: 0.22 mm |

Normal alkane RI, non-polar column, temperature ramp

Column type | Active phase | I | Reference | Comment |
---|---|---|---|---|
Capillary | Ultra-ALLOY-5 | 645. | Tsuge, Ohtan, et al., 2011 | 30. m/0.25 mm/0.25 μm, 40. C @ 2. min, 20. K/min, 320. C @ 13. min |

Normal alkane RI, non-polar column, custom temperature program

Column type | Active phase | I | Reference | Comment |
---|---|---|---|---|
Capillary | Squalane | 646. | Chen, 2008 | Program: not specified |
Capillary | Polydimethyl siloxanes | 641. | Zenkevich, 1997 | Program: not specified |
Capillary | Methyl Silicone | 641. | Zenkevich, 1995 | Program: not specified |
Packed | Apiezon L | 609.5 | Keiko, Prokop'ev, et al., 1972 | Program: not specified |
Packed | Squalane | 614.5 | Keiko, Prokop'ev, et al., 1972 | Program: not specified |

Normal alkane RI, polar column, temperature ramp

Column type | Active phase | I | Reference | Comment |
---|---|---|---|---|
Capillary | DB-Wax | 935. | Shimadzu, 2012 | 30. m/0.32 mm/0.50 μm, Helium, 4. K/min; Tstart: 40. C; Tend: 260. C |
Capillary | DB-Wax | 935. | Shimadzu Corporation, 2003 | 30. m/0.32 mm/0.5 μm, He, 4. K/min; Tstart: 40. C; Tend: 260. C |

References

Steele, Chirico, et al., 1996
Steele, W.V.; Chirico, R.D.; Knipmeyer, S.E.; Nguyen, A.; Smith, N.K.,
Thermodynamic properties and ideal-gas enthalpies of formation for butyl vinyl ether, 1,2-dimethoxyethane, methyl glycolate, bicyclo[2.2.1]hept-2-ene, 5-vinylbicyclo[2.2.1]hept-2-ene, trans-azobenzene, butyl acrylate, di-tert-butyl ether, and hexane-1,6-diol,
J. Chem. Eng. Data, 1996, 41, 1285-1302. [all data]
Wiberg, Morgan, et al., 1994
Wiberg, K.B.; Morgan, K.M.; Maltz, H.,
Thermochemistry of carbonyl reactions. 6. A study of hydration equilibria,
J. Am. Chem. Soc., 1994, 116, 11067-11077. [all data]
Loucks and Laidler, 1967
Loucks, L.F.; Laidler, K.J.,
Thermochemistry of the methoxymethyl radical,
Can. J. Chem., 1967, 45, 2785-2793. [all data]
Trejo, Costas, et al., 1991
Trejo, L.M.; Costas, M.; Patterson, D.,
Excess heat capacity of organic mixtures, Internat. DATA Series,
Selected Data Mixt., 1991, Ser. [all data]
Kusano, Suurkuusk, et al., 1973
Kusano, K.; Suurkuusk, J.; Wads, I.,
Thermochemistry of solutions of biochemical model compounds. 2. Alkoxyethanols and 1,2-dialkoxyethanes in water, J. Chem. Thermodynam. 5,757-767 (1973).73LEB/TSV Lebedev, B.V., Tsvetkova, L.Ya., and Rabinovich, I.B., Specific heat and thermodynamic functions of poly(vinyltrimethylsilane),
Tr. Khim. Khim. Tekhnol., 1973, (1), 17-18. [all data]
Guanquan, Ott, et al., 1986
Guanquan, C.; Ott, J.B.; Goates, J.R.,
(Solid+liquid) phase equilibria and solid-compound formation in 1,2-dimethoxyethane+tetrachloromethane, +trichlorofluoromethane, and +trichloromethane,
J. Chem. Thermodyn., 1986, 18, 31. [all data]
Anonymous, 1982
Anonymous, X.,
Glymes Grant Chemical, 1982, Baton Rouge, LA 1982. [all data]
Quadri and Kudchadker, 1991
Quadri, S.K.; Kudchadker, A.P.,
Measurement of the critical temperatures and critical pressures of some thermally stable or mildly unstable esters, ketones, and ethers,
J. Chem. Thermodyn., 1991, 23, 129-34. [all data]
Kobe, Ravicz, et al., 1956
Kobe, K.A.; Ravicz, A.E.; Vohra, S.P.,
Critical Properties and Vapor Pressures of Some Ethers and Heterocyclic Compounds,
J. Chem. Eng. Data, 1956, 1, 50. [all data]
Majer and Svoboda, 1985
Majer, V.; Svoboda, V.,
Enthalpies of Vaporization of Organic Compounds: A Critical Review and Data Compilation, Blackwell Scientific Publications, Oxford, 1985, 300. [all data]
Li, Fang, et al., 2009
Li, Dan; Fang, Wenjun; Xie, Wenjie; Xing, Yan; Guo, Yongsheng; Lin, Ruisen,
Measurements on Vapor Pressure and Thermal Conductivity for Pseudo-binary Systems of a Hydrocarbon Fuel with Ethylene and Diethylene Glycol Dimethyl Ethers,
Energy Fuels, 2009, 23, 2, 794-798, https://doi.org/10.1021/ef8007163
. [all data]
Stephenson and Malanowski, 1987
Stephenson, Richard M.; Malanowski, Stanislaw,
Handbook of the Thermodynamics of Organic Compounds, 1987, https://doi.org/10.1007/978-94-009-3173-2
. [all data]
Stull, 1947
Stull, Daniel R.,
Vapor Pressure of Pure Substances. Organic and Inorganic Compounds,
Ind. Eng. Chem., 1947, 39, 4, 517-540, https://doi.org/10.1021/ie50448a022
. [all data]
Meot-Ner (Mautner), Sieck, et al., 1994
Meot-Ner (Mautner), M.; Sieck, L.W.; Liebman, J.F.; Scheiner, S.; Duan, X.,
The Ionic Hydrogen Bond. 5. Polydentate and Solvent-Bridged Structures. Complexing of the Proton and the Hydronium Ions by Polyethers,
J. Am. Chem. Soc., 1994, 116, 17, 7848, https://doi.org/10.1021/ja00096a047
. [all data]
Armentrout and Rodgers, 2000
Armentrout, P.B.; Rodgers, M.T.,
An Absolute Sodium Cation Affinity Scale: Threshold Collision-Induced Dissociation Experiments and ab Initio Theory,
J. Phys. Chem A, 2000, 104, 11, 2238, https://doi.org/10.1021/jp991716n
. [all data]
Rodgers and Armentrout, 2000
Rodgers, M.T.; Armentrout, P.B.,
Noncovalent Metal-Ligand Bond Energies as Studied by Threshold Collision-Induced Dissociation,
Mass Spectrom. Rev., 2000, 19, 4, 215, https://doi.org/10.1002/1098-2787(200007)19:4<215::AID-MAS2>3.0.CO;2-X
. [all data]
More, Ray, et al., 1997
More, M.B.; Ray, D.; Armentrout, P.B.,
Cation-ether complexes in the gas phase: Bond dissociation energies of Na+(dimethyl ether)(x), x=1-4; Na+(1,2-dimethoxyethane)(x), x=1 and 2; and Na+(12-crown-4),
J. Phys. Chem. AJOURNAL OF PHYSICAL CHEMISTRY A 101 (5): 831-839 JAN 30 1997, 1997, 101, 831. [all data]
Castleman, Peterson, et al., 1983
Castleman, A.W.; Peterson, K.I.; Upschulte, B.L.; Schelling, F.J.,
Energetics and Structure of Na+ Cluster Ions,
Int. J. Mass Spectrom. Ion Phys., 1983, 47, 203, https://doi.org/10.1016/0020-7381(83)87171-X
. [all data]
McMahon and Ohanessian, 2000
McMahon, T.B.; Ohanessian, G.,
An Experimental and Ab Initio Study of the Nature of the Binding in Gas-Phase Complexes of Sodium Ions,
Chem. Eur. J., 2000, 6, 16, 2931, https://doi.org/10.1002/1521-3765(20000818)6:16<2931::AID-CHEM2931>3.0.CO;2-7
. [all data]
Davidson and Kebarle, 1976
Davidson, W.R.; Kebarle, P.,
Binding Energies and Stabilities of Potassium Ion Complexes with Ethylene Diamine and Dimethoxyethane (Glyme) from Measurements of the Complexing Equilibria in the Gas Phase,
Can. J. Chem., 1976, 54, 16, 2594, https://doi.org/10.1139/v76-368
. [all data]
Meot-Ner (Mautner), 1983
Meot-Ner (Mautner), M.,
The Ionic Hydrogen Bond. 3. Multiple and -CH+...O- Bonds. Complexes of Ammonium Ions with Polyethers and Crown Ethers,
J. Am. Chem. Soc., 1983, 105, 15, 4912, https://doi.org/10.1021/ja00353a012
. [all data]
Meot-Ner (Mautner), Sieck, et al., 1996
Meot-Ner (Mautner), M.; Sieck, L.W.; Liebman, J.F.; Scheiner, S.,
Complexing of the Ammonium Ion by Polyethers. Comparative Complexing Thermochemistry of Ammonium, Hydronium, and Alkali Cations,
J. Phys. Chem., 1996, 100, 16, 6445, https://doi.org/10.1021/jp9514943
. [all data]
Koizumi, 2001
Koizumi, H.,
Collision-Induced Dissociation and Theoretical Studies of Cu+-Dimethoxyethane Complexes,
J. Am. Soc. Mass Spectrom., 2001, 12, 5, 480, https://doi.org/10.1016/S1044-0305(01)00242-2
. [all data]
Hunter and Lias, 1998
Hunter, E.P.; Lias, S.G.,
Evaluated Gas Phase Basicities and Proton Affinities of Molecules: An Update,
J. Phys. Chem. Ref. Data, 1998, 27, 3, 413-656, https://doi.org/10.1063/1.556018
. [all data]
Morlender-Vais and Holmes, 2001
Morlender-Vais, N.; Holmes, J.L.,
Proton affinities of two weakly bidentate molecules: 1,2-Dimethoxyethane and methoxyacetone,
Int. J. Mass Spectrom., 2001, 210/211, 147. [all data]
Baker, Armen, et al., 1983
Baker, A.D.; Armen, G.H.; Funaro, S.,
Oral levels of crown ethers and related macrocycles studies by ultraviolet photoelectron spectroscopy: Relationship to complexation studies,
J. Chem. Soc. Dalton Trans., 1983, 2519. [all data]
Kimura, Katsumata, et al., 1981
Kimura, K.; Katsumata, S.; Achiba, Y.; Yamazaki, T.; Iwata, S.,
Ionization energies, Ab initio assignments, and valence electronic structure for 200 molecules
in Handbook of HeI Photoelectron Spectra of Fundamental Organic Compounds, Japan Scientific Soc. Press, Tokyo, 1981. [all data]
Holmes and Lossing, 1984
Holmes, J.L.; Lossing, F.P.,
Heats of formation of organic radicals from appearance energies,
Int. J. Mass Spectrom. Ion Processes, 1984, 58, 113. [all data]
Lossing, 1977
Lossing, F.P.,
Heats of formation of some isomeric [CnH2n+1]+ ions. Substitutional effects on ion stability,
J. Am. Chem. Soc., 1977, 99, 7526. [all data]
García-Raso, Martínez-Castro, et al., 1987
García-Raso, A.; Martínez-Castro, I.; Páez, M.I.; Sanz, J.; García-Raso, J.; Saura-Calixto, F.,
Gas Chromatographic Behaviour of Carbohydrate Trimethylsilyl Ethers. I. Aldopentoses,
J. Chromatogr., 1987, 398, 9-20, https://doi.org/10.1016/S0021-9673(01)96491-X
. [all data]
Tiess, 1984
Tiess, D.,
Gaschromatographische Retentionsindices von 125 leicht- bis mittelflüchtigen organischen Substanzen toxikologisch-analytischer Relevanz auf SE-30,
Wiss. Z. Wilhelm-Pieck-Univ. Rostock Math. Naturwiss. Reihe, 1984, 33, 6-9. [all data]
Bogoslovsky, Anvaer, et al., 1978
Bogoslovsky, Yu.N.; Anvaer, B.I.; Vigdergauz, M.S.,
Chromatographic constants in gas chromatography (in Russian), Standards Publ. House, Moscow, 1978, 192. [all data]
Tsuge, Ohtan, et al., 2011
Tsuge, S.; Ohtan, H.; Watanabe, C.,
Pyrolysis - GC/MS Data Book of Synthetic Polymers, Elsevier, 2011, 420. [all data]
Chen, 2008
Chen, H.-F.,
Quantitative prediction of gas chromatography retention indices with support vector machines, radial basis neutral networks and multiple linear regression,
Anal. Chim. Acta, 2008, 609, 1, 24-36, https://doi.org/10.1016/j.aca.2008.01.003
. [all data]
Zenkevich, 1997
Zenkevich, I.G.,
Influence of the Variations of Dynamics Molecular Parameterts on the Additivity of Chromatigraphic Retention Indices of Products of Organic Reactions Relative to Initial Reagents,
Dokl. Akad. Nauk (Rus.), 1997, 353, 5, 625-627. [all data]
Zenkevich, 1995
Zenkevich, I.G.,
Calculation of Gas-Chromatographic Retention Indices from Physico-Chemical Constants of Organic Compounds,
Z. Anal. Chem., 1995, 50, 10, 1048-1056. [all data]
Keiko, Prokop'ev, et al., 1972
Keiko, V.V.; Prokop'ev, B.V.; Kuz'menko, L.P.; Kalinina, N.A.; Modonov, V.B.,
The use of an additive scheme of calculation of the indices of retention in gas-liquid chromatography communication. 3. Some regularities in the manifestation of the inductive effect,
Izv. Akad. Nauk Kaz. SSR Ser. Khim., 1972, 12, 2629-2633. [all data]
Shimadzu, 2012
Shimadzu, Pharmaceutical Related,
Analysis of pharmaceutical residual solvent (observation of separation) (1) - GC, 2012, retrieved from www.shimadzu.ru/applications/Applicationspdf/GC/Pharma/Pharmaceutical residual solvents GC.pdf. [all data]
Shimadzu Corporation, 2003
Shimadzu Corporation,
Analysis of pharmaceutical residual solvent (observation of separation), 2003, retrieved from http://www.shimadzu.com.br/analitica/aplicacoes/book/pharm69.pdf. [all data]