Butanal, oxime
- Formula: C4H9NO
- Molecular weight: 87.1204
- IUPAC Standard InChIKey: KGGVGTQEGGOZRN-UHFFFAOYSA-N
- CAS Registry Number: 110-69-0
- Chemical structure:
View 3d structure (requires JavaScript / HTML 5) - Other names: Butyraldehyde, oxime; n-Butyraldoxime; Butylaldoxime; Butyraldoxime; CH3(CH2)2CH=NOH; n-Butyraldehyde, oxime; USAF AM-6; Exkin 1; Exkin No. 1 anti-skinning agent; Skino No. 1; Troykyd anti-skin bto; UN 2840; Butanaldoxime; n-Butylaldoxime; NSC 1487

Phase change data

Data compiled as indicated in comments:
BS - Robert L. Brown and Stephen E. Stein
AC - William E. Acree, Jr., James S. Chickos
Reduced pressure boiling point
Tboil (K) | Pressure (bar) | Reference | Comment |
---|---|---|---|
425.2 | 0.953 | Weast and Grasselli, 1989 | BS |
Enthalpy of vaporization
ΔvapH (kJ/mol) | Temperature (K) | Method | Reference | Comment |
---|---|---|---|---|
55.8 | 328. | A | Stephenson and Malanowski, 1987 | Based on data from 313. to 343. K.; AC |

Gas phase ion energetics data

Data compiled by: Sharon G. Lias, Rhoda D. Levin, and Sherif A. Kafafi
Ionization energy determinations
IE (eV) | Method | Reference | Comment |
---|---|---|---|
9.5 | PE | Dargelos and Sandorfy, 1977 | |
9.93 | PE | Dargelos and Sandorfy, 1977 | Vertical value |

Normal alkane RI, non-polar column, temperature ramp

Column type | Active phase | I | Reference | Comment |
---|---|---|---|---|
Capillary | OV-101 | 793. | Zenkevich, 2005 | 25. m/0.20 mm/0.10 μm, N2/He, 6. K/min; Tstart: 50. C; Tend: 250. C |

References

Weast and Grasselli, 1989
CRC Handbook of Data on Organic Compounds, 2nd Editon, Weast,R.C and Grasselli, J.G., ed(s)., CRC Press, Inc., Boca Raton, FL, 1989, 1. [all data]
Stephenson and Malanowski, 1987
Stephenson, Richard M.; Malanowski, Stanislaw,
Handbook of the Thermodynamics of Organic Compounds, 1987, https://doi.org/10.1007/978-94-009-3173-2
. [all data]
Dargelos and Sandorfy, 1977
Dargelos, A.; Sandorfy, C.,
The photoelectron and far-ultraviolet absorption spectra of simple oximes,
J. Chem. Phys., 1977, 67, 3011. [all data]
Zenkevich, 2005
Zenkevich, I.G.,
Experimentally measured retention indices., 2005. [all data]