Trilithium trifluoride

Gas phase ion energetics data

Data compiled by: Sharon G. Lias and Joel F. Liebman

Appearance energy determinations

Ion AE (eV) Other Products MethodReferenceComment
LiF+16.402LiFEIVeljkovic, Neskovic, et al., 1993
LiF+15.40Li2F+FEIVeljkovic, Neskovic, et al., 1993
Li2F+14.47LiF+FEIVeljkovic, Neskovic, et al., 1993
Li+15.35Li2F+2FEIVeljkovic, Neskovic, et al., 1993
Li+16.822LiF+FEIVeljkovic, Neskovic, et al., 1993

References

Veljkovic, Neskovic, et al., 1993
Veljkovic, M.V.; Neskovic, O.M.; Miletic, M.B.; Zmbov, K.F., Mass spectrometric study of ionization and fragmentation of lithium fluoride vapor by electron impact, J. Serb. Chem. Soc., 1993, 58, 101. [all data]