Titanium, (η8-1,3,5,7-cyclooctatetraene)(η5-2,4-cyclopentadien-1-yl)-
- Formula: C13H13Ti
- Molecular weight: 217.109
- IUPAC Standard InChIKey: ZNVXOECCMAAZLE-UHFFFAOYSA-N
- CAS Registry Number: 11065-40-0
- Chemical structure:

Gas phase ion energetics data

Data compiled by: Sharon G. Lias, Rhoda D. Levin, and Sherif A. Kafafi
Ionization energy determinations
IE (eV) | Method | Reference | Comment |
---|---|---|---|
5.67 ± 0.05 | PE | Evans, Green, et al., 1974 | Vertical value |

References

Evans, Green, et al., 1974
Evans, S.; Green, J.C.; Jackson, S.E.; Higginson, B.,
He(I) photoelectron spectra of some transition-metal sandwich complexes,
J. Chem. Soc. Dalton Trans., 1974, 304. [all data]