1,4-Butanediol
- Formula: C4H10O2
- Molecular weight: 90.1210
- IUPAC Standard InChIKey: WERYXYBDKMZEQL-UHFFFAOYSA-N
- CAS Registry Number: 110-63-4
- Chemical structure:
View 3d structure (requires JavaScript / HTML 5) - Other names: Diol 14B; Sucol B; Tetramethylene glycol; 1,4-Butylene glycol; 1,4-Dihydroxybutane; 1,4-Tetramethylene glycol; Butane-1,4-diol; Butanediol; 1,4-BD; Tetramethylene 1,4-diol; BDO; Butylene glycol; Dabco BDO; Butane diol-1,4; NSC 406696

Gas phase thermochemistry data

Data compiled by: Hussein Y. Afeefy, Joel F. Liebman, and Stephen E. Stein
Quantity | Value | Units | Method | Reference | Comment |
---|---|---|---|---|---|
ΔfH°gas | -426.0 ± 5.7 | kJ/mol | Ccr | Knauth and Sabbah, 1990 | see Knauth and Sabbah, 1989 |
ΔfH°gas | -427. ± 3. | kJ/mol | Ccb | Gardner and Hussain, 1972 |

Condensed phase thermochemistry data

Data compiled as indicated in comments:
ALS - Hussein Y. Afeefy, Joel F. Liebman, and Stephen E. Stein
DH - Eugene S. Domalski and Elizabeth D. Hearing
Quantity | Value | Units | Method | Reference | Comment |
---|---|---|---|---|---|
ΔfH°liquid | -505.3 ± 5.7 | kJ/mol | Ccr | Knauth and Sabbah, 1990 | see Knauth and Sabbah, 1989; ALS |
ΔfH°liquid | -503. ± 2. | kJ/mol | Ccb | Gardner and Hussain, 1972 | ALS |
Quantity | Value | Units | Method | Reference | Comment |
ΔcH°liquid | -2495.5 ± 5.7 | kJ/mol | Ccr | Knauth and Sabbah, 1990 | see Knauth and Sabbah, 1989; Corresponding ΔfHºliquid = -507.7 kJ/mol (simple calculation by NIST; no Washburn corrections); ALS |
ΔcH°liquid | -2499.9 ± 2.0 | kJ/mol | Ccb | Gardner and Hussain, 1972 | Corresponding ΔfHºliquid = -503.25 kJ/mol (simple calculation by NIST; no Washburn corrections); ALS |
Quantity | Value | Units | Method | Reference | Comment |
S°liquid | 223.4 | J/mol*K | N/A | Nistratov, Babinkov, et al., 1979 | DH |
Constant pressure heat capacity of liquid
Cp,liquid (J/mol*K) | Temperature (K) | Reference | Comment |
---|---|---|---|
200.1 | 298.15 | Nistratov, Babinkov, et al., 1979 | T = 5 to 320 K.; DH |
178. | 297.79 | Petit and TerMinassian, 1974 | T = 297 to 470 K. Value is unsmoothed experimental datum.; DH |

Phase change data

Data compiled as indicated in comments:
BS - Robert L. Brown and Stephen E. Stein
TRC - Thermodynamics Research Center, NIST Boulder Laboratories, Chris Muzny director
AC - William E. Acree, Jr., James S. Chickos
DRB - Donald R. Burgess, Jr.
ALS - Hussein Y. Afeefy, Joel F. Liebman, and Stephen E. Stein
DH - Eugene S. Domalski and Elizabeth D. Hearing
Quantity | Value | Units | Method | Reference | Comment |
---|---|---|---|---|---|
Tboil | 503.2 | K | N/A | Aldrich Chemical Company Inc., 1990 | BS |
Tboil | 502.88 | K | N/A | Markovnik, Sachek, et al., 1981 | Uncertainty assigned by TRC = 0.05 K; TRC |
Tboil | 501.15 | K | N/A | Mellan, 1962 | Uncertainty assigned by TRC = 2. K; TRC |
Tboil | 503.15 | K | N/A | Mellan, 1962 | Uncertainty assigned by TRC = 2. K; TRC |
Tboil | 501.15 | K | N/A | Clendenning, Macdonald, et al., 1950 | Uncertainty assigned by TRC = 1. K; TRC |
Quantity | Value | Units | Method | Reference | Comment |
Tfus | 300. ± 40. | K | AVG | N/A | Average of 7 values; Individual data points |
Quantity | Value | Units | Method | Reference | Comment |
Ttriple | 289.9 | K | N/A | Knauth and Sabbah, 1990, 2 | Uncertainty assigned by TRC = 0.1 K; TRC |
Ttriple | 293.58 | K | N/A | Vasil'ev and Petrov, 1984 | Uncertainty assigned by TRC = 0.02 K; TRC |
Ttriple | 293.38 | K | N/A | Nistratov, Babinkov, et al., 1979, 2 | Uncertainty assigned by TRC = 0.1 K; TRC |
Ttriple | 293.58 | K | N/A | Nistratov, Babinkov, et al., 1979, 2 | Uncertainty assigned by TRC = 0.05 K; TRC |
Quantity | Value | Units | Method | Reference | Comment |
Tc | 727. | K | N/A | Wilson, Wilson, et al., 1996 | Uncertainty assigned by TRC = 3. K; TRC |
Quantity | Value | Units | Method | Reference | Comment |
Pc | 62.20 | bar | N/A | Wilson, Wilson, et al., 1996 | Uncertainty assigned by TRC = 1.50 bar; TRC |
Quantity | Value | Units | Method | Reference | Comment |
ΔvapH° | 78. ± 3. | kJ/mol | AVG | N/A | Average of 8 values; Individual data points |
Reduced pressure boiling point
Tboil (K) | Pressure (bar) | Reference | Comment |
---|---|---|---|
393.2 | 0.013 | Weast and Grasselli, 1989 | BS |
Enthalpy of vaporization
ΔvapH (kJ/mol) | Temperature (K) | Method | Reference | Comment |
---|---|---|---|---|
72. | 395. | A | Stephenson and Malanowski, 1987 | Based on data from 380. to 510. K.; AC |
77. ± 2. | 419. | V | Gardner and Hussain, 1972 | ALS |
Enthalpy of fusion
ΔfusH (kJ/mol) | Temperature (K) | Reference | Comment |
---|---|---|---|
18.700 | 293.58 | Nistratov, Babinkov, et al., 1979 | DH |
18.7 | 293.6 | Domalski and Hearing, 1996 | AC |
Entropy of fusion
ΔfusS (J/mol*K) | Temperature (K) | Reference | Comment |
---|---|---|---|
63.72 | 293.58 | Nistratov, Babinkov, et al., 1979 | DH |

Reaction thermochemistry data

Data compiled by: John E. Bartmess
Individual Reactions
C4H9O2- + =
By formula: C4H9O2- + H+ = C4H10O2
Quantity | Value | Units | Method | Reference | Comment |
---|---|---|---|---|---|
ΔrH° | 1490. ± 10. | kJ/mol | G+TS | Crowder and Bartmess, 1993 | gas phase; ΔGacid at 80°C |
Quantity | Value | Units | Method | Reference | Comment |
ΔrG° | 1484. ± 8.4 | kJ/mol | IMRE | Crowder and Bartmess, 1993 | gas phase; ΔGacid at 80°C |
ΔrG° | 1507.1 ± 1.3 | kJ/mol | CIDC | Houriet, Tabet, et al., 1984 | gas phase; value altered from reference due to change in acidity scale |
By formula: (Cl- • C4H10O2) + C4H10O2 = (Cl- • 2C4H10O2)
Quantity | Value | Units | Method | Reference | Comment |
---|---|---|---|---|---|
ΔrH° | 88.7 ± 3.3 | kJ/mol | TDAs | Zhang, Beglinger, et al., 1995 | gas phase |
Quantity | Value | Units | Method | Reference | Comment |
ΔrG° | 44.4 ± 4.2 | kJ/mol | TDAs | Zhang, Beglinger, et al., 1995 | gas phase |
By formula: Cl- + C4H10O2 = (Cl- • C4H10O2)
Quantity | Value | Units | Method | Reference | Comment |
---|---|---|---|---|---|
ΔrH° | 126. ± 7.1 | kJ/mol | TDAs | Zhang, Beglinger, et al., 1995 | gas phase |
Quantity | Value | Units | Method | Reference | Comment |
ΔrG° | 73.2 ± 4.2 | kJ/mol | TDAs | Zhang, Beglinger, et al., 1995 | gas phase |

Henry's Law data

Data compiled by: Rolf Sander
Henry's Law constant (water solution)
kH(T) = k°H exp(d(ln(kH))/d(1/T) ((1/T) - 1/(298.15 K)))
k°H = Henry's law constant for solubility in water at 298.15 K (mol/(kg*bar))
d(ln(kH))/d(1/T) = Temperature dependence constant (K)
k°H (mol/(kg*bar)) | d(ln(kH))/d(1/T) (K) | Method | Reference | Comment |
---|---|---|---|---|
>100000. | E | N/A | Value obtained by missing citation using the group contribution method. | |
<5.0×10+6 | E | N/A | Value obtained by missing citation using the group contribution method. |

Gas phase ion energetics data

Data evaluated as indicated in comments:
HL - Edward P. Hunter and Sharon G. Lias
Data compiled as indicated in comments:
B - John E. Bartmess
MM - Michael M. Meot-Ner (Mautner)
LBLHLM - Sharon G. Lias, John E. Bartmess, Joel F. Liebman, John L. Holmes, Rhoda D. Levin, and W. Gary Mallard
Quantity | Value | Units | Method | Reference | Comment |
---|---|---|---|---|---|
Proton affinity (review) | 915.6 | kJ/mol | N/A | Hunter and Lias, 1998 | HL |
Quantity | Value | Units | Method | Reference | Comment |
Gas basicity | 854.9 | kJ/mol | N/A | Hunter and Lias, 1998 | HL |
Proton affinity at 298K
Proton affinity (kJ/mol) | Reference | Comment |
---|---|---|
>875.0 | Bouchoux, Buisson, et al., 2003 | MM |
>871.7 | Bouchoux, Buisson, et al., 2003 | MM |
>884.3 ± 0.5 | Bouchoux, Buisson, et al., 2003 | MM |
Gas basicity at 298K
Gas basicity (review) (kJ/mol) | Reference | Comment |
---|---|---|
843.5 | Bouchoux, Buisson, et al., 2003 | MM |
841.2 | Bouchoux, Buisson, et al., 2003 | MM |
852.9 ± 0.5 | Bouchoux, Buisson, et al., 2003 | MM |
Appearance energy determinations
Ion | AE (eV) | Other Products | Method | Reference | Comment |
---|---|---|---|---|---|
C3H6+ | 11.1 ± 0.1 | H2O+CH2O | EI | Holmes, Mommers, et al., 1984 | LBLHLM |
C3H8O+ | 10.70 ± 0.05 | CH2O | EI | Holmes, Mommers, et al., 1984 | LBLHLM |
De-protonation reactions
C4H9O2- + =
By formula: C4H9O2- + H+ = C4H10O2
Quantity | Value | Units | Method | Reference | Comment |
---|---|---|---|---|---|
ΔrH° | 1490. ± 10. | kJ/mol | G+TS | Crowder and Bartmess, 1993 | gas phase; ΔGacid at 80°C; B |
Quantity | Value | Units | Method | Reference | Comment |
ΔrG° | 1484. ± 8.4 | kJ/mol | IMRE | Crowder and Bartmess, 1993 | gas phase; ΔGacid at 80°C; B |
ΔrG° | 1507.1 ± 1.3 | kJ/mol | CIDC | Houriet, Tabet, et al., 1984 | gas phase; value altered from reference due to change in acidity scale; B |

Ion clustering data

Data compiled by: John E. Bartmess
Clustering reactions
By formula: Cl- + C4H10O2 = (Cl- • C4H10O2)
Quantity | Value | Units | Method | Reference | Comment |
---|---|---|---|---|---|
ΔrH° | 126. ± 7.1 | kJ/mol | TDAs | Zhang, Beglinger, et al., 1995 | gas phase |
Quantity | Value | Units | Method | Reference | Comment |
ΔrG° | 73.2 ± 4.2 | kJ/mol | TDAs | Zhang, Beglinger, et al., 1995 | gas phase |
By formula: (Cl- • C4H10O2) + C4H10O2 = (Cl- • 2C4H10O2)
Quantity | Value | Units | Method | Reference | Comment |
---|---|---|---|---|---|
ΔrH° | 88.7 ± 3.3 | kJ/mol | TDAs | Zhang, Beglinger, et al., 1995 | gas phase |
Quantity | Value | Units | Method | Reference | Comment |
ΔrG° | 44.4 ± 4.2 | kJ/mol | TDAs | Zhang, Beglinger, et al., 1995 | gas phase |

Kovats' RI, non-polar column, isothermal

Column type | Active phase | Temperature (C) | I | Reference | Comment |
---|---|---|---|---|---|
Packed | Apiezon L | 160. | 900. | Bogoslovsky, Anvaer, et al., 1978 | Celite 545 |
Packed | SE-30 | 175. | 931. | Casteignau and Villessot, 1968 | Column length: 3. m |

Kovats' RI, polar column, isothermal

Column type | Active phase | Temperature (C) | I | Reference | Comment |
---|---|---|---|---|---|
Packed | PEG-2000 | 179. | 1890. | Anderson, Jurel, et al., 1973 | He, Celite 545 (44-60 mesh); Column length: 3. m |
Packed | PEG-2000 | 180. | 1911. | Anderson, Jurel, et al., 1973 | He, Celite 545 (44-60 mesh); Column length: 3. m |
Packed | PEG-2000 | 200. | 1870. | Anderson, Jurel, et al., 1973 | He, Celite 545 (44-60 mesh); Column length: 3. m |
Packed | PEG-2000 | 200. | 1911. | Anderson, Jurel, et al., 1973 | He, Celite 545 (44-60 mesh); Column length: 3. m |

Van Den Dool and Kratz RI, non-polar column, temperature ramp

Column type | Active phase | I | Reference | Comment |
---|---|---|---|---|
Capillary | DB-1 | 912.4 | Sun and Stremple, 2003 | 30. m/0.25 mm/0.25 μm, He, 3. K/min; Tstart: 40. C; Tend: 325. C |

Van Den Dool and Kratz RI, non-polar column, custom temperature program

Column type | Active phase | I | Reference | Comment |
---|---|---|---|---|
Capillary | DB-1 | 922. | Peng, 2000 | 15. m/0.53 mm/1. μm, He; Program: 40C(3min) => 8C/min => 200(1min) => 5C/min => 300C(25min) |

Normal alkane RI, polar column, custom temperature program

Column type | Active phase | I | Reference | Comment |
---|---|---|---|---|
Capillary | Carbowax 20M | 1861. | Shibamoto, 1987 | Program: not specified |

References

Knauth and Sabbah, 1990
Knauth, P.; Sabbah, R.,
Energetics of intra- and intermolecular bonds in ω-alkanediols (II) Thermochemical study of 1,2-ethanediol, 1,3-propanediol, 1,4-butanediol, and 1,5-pentanediol at 298.15K,
Struct. Chem., 1990, 1, 43-46. [all data]
Knauth and Sabbah, 1989
Knauth, P.; Sabbah, R.,
Combustion calorimetry on milligram samples of liquid substances with a CRMT rocking bomb calorimeter. Application to the study of ω-alkanediol at 298.15 K,
J. Chem. Thermodyn., 1989, 21, 203-210. [all data]
Gardner and Hussain, 1972
Gardner, P.J.; Hussain, K.S.,
The standard enthalpies of formation of some aliphatic diols,
J. Chem. Thermodyn., 1972, 4, 819-827. [all data]
Nistratov, Babinkov, et al., 1979
Nistratov, V.P.; Babinkov, A.G.; Shvetsova, K.G.; Lapteva, S.A.,
Heat capacity and termodynamic functions of tetramethyleneglycol,
Termodin. Org. Soedin., 1979, (8), 33-36. [all data]
Petit and TerMinassian, 1974
Petit, J.C.; TerMinassian, L.,
Measurements of (dV/dT)p, (dV/dP)T, and (dH/dT)p by flux calorimetry,
J. Chem. Thermodynam., 1974, 6, 1139-1152. [all data]
Aldrich Chemical Company Inc., 1990
Aldrich Chemical Company Inc.,
Catalog Handbook of Fine Chemicals, Aldrich Chemical Company, Inc., Milwaukee WI, 1990, 1. [all data]
Markovnik, Sachek, et al., 1981
Markovnik, V.S.; Sachek, A.I.; Peshchenko, A.D.; Shvaro, O.V.; Andreyevskii, D.N.,
Vapor pressure of some glycols
in Terodinamika Organ. Soedinenii., Gorkii, p 54, 1981. [all data]
Mellan, 1962
Mellan, I.,
Polyhydric Alcohols, Spartan Books: Washington, DC, 1962. [all data]
Clendenning, Macdonald, et al., 1950
Clendenning, K.A.; Macdonald, F.J.; Wright, D.E.,
Effects of position isomerism on the physical properties of glycols,
Can. J. Res., Sect. B, 1950, 28, 608-22. [all data]
Knauth and Sabbah, 1990, 2
Knauth, P.; Sabbah, R.,
Can. J. Chem., 1990, 68, 731. [all data]
Vasil'ev and Petrov, 1984
Vasil'ev, I.A.; Petrov, V.M.,
Thermodynamic Properties of Oxygen-containing Organic Compounds, Handbook, Soedinenii: Khimya, Leningrad, p 240, 1984. [all data]
Nistratov, Babinkov, et al., 1979, 2
Nistratov, V.P.; Babinkov, A.G.; Shvetsova, K.G.; Kapteva, S.A.,
Heat capacity and thermodynamic functions of tetramethylene glycol.,
Termodin. Org. Soedin., 1979, No. 8, 33. [all data]
Wilson, Wilson, et al., 1996
Wilson, L.C.; Wilson, H.L.; Wilding, W.V.; Wilson, G.M.,
Critical Point Measurements for Fourteen Compounds by a Static Method and a Flow Method,
J. Chem. Eng. Data, 1996, 41, 1252-4. [all data]
Weast and Grasselli, 1989
CRC Handbook of Data on Organic Compounds, 2nd Editon, Weast,R.C and Grasselli, J.G., ed(s)., CRC Press, Inc., Boca Raton, FL, 1989, 1. [all data]
Stephenson and Malanowski, 1987
Stephenson, Richard M.; Malanowski, Stanislaw,
Handbook of the Thermodynamics of Organic Compounds, 1987, https://doi.org/10.1007/978-94-009-3173-2
. [all data]
Domalski and Hearing, 1996
Domalski, Eugene S.; Hearing, Elizabeth D.,
Heat Capacities and Entropies of Organic Compounds in the Condensed Phase. Volume III,
J. Phys. Chem. Ref. Data, 1996, 25, 1, 1, https://doi.org/10.1063/1.555985
. [all data]
Crowder and Bartmess, 1993
Crowder, C.; Bartmess, J.,
The Gas Phase Acidities of Diols,
J. Am. Soc. Mass Spectrom., 1993, 4, 9, 723, https://doi.org/10.1016/1044-0305(93)80051-Y
. [all data]
Houriet, Tabet, et al., 1984
Houriet, R.; Tabet, J.-C.; Tchapla, A.,
Gas-phase Acidities of Aliphatic and Cyclic Diols,
Spectros. Int. J., (1984),, 1984, 3, 132.. [all data]
Zhang, Beglinger, et al., 1995
Zhang, W.; Beglinger, C.; Stone, J.A.,
High-pressure mass spectrometric study of the gas-phase association of Cl- with alpha,omega-diols,
J. Phys. Chem., 1995, 99, 30, 11673, https://doi.org/10.1021/j100030a009
. [all data]
Hunter and Lias, 1998
Hunter, E.P.; Lias, S.G.,
Evaluated Gas Phase Basicities and Proton Affinities of Molecules: An Update,
J. Phys. Chem. Ref. Data, 1998, 27, 3, 413-656, https://doi.org/10.1063/1.556018
. [all data]
Bouchoux, Buisson, et al., 2003
Bouchoux, G.; Buisson, D.A.; Bourcier, S.; Sablier, M.,
Application of the kinetic method to bifunctional bases. ESI tandem quadrupole experiments,
Int. J. Mass Spectrom., 2003, 228, 1035. [all data]
Holmes, Mommers, et al., 1984
Holmes, J.L.; Mommers, A.A.; Szulejko, J.E.; Terlouw, J.K.,
Two new stable [C3H8O]+ isomers: The radical cations [C3H6OH2]+,
J. Chem. Soc., Chem. Commun., 1984, 165. [all data]