Butane, 1,4-dichloro-
- Formula: C4H8Cl2
- Molecular weight: 127.012
- IUPAC Standard InChIKey: KJDRSWPQXHESDQ-UHFFFAOYSA-N
- CAS Registry Number: 110-56-5
- Chemical structure:
View 3d structure (requires JavaScript / HTML 5) - Other names: 1,4-Dichlorobutane; Tetramethylene chloride

Gas phase thermochemistry data

Data compiled by: Hussein Y. Afeefy, Joel F. Liebman, and Stephen E. Stein
Quantity | Value | Units | Method | Reference | Comment |
---|---|---|---|---|---|
ΔfH°gas | -183.4 ± 1.9 | kJ/mol | Ccb | An, He, et al., 1990 |

Condensed phase thermochemistry data

Data compiled as indicated in comments:
ALS - Hussein Y. Afeefy, Joel F. Liebman, and Stephen E. Stein
DH - Eugene S. Domalski and Elizabeth D. Hearing
Quantity | Value | Units | Method | Reference | Comment |
---|---|---|---|---|---|
ΔfH°liquid | -229.8 ± 1.9 | kJ/mol | Ccb | An, He, et al., 1990 | ALS |
ΔfH°liquid | -229.5 | kJ/mol | Eqk | Cherkasova, Rozhnov, et al., 1974 | ALS |
Quantity | Value | Units | Method | Reference | Comment |
ΔcH°liquid | -2534.8 ± 1.9 | kJ/mol | Ccb | An, He, et al., 1990 | ALS |
Constant pressure heat capacity of liquid
Cp,liquid (J/mol*K) | Temperature (K) | Reference | Comment |
---|---|---|---|
184.0 | 298.15 | Hallen, 1993 | DH |
183.59 | 298.15 | Lainez, Wilhelm, et al., 1985 | DH |

Phase change data

Data compiled as indicated in comments:
BS - Robert L. Brown and Stephen E. Stein
TRC - Thermodynamics Research Center, NIST Boulder Laboratories, Chris Muzny director
AC - William E. Acree, Jr., James S. Chickos
ALS - Hussein Y. Afeefy, Joel F. Liebman, and Stephen E. Stein
Quantity | Value | Units | Method | Reference | Comment |
---|---|---|---|---|---|
Tboil | 410. ± 80. | K | AVG | N/A | Average of 12 values; Individual data points |
Quantity | Value | Units | Method | Reference | Comment |
Tfus | 234.5 | K | N/A | Timmermans, 1922 | Uncertainty assigned by TRC = 0.4 K; TRC |
Quantity | Value | Units | Method | Reference | Comment |
ΔvapH° | 46.4 ± 0.2 | kJ/mol | AVG | N/A | Average of 8 values; Individual data points |
Enthalpy of vaporization
ΔvapH (kJ/mol) | Temperature (K) | Method | Reference | Comment |
---|---|---|---|---|
43.4 | 351. | A | Stephenson and Malanowski, 1987 | Based on data from 336. to 425. K. See also Dykyj, 1971.; AC |

Reaction thermochemistry data

Data compiled by: Hussein Y. Afeefy, Joel F. Liebman, and Stephen E. Stein
Individual Reactions
By formula: C4H8Cl2 = C4H8Cl2
Quantity | Value | Units | Method | Reference | Comment |
---|---|---|---|---|---|
ΔrH° | -9.9 ± 1.3 | kJ/mol | Eqk | Cherkasova, Rozhnov, et al., 1974 | gas phase |
By formula: C4H8Cl2 = C4H8Cl2
Quantity | Value | Units | Method | Reference | Comment |
---|---|---|---|---|---|
ΔrH° | -2.7 ± 0.67 | kJ/mol | Eqk | Cherkasova, Rozhnov, et al., 1974 | gas phase |

Henry's Law data

Data compiled by: Rolf Sander
Henry's Law constant (water solution)
kH(T) = k°H exp(d(ln(kH))/d(1/T) ((1/T) - 1/(298.15 K)))
k°H = Henry's law constant for solubility in water at 298.15 K (mol/(kg*bar))
d(ln(kH))/d(1/T) = Temperature dependence constant (K)
k°H (mol/(kg*bar)) | d(ln(kH))/d(1/T) (K) | Method | Reference |
---|---|---|---|
2.0 | 3100. | X | Leighton and Calo, 1981 |

Gas phase ion energetics data

Data compiled by: Sharon G. Lias, Rhoda D. Levin, and Sherif A. Kafafi
Ionization energy determinations
IE (eV) | Method | Reference |
---|---|---|
11.03 | PE | Baker, Betteridge, et al., 1971 |

Van Den Dool and Kratz RI, non-polar column, temperature ramp

Column type | Active phase | I | Reference | Comment |
---|---|---|---|---|
Capillary | DB-1 | 867.4 | Sun and Stremple, 2003 | 30. m/0.25 mm/0.25 μm, He, 3. K/min; Tstart: 40. C; Tend: 325. C |

Normal alkane RI, non-polar column, isothermal

Column type | Active phase | Temperature (C) | I | Reference | Comment |
---|---|---|---|---|---|
Capillary | Apiezon L | 130. | 895. | Arruda, Junkes, et al., 2008 |

Normal alkane RI, non-polar column, custom temperature program

Column type | Active phase | I | Reference | Comment |
---|---|---|---|---|
Capillary | Polydimethyl siloxanes | 874. | Zenkevich, Eliseenkov, et al., 2006 | Program: not specified |
Capillary | Polydimethyl siloxanes | 874. | Zenkevich, 2003 | Program: not specified |
Capillary | Methyl Silicone | 874. | Zenkevich and Marinichev, 2001 | Program: not specified |
Capillary | Methyl Silicone | 874. | Zenkevich, 1998 | Program: not specified |
Packed | Apiezon L | 898.1 | Keiko, Prokop'ev, et al., 1972 | Program: not specified |
Packed | Squalane | 894.1 | Keiko, Prokop'ev, et al., 1972 | Program: not specified |

References

An, He, et al., 1990
An, X.; He, J.; Hu, R.,
Study on the electrostatic interaction in organic chlorocompounds. Enthalpies of compustion and formation of 1,3- and 1,4-dichlorobutanes,
Thermochim. Acta, 1990, 169, 331-337. [all data]
Cherkasova, Rozhnov, et al., 1974
Cherkasova, R.I.; Rozhnov, A.M.; Nesterova, T.N.,
Equilibrium of isomerization of 1,2-, 1,3-, and 1,4-dichlorobutanes,
Russ. J. Phys. Chem. (Engl. Transl.), 1974, 48, 143. [all data]
Hallen, 1993
Hallen, D.,
Enthalpies of solution and heat capacities for some a,w-dichloroalkanes in water,
J. Chem. Thermodynam., 1993, 25, 519-524. [all data]
Lainez, Wilhelm, et al., 1985
Lainez, A.; Wilhelm, E.; Roux-Desgranges, G.; Grolier, J.-P.E.,
Excess molar quantities of (a halogenated n-alkane + an n-alkane). A comparative study of mixtures containing either 1-chlorobutane or 1,4-dichlorobutane,
J. Chem. Thermodynam., 1985, 17, 1153-1161. [all data]
Timmermans, 1922
Timmermans, J.,
Investigation of the Freezing Point of Organic Substances VII,
Bull. Soc. Chim. Belg., 1922, 31, 389. [all data]
Stephenson and Malanowski, 1987
Stephenson, Richard M.; Malanowski, Stanislaw,
Handbook of the Thermodynamics of Organic Compounds, 1987, https://doi.org/10.1007/978-94-009-3173-2
. [all data]
Dykyj, 1971
Dykyj, J.,
Petrochemia, 1971, 11, 2, 27. [all data]
Leighton and Calo, 1981
Leighton, D.T.; Calo, J.M.,
Distribution Coefficients of Chlorinated Hydrocarbons in Dilute Air-Water Systems for Groundwater Contamination Applications,
J. Chem. Eng. Data, 1981, 26, 382-385. [all data]
Baker, Betteridge, et al., 1971
Baker, A.D.; Betteridge, D.; Kemp, N.R.; Kirby, R.E.,
Application of photoelectron spectrometry to pesticide analysis. II.Photoelectron spectra of hydroxy-, and halo-alkanes and halohydrins,
Anal. Chem., 1971, 43, 375. [all data]
Sun and Stremple, 2003
Sun, G.; Stremple, P.,
Retention index characterization of flavor, fragrance, and many other compounds on DB-1 and DB-XLB, 2003, retrieved from http://www.chem.agilent.com/cag/cabu/pdf/b-0279.pdf. [all data]
Arruda, Junkes, et al., 2008
Arruda, A.C.S.; Junkes, B. da.S.; Souza, E.S.; Yunes, R.A.; Heizen, V.E.F.,
Semi-Emlirical Topological Index to Predict Properties of Halogenated Aliphatic Compounds,
J. Chemometrics, 2008, 22, 3-4, 186-194, https://doi.org/10.1002/cem.1121
. [all data]
Zenkevich, Eliseenkov, et al., 2006
Zenkevich, I.G.; Eliseenkov, E.V.; Kasatochkin, A.N.,
Application of Retention Indices in GC-MS Identification of Halogenated Organic Compounds,
Mass Spectromery (Rus.), 2006, 3, 2, 131-140. [all data]
Zenkevich, 2003
Zenkevich, I.G.,
Criteria for Evaluation of Elution Order of Isomeric Organic Compounds,
Zh. Phys. Khim. (Rus.), 2003, 77, 1, 92-98. [all data]
Zenkevich and Marinichev, 2001
Zenkevich, I.G.; Marinichev, A.N.,
Comparison of Topological and Dynamics Molecular Characteristics for Precalculation of Chromatographic Retention Parameters of Organic Compounds (in Russian),
Zh. Struct. Khim., 2001, 42, 5, 893-902. [all data]
Zenkevich, 1998
Zenkevich, I.G.,
Reciprocally Unambiguous Conformity Between GC Retention Indices and Boiling Points within Two- and Multidimensional Taxonomic Groups of Organic Compounds,
J. Hi. Res. Chromatogr., 1998, 21, 10, 565-568, https://doi.org/10.1002/(SICI)1521-4168(19981001)21:10<565::AID-JHRC565>3.0.CO;2-6
. [all data]
Keiko, Prokop'ev, et al., 1972
Keiko, V.V.; Prokop'ev, B.V.; Kuz'menko, L.P.; Kalinina, N.A.; Modonov, V.B.,
The use of an additive scheme of calculation of the indices of retention in gas-liquid chromatography communication. 3. Some regularities in the manifestation of the inductive effect,
Izv. Akad. Nauk Kaz. SSR Ser. Khim., 1972, 12, 2629-2633. [all data]