Isobutyl acetate
- Formula: C6H12O2
- Molecular weight: 116.1583
- IUPAC Standard InChIKey: GJRQTCIYDGXPES-UHFFFAOYSA-N
- CAS Registry Number: 110-19-0
- Chemical structure:
View 3d structure (requires JavaScript / HTML 5) - Other names: Acetic acid, 2-methylpropyl ester; Acetic acid, isobutyl ester; β-Methylpropyl ethanoate; 2-Methylpropyl acetate; 2-Methyl-1-propyl acetate; Acetate d'isobutyle; Isobutyl ethanoate; 2-Methylpropyl ethanoate; Isobutylester kyseliny octove; UN 1213; 2-Methyl-1-propanol, acetate; i-Butyl acetate; NSC 8035; Isobutyl acetate fcc

Reaction thermochemistry data

Data compiled by: Hussein Y. Afeefy, Joel F. Liebman, and Stephen E. Stein
Individual Reactions
By formula: C2H2O + C4H10O = C6H12O2
Quantity | Value | Units | Method | Reference | Comment |
---|---|---|---|---|---|
ΔrH° | -143.8 | kJ/mol | Cm | Rice and Greenberg, 1934 | liquid phase |

Gas phase ion energetics data

Data compiled by: Henry M. Rosenstock, Keith Draxl, Bruce W. Steiner, and John T. Herron
Ionization energy determinations
IE (eV) | Method | Reference |
---|---|---|
9.97 | PI | Watanabe, Nakayama, et al., 1962 |

Condensed phase thermochemistry data

Data compiled as indicated in comments:
ALS - Hussein Y. Afeefy, Joel F. Liebman, and Stephen E. Stein
DH - Eugene S. Domalski and Elizabeth D. Hearing
Quantity | Value | Units | Method | Reference | Comment |
---|---|---|---|---|---|
ΔcH°liquid | -844.7 | kcal/mol | Ccb | Schjanberg, 1935 | Corresponding ΔfHºliquid = -129.5 kcal/mol (simple calculation by NIST; no Washburn corrections); ALS |
Constant pressure heat capacity of liquid
Cp,liquid (cal/mol*K) | Temperature (K) | Reference | Comment |
---|---|---|---|
57.41 | 290. | Kurnakov and Voskresenskaya, 1936 | DH |

Phase change data

Data compiled as indicated in comments:
TRC - Thermodynamics Research Center, NIST Boulder Laboratories, Chris Muzny director
BS - Robert L. Brown and Stephen E. Stein
ALS - Hussein Y. Afeefy, Joel F. Liebman, and Stephen E. Stein
AC - William E. Acree, Jr., James S. Chickos
Quantity | Value | Units | Method | Reference | Comment |
---|---|---|---|---|---|
Tboil | 390. ± 1. | K | AVG | N/A | Average of 25 out of 26 values; Individual data points |
Quantity | Value | Units | Method | Reference | Comment |
Tfus | 240.15 | K | N/A | Timmermans, 1952 | Uncertainty assigned by TRC = 0.5 K; TRC |
Quantity | Value | Units | Method | Reference | Comment |
Tc | 560.8 | K | N/A | Quadri and Kudchadker, 1991 | Uncertainty assigned by TRC = 0.6 K; TRC |
Tc | 561.5 | K | N/A | Nadezhdin, 1887 | Uncertainty assigned by TRC = 2. K; TRC |
Tc | 569.0 | K | N/A | Pawlewski, 1882 | Uncertainty assigned by TRC = 5. K; TRC |
Quantity | Value | Units | Method | Reference | Comment |
Pc | 29.71 | atm | N/A | Quadri and Kudchadker, 1991 | Uncertainty assigned by TRC = 0.20 atm; TRC |
Pc | 31.38 | atm | N/A | Nadezhdin, 1887 | Uncertainty assigned by TRC = 0.6000 atm; TRC |
Quantity | Value | Units | Method | Reference | Comment |
ρc | 2.42 | mol/l | N/A | Nadezhdin, 1887 | Uncertainty assigned by TRC = 0.07 mol/l; TRC |
Quantity | Value | Units | Method | Reference | Comment |
ΔvapH° | 8.57 ± 0.01 | kcal/mol | V | Mathews, 1926 | ALS |
Enthalpy of vaporization
ΔvapH (kcal/mol) | Temperature (K) | Method | Reference | Comment |
---|---|---|---|---|
9.54 | 323. | N/A | Montón, Muñoz, et al., 2005 | Based on data from 308. to 391. K.; AC |
9.37 | 340. | N/A | Burguet, Montón, et al., 1996 | Based on data from 325. to 393. K.; AC |
9.51 | 267. | A | Stephenson and Malanowski, 1987 | Based on data from 252. to 391. K. See also Stull, 1947.; AC |
Antoine Equation Parameters
log10(P) = A − (B / (T + C))
P = vapor pressure (atm)
T = temperature (K)
View plot Requires a JavaScript / HTML 5 canvas capable browser.
Temperature (K) | A | B | C | Reference | Comment |
---|---|---|---|---|---|
252.0 to 391. | 4.53105 | 1625.875 | -32.494 | Stull, 1947 | Coefficents calculated by NIST from author's data. |

Henry's Law data

Data compiled by: Rolf Sander
Henry's Law constant (water solution)
kH(T) = k°H exp(d(ln(kH))/d(1/T) ((1/T) - 1/(298.15 K)))
k°H = Henry's law constant for solubility in water at 298.15 K (mol/(kg*bar))
d(ln(kH))/d(1/T) = Temperature dependence constant (K)
k°H (mol/(kg*bar)) | d(ln(kH))/d(1/T) (K) | Method | Reference |
---|---|---|---|
2.2 | V | N/A |

Normal alkane RI, non-polar column, custom temperature program

Data compiled by: NIST Mass Spectrometry Data Center, William E. Wallace, director

Column type CapillaryCapillaryCapillaryCapillaryCapillary
Active phase CP-Sil 5 CBPolydimethyl siloxane with 5 % Ph groupsPolydimethyl siloxane with 5 % Ph groupsDB-5HP-5
Column length (m) 50.  30.30.
Carrier gas Nitrogen  Hydrogen
Substrate
Column diameter (mm) 0.32  0.320.25
Phase thickness (μm) 1.20  0.500.25
Program 36 0C 20 0C/min -> 85 0C 1 0C/min -> 145 0C 3 0C/min -> 250 0C (30 min)not specifiednot specified40 0C (5 min) 4 0C/min -> 100 0C 6 0C/min -> 220 0C (20 min)40 0C (2 min) 5 0C/min -> 80 0C 7 oC/min -> 160 0C 9 0C/min -> 200 0C 20 0C/min -> 280 0C (10 min)
I 730.780.782.771.772.
ReferenceCollin, Nizet, et al., 2012Robinson, Adams, et al., 2012Robinson, Adams, et al., 2012San-Juan, Petka, et al., 2010Zhao, Li, et al., 2008
Comment MSDC-RI MSDC-RI MSDC-RI MSDC-RI MSDC-RI
Column type CapillaryCapillaryCapillaryCapillaryCapillary
Active phase HP-5DB-5Methyl SiliconeVB-5SE-30
Column length (m) 30.30. 60.
Carrier gas    He
Substrate
Column diameter (mm) 0.250.25 0.25
Phase thickness (μm) 0.250.25 1.
Program not specified50C(1min) => 5C/min => 100C => 10C/min => 250C (9min)not specified35C(1min) => 4C/min => 175C => 10C/min => 260Cnot specified
I 781.768.750.772.750.
ReferenceZhao, Li, et al., 2008Beaulieu and Lancaster, 2007Chen and Feng, 2007Karlshøj, Nielsen, et al., 2007Liu, Liang, et al., 2007
Comment MSDC-RI MSDC-RI MSDC-RI MSDC-RI MSDC-RI
Column type CapillaryCapillaryCapillaryCapillaryCapillary
Active phase DB-5SE-30HP-5HP-5BPX-5
Column length (m) 60. 30.30.60.
Carrier gas     He
Substrate
Column diameter (mm) 0.25 0.250.250.32
Phase thickness (μm) 0.25 0.250.251.
Program 50C => 5C/min => 100C => 15C/min => 250C (19C)not specified40C(6min) => 2.5C/min => 150C => 90C/min => 250C40C(6min) => 2.5C/min => 150C => 90C/min => 250C40C (4min) => 2C/min => 90C => 4C/min => 130C => 8C/min => 250 C (10min)
I 768.758.753.767.772.
ReferenceBeaulieu, 2005Vinogradov, 2004Jordán, Margaría, et al., 2003Jordán, Margaría, et al., 2003Machiels, van Ruth, et al., 2003
Comment MSDC-RI MSDC-RI MSDC-RI MSDC-RI MSDC-RI
Column type CapillaryCapillaryCapillaryCapillaryCapillary
Active phase HP-5HP-5MFE-73HP-5Methyl Silicone
Column length (m) 30.30.30.30.
Carrier gas   H2
Substrate
Column diameter (mm) 0.250.250.320.25
Phase thickness (μm) 0.250.250.10.25
Program not specifiednot specified40C(5min) => 2C/min => 120C => 10C/min => 210C(30min)40C (6min) => 2.5C/min => 150C => 90C/min => 250Cnot specified
I 753.758.775.749.758.
ReferenceJordán, Goodner, et al., 2002Jordán, Goodner, et al., 2002Aznar, López, et al., 2001Jordán, Shaw, et al., 2001Estrada and Gutierrez, 1999
Comment MSDC-RI MSDC-RI MSDC-RI MSDC-RI MSDC-RI
Column type CapillaryCapillaryCapillaryCapillaryCapillary
Active phase SPB-1DB-1DB-1SPB-1SPB-1
Column length (m) 60.60.60.60.60.
Carrier gas He  HeliumHelium
Substrate
Column diameter (mm) 0.530.320.320.530.53
Phase thickness (μm) 5.0.250.255.05.0
Program 40C(6min) => 5C/min => 80C => 10C/min => 200Cnot specified3 min at 5 C; 5 - 50 C at 3 deg/min; 50 - 220 C at 5 deg/min40 0C (6 min) 5 0C/min -> 80 0C 10 0C/min -> 200 0Cnot specified
I 759.762.762.759.754.
ReferenceFlanagan, Streete, et al., 1997Ciccioli, Cecinato, et al., 1994Ciccioli, Brancaleoni, et al., 1993Strete, Ruprah, et al., 1992Strete, Ruprah, et al., 1992
Comment MSDC-RI MSDC-RI MSDC-RI MSDC-RI MSDC-RI
Column type CapillaryCapillaryCapillaryCapillaryCapillary
Active phase DB-1DB-1OV-101OV-101OV-1, SE-30, Methyl silicone, SP-2100, OV-101, DB-1, etc.
Column length (m) 30.30.50.50.50.
Carrier gas H2H2HeHeHydrogen
Substrate
Column diameter (mm) 0.250.250.240.240.32
Phase thickness (μm) 0.250.25
Program 30C (2min) => 2C/min => 150C => 4C/min => 250C30C (2min) => 2C/min => 150C => 4C/min => 250Cnot specifiednot specifiednot specified
I 750.755.748.758.749.
ReferenceTakeoka, Flath, et al., 1988Takeoka, Flath, et al., 1988Zenkevich and Malamakhov, 1987Zenkevich and Malamakhov, 1987Waggott and Davies, 1984
Comment MSDC-RI MSDC-RI MSDC-RI MSDC-RI MSDC-RI
Column type CapillaryCapillaryCapillaryCapillary
Active phase OV-1, SE-30, Methyl silicone, SP-2100, OV-101, DB-1, etc.OV-1, SE-30, Methyl silicone, SP-2100, OV-101, DB-1, etc.OV-1, SE-30, Methyl silicone, SP-2100, OV-101, DB-1, etc.OV-1
Column length (m) 50.50.50.
Carrier gas HydrogenHydrogenHydrogen
Substrate
Column diameter (mm) 0.320.320.32
Phase thickness (μm)
Program not specifiednot specifiednot specifiednot specified
I 746.748.750.753.
ReferenceWaggott and Davies, 1984Waggott and Davies, 1984Waggott and Davies, 1984Ramsey and Flanagan, 1982
Comment MSDC-RI MSDC-RI MSDC-RI MSDC-RI

Normal alkane RI, non-polar column, temperature ramp

Data compiled by: NIST Mass Spectrometry Data Center, William E. Wallace, director

Column type CapillaryCapillaryCapillaryCapillaryCapillary
Active phase HP-5 MSDB-5DB-5DB-5HP-5
Column length (m) 30.30.30.30.60.
Carrier gas HeliumHeHe He
Substrate
Column diameter (mm) 0.250.320.320.250.32
Phase thickness (μm) 0.250.251.0.250.25
Tstart (C) 40.40.40.40.30.
Tend (C) 250.250.250.240.260.
Heat rate (K/min) 4.4.4.4.2.
Initial hold (min) 2.2.2.2.2.
Final hold (min) 5.5.15. 28.
I 749.770.770.767.779.5
ReferenceRaffo, Kelderer, et al., 2009Xu, Fan, et al., 2007Fan and Qian, 2006El-Sayed, Heppelthwaite, et al., 2005Leffingwell and Alford, 2005
Comment MSDC-RI MSDC-RI MSDC-RI MSDC-RI MSDC-RI
Column type CapillaryCapillaryCapillaryCapillaryCapillary
Active phase BP-1Methyl SiliconeHP-1HP-1HP-5
Column length (m) 50.50.25.25.
Carrier gas HeH2
Substrate
Column diameter (mm) 0.220.250.320.32
Phase thickness (μm) 0.750.5
Tstart (C) 50.40.35.35.35.
Tend (C) 200.260.250.250.200.
Heat rate (K/min) 5.4.4.4.6.
Initial hold (min)  0.5  2.
Final hold (min)
I 757.764.760.760.770.
ReferenceHealth Safety Executive, 2000Vendramini and Trugo, 2000Ong and Acree, 1998Ong, Acree, et al., 1998Larsen and Frisvad, 1995
Comment MSDC-RI MSDC-RI MSDC-RI MSDC-RI MSDC-RI
Column type CapillaryCapillaryCapillaryCapillaryCapillary
Active phase DB-5DB-1DB-1DB-1DB-1
Column length (m) 60.30.30.30.30.
Carrier gas HeHeHeHeHe
Substrate
Column diameter (mm) 0.250.250.250.250.25
Phase thickness (μm) 0.250.250.250.250.25
Tstart (C) 40.50.50.50.50.
Tend (C) 200.240.240.240.240.
Heat rate (K/min) 3.3.3.5.5.
Initial hold (min) 2.5.5.3.3.
Final hold (min)
I 758.744.745.743.744.
ReferenceShimoda, Shibamoto, et al., 1993Shiota, 1993Shiota, 1993Shiota, 1993Shiota, 1993
Comment MSDC-RI MSDC-RI MSDC-RI MSDC-RI MSDC-RI
Column type CapillaryCapillaryCapillaryCapillaryCapillary
Active phase DB-1DB-1DB-1DB-1SE-30
Column length (m) 30.30.60.60.200.
Carrier gas HeHeHeHeN2
Substrate
Column diameter (mm) 0.250.250.320.320.6
Phase thickness (μm) 1.01.0
Tstart (C) 40.40.30.30.20.
Tend (C) 250.250.210.210.220.
Heat rate (K/min) 3.3.2.2.2.
Initial hold (min)   4.4.
Final hold (min) 30.30.
I 754.758.764.764.758.
ReferencePeppard, 1992Peppard, 1992Takeoka and Butter, 1989Takeoka and Butter, 1989Dirinck, de Pooter, et al., 1981
Comment MSDC-RI MSDC-RI MSDC-RI MSDC-RI MSDC-RI

Van Den Dool and Kratz RI, non-polar column, temperature ramp

Data compiled by: NIST Mass Spectrometry Data Center, William E. Wallace, director

Column type CapillaryCapillaryCapillaryCapillaryCapillary
Active phase 5 % Phenyl methyl siloxaneDB-5SPB-5Petrocol DHCP Sil 5 CB
Column length (m) 30.30.30.50.50.
Carrier gas  N2HeHeHe
Substrate
Column diameter (mm) 0.250.320.530.250.32
Phase thickness (μm) 0.251.1.50.50.4
Tstart (C) 60.40.100.35.60.
Tend (C) 270.230.250.200.280.
Heat rate (K/min) 15.4.5.3.3.
Initial hold (min)  2. 10.10.
Final hold (min) 15.10. 10.60.
I 783.788.753.767.2741.
ReferenceZaikin, 2010Fang and Qian, 2005Rodríguez-Burruezo, Kollmannsberger, et al., 2004Censullo, Jones, et al., 2003Pino and Marbot, 2001
Comment MSDC-RI MSDC-RI MSDC-RI MSDC-RI MSDC-RI
Column type CapillaryCapillaryCapillaryCapillaryCapillary
Active phase CP Sil 5 CBHP-5DB-5DB-1DB-1
Column length (m) 50.30.20.30.60.
Carrier gas HeHeHeHeHe
Substrate
Column diameter (mm) 0.320.250.250.320.248
Phase thickness (μm) 0.4  5.0.25
Tstart (C) 60.50.50.35.50.
Tend (C) 280.200.350.270.250.
Heat rate (K/min) 3.4.5.510.5.
Initial hold (min) 10.1. 1.
Final hold (min) 60.
I 741.781.779.756.755.
ReferencePino, Marbot, et al., 2001Shalit, Katzir, et al., 2001Komárek, Richter, et al., 1998Bartelt, 1997Lee, DeMilo, et al., 1997
Comment MSDC-RI MSDC-RI MSDC-RI MSDC-RI MSDC-RI
Column type CapillaryCapillaryCapillaryCapillaryCapillary
Active phase DB-1DB-1DB-5OV-101OV-101
Column length (m) 60.60.0.3226.26.
Carrier gas HeHeH2
Substrate
Column diameter (mm) 0.2480.2481.0.260.26
Phase thickness (μm) 0.250.25 0.30.3
Tstart (C) 50.50.30.100.60.
Tend (C) 250.250.180.240.240.
Heat rate (K/min) 5.5.1.52.2.
Initial hold (min)   5.
Final hold (min)
I 755.755.770.745.3748.4
ReferenceLee, DeMilo, et al., 1997Lee, DeMilo, et al., 1997Guichard and Souty, 1988Wang and Sun, 1987Wang and Sun, 1987
Comment MSDC-RI MSDC-RI MSDC-RI MSDC-RI MSDC-RI
Column type CapillaryCapillaryCapillaryCapillaryCapillary
Active phase OV-101OV-101OV-101OV-101OV-101
Column length (m) 26.21.521.526.524.
Carrier gas
Substrate
Column diameter (mm) 0.260.270.270.250.26
Phase thickness (μm) 0.32.0.140.140.5
Tstart (C) 60.60.60.70.80.
Tend (C) 240.240.240.240.240.
Heat rate (K/min) 8.6.6.9.6.
Initial hold (min)    4.08
Final hold (min)
I 749.7752.1749.8748.7754.45
ReferenceWang and Sun, 1987Wang and Sun, 1987Wang and Sun, 1987Wang and Sun, 1987, 2Wang, Zhong, et al., 1987
Comment MSDC-RI MSDC-RI MSDC-RI MSDC-RI MSDC-RI
Column type CapillaryCapillaryCapillaryCapillaryCapillary
Active phase OV-1OV-1OV-101OV-101OV-101
Column length (m) 30.30.50.50.50.
Carrier gas HeHe
Substrate
Column diameter (mm) 0.50.50.270.270.27
Phase thickness (μm) 0.80.8
Tstart (C) 40.40.110.125.80.
Tend (C) 220.220.
Heat rate (K/min) 2.2.2.2.3.
Initial hold (min)
Final hold (min)
I 754.754.747.746.750.
ReferenceDe Pooter, Omar, et al., 1985De Pooter, Omar, et al., 1985Wang and Sun, 1985Wang and Sun, 1985Wang and Sun, 1985
Comment MSDC-RI MSDC-RI MSDC-RI MSDC-RI MSDC-RI
Column type CapillaryCapillaryCapillaryCapillaryCapillary
Active phase OV-101OV-101SE-30SE-30SE-52
Column length (m) 50.50.25.25.150.
Carrier gas     He
Substrate
Column diameter (mm) 0.270.270.30.30.6
Phase thickness (μm)
Tstart (C) 80.95.50.50.10.
Tend (C)     200.
Heat rate (K/min) 4.2.6.6.1.
Initial hold (min)
Final hold (min)
I 750.748.749.749.782.
ReferenceWang and Sun, 1985Wang and Sun, 1985Korhonen, 1984Korhonen, 1984de Pooter, Montens, et al., 1983
Comment MSDC-RI MSDC-RI MSDC-RI MSDC-RI MSDC-RI

Kovats' RI, non-polar column, isothermal

Data compiled by: NIST Mass Spectrometry Data Center, William E. Wallace, director

Column type CapillaryCapillaryCapillaryPackedCapillary
Active phase OV-1HP-101SPB-1SE-30OV-101
Column length (m)  50.60.3.15.
Carrier gas  H2N2ArN2
Substrate    Gas Chrom Q (80-100 mesh)
Column diameter (mm)  0.20.75 0.22
Phase thickness (μm)  0.2
Temperature (C) 333.60.60.150.80.
I 757.7758.98757.755.757.2
ReferenceHu, Lu, et al., 2006Garay, 2000Castello, Vezzani, et al., 1991Tiess, 1984Komárek, Hornová, et al., 1982
Comment MSDC-RI MSDC-RI MSDC-RI MSDC-RI MSDC-RI
Column type PackedPackedPackedPacked
Active phase SE-30SE-30SE-30SE-30
Column length (m) 3.73.2.3.7
Carrier gas  N2
Substrate Celaton (62-72 mesh)Chromosorb W AW (60-80 mesh)Chromosorb WCelite 560
Column diameter (mm)
Phase thickness (μm)
Temperature (C) 150.100.100.150.
I 750.768.758.750.
ReferenceAshes and Haken, 1974Chastrette, Heintz, et al., 1974Zarazir, Chovin, et al., 1970Germaine and Haken, 1969
Comment MSDC-RI MSDC-RI MSDC-RI MSDC-RI

Kovats' RI, non-polar column, temperature ramp

Data compiled by: NIST Mass Spectrometry Data Center, William E. Wallace, director

Column type CapillaryCapillaryCapillaryCapillaryCapillary
Active phase CBP-1DB-1DB-1DB-1DB-1
Column length (m) 25.60.60.60.60.
Carrier gas HeHeHeHeHe
Substrate
Column diameter (mm) 0.20.320.320.320.32
Phase thickness (μm) 0.250.250.250.250.25
Tstart (C) 50.30.30.30.30.
Tend (C) 200.210.210.210.210.
Heat rate (K/min) 4.2.2.2.2.
Initial hold (min) 5.4.4.4.4.
Final hold (min)
I 762.764.763.764.763.
ReferenceShimadzu, 2003Takeoka, Buttery, et al., 1992Takeoka, Buttery, et al., 1992Takeoka, Buttery, et al., 1992Takeoka, Buttery, et al., 1992
Comment MSDC-RI MSDC-RI MSDC-RI MSDC-RI MSDC-RI
Column type CapillaryCapillary
Active phase OV-101OV-101
Column length (m) 50.50.
Carrier gas
Substrate
Column diameter (mm) 0.230.23
Phase thickness (μm)
Tstart (C) 80.80.
Tend (C) 200.200.
Heat rate (K/min) 2.2.
Initial hold (min)
Final hold (min)
I 758.760.
ReferenceOhnishi and Shibamoto, 1984Ohnishi and Shibamoto, 1984
Comment MSDC-RI MSDC-RI

Kovats' RI, polar column, temperature ramp

Data compiled by: NIST Mass Spectrometry Data Center, William E. Wallace, director

Column type CapillaryCapillaryCapillaryCapillary
Active phase CBP-20BP-20DB-WaxCarbowax 20M
Column length (m) 25.25.30.150.
Carrier gas He N2He
Substrate
Column diameter (mm) 0.20.320.250.64
Phase thickness (μm) 0.25
Tstart (C) 50.70.60.50.
Tend (C) 200.200.200.170.
Heat rate (K/min) 4.4.2.1.
Initial hold (min) 5.2.10.
Final hold (min)
I 1013.1033.1018.1020.
ReferenceShimadzu, 2003Wyllie and Leach, 1990Umano, Shoji, et al., 1986Buttery, Seifert, et al., 1982
Comment MSDC-RI MSDC-RI MSDC-RI MSDC-RI

Normal alkane RI, non-polar column, isothermal

Data compiled by: NIST Mass Spectrometry Data Center, William E. Wallace, director

Column type CapillaryPackedPacked
Active phase DB-1SE-30DC-400
Column length (m) 60. 3.0
Carrier gas He Helium
Substrate   Gas-Pak (60-80 mesh)
Column diameter (mm) 0.32
Phase thickness (μm) 1.
Temperature (C) 60.70.150.
I 757.766.734.
ReferenceShimadzu, 2003Yabumoto, Jennings, et al., 1977Anderson, 1968
Comment MSDC-RI MSDC-RI MSDC-RI

Kovats' RI, non-polar column, custom temperature program

Data compiled by: NIST Mass Spectrometry Data Center, William E. Wallace, director

Column type CapillaryCapillary
Active phase DB-5MSSE-30
Column length (m) 30.
Carrier gas He
Substrate
Column diameter (mm) 0.25
Phase thickness (μm) 0.25
Program 40C => 2C/min => 60C => 4C/min => 260Cnot specified
I 764.750.
ReferenceMaia, Andrade, et al., 2000Chretien and Dubois, 1978
Comment MSDC-RI MSDC-RI

References

Rice and Greenberg, 1934
Rice, F.O.; Greenberg, J.,
Ketene. III. Heat of formation and heat of reaction with alcohols,
J. Am. Chem. Soc., 1934, 38, 2268-2270. [all data]
Watanabe, Nakayama, et al., 1962
Watanabe, K.; Nakayama, T.; Mottl, J.,
Ionization potentials of some molecules,
J. Quant. Spectry. Radiative Transfer, 1962, 2, 369. [all data]