1,2-Ethanediamine, N,N,N',N'-tetramethyl-
- Formula: C6H16N2
- Molecular weight: 116.2046
- IUPAC Standard InChIKey: KWYHDKDOAIKMQN-UHFFFAOYSA-N
- CAS Registry Number: 110-18-9
- Chemical structure:
View 3d structure (requires JavaScript / HTML 5) - Other names: Ethylenediamine, N,N,N',N'-tetramethyl-; Dimethyl[2-(dimethylamino)ethyl]amine; N,N,N',N'-Tetramethyl-1,2-diaminoethane; N,N,N',N'-Tetramethyl-1,2-ethanediamine; N,N,N',N'-Tetramethylethanediamine; N,N,N',N'-Tetramethylethylenediamine; Tetramethyldiaminoethane; 1,2-Bis(dimethylamino)ethane; (CH3)2NCH2CH2N(CH3)2; N,N,N1,N1-Tetramethylethylenediamine; Temed; 1,2-Di-(dimethylamino)ethane; Propamine D; Tetrameen; Tetramethyl ethylene diamine; TMEDA; UN 2372; 1,2-Diaminoethane, N,N,N',N'-tetramethyl-; N,N,N',N'-Tetramethylethenediamine; 1,2-Ethanediamine, N1,N1,N2,N2-tetramethyl-

Phase change data

Data compiled as indicated in comments:
BS - Robert L. Brown and Stephen E. Stein
TRC - Thermodynamics Research Center, NIST Boulder Laboratories, Chris Muzny director
AC - William E. Acree, Jr., James S. Chickos
Quantity | Value | Units | Method | Reference | Comment |
---|---|---|---|---|---|
Tboil | 394.2 | K | N/A | Weast and Grasselli, 1989 | BS |
Quantity | Value | Units | Method | Reference | Comment |
Tfus | 214.5 | K | N/A | Anonymous, 1959 | Uncertainty assigned by TRC = 0.6 K; TRC |
Quantity | Value | Units | Method | Reference | Comment |
ΔvapH° | 10.1 | kcal/mol | N/A | Razzouk, Hajjaji, et al., 2009 | Based on data from 295. to 365. K.; AC |
Enthalpy of vaporization
ΔvapH (kcal/mol) | Temperature (K) | Reference | Comment |
---|---|---|---|
9.51 | 330. | Razzouk, Hajjaji, et al., 2009 | Based on data from 295. to 365. K.; AC |

Gas phase ion energetics data

Data evaluated as indicated in comments:
HL - Edward P. Hunter and Sharon G. Lias
L - Sharon G. Lias
Data compiled as indicated in comments:
LLK - Sharon G. Lias, Rhoda D. Levin, and Sherif A. Kafafi
LBLHLM - Sharon G. Lias, John E. Bartmess, Joel F. Liebman, John L. Holmes, Rhoda D. Levin, and W. Gary Mallard
Quantity | Value | Units | Method | Reference | Comment |
---|---|---|---|---|---|
IE (evaluated) | 7.59 ± 0.04 | eV | N/A | N/A | L |
Quantity | Value | Units | Method | Reference | Comment |
Proton affinity (review) | 242.07 | kcal/mol | N/A | Hunter and Lias, 1998 | HL |
Quantity | Value | Units | Method | Reference | Comment |
Gas basicity | 232.0 | kcal/mol | N/A | Hunter and Lias, 1998 | HL |
Ionization energy determinations
IE (eV) | Method | Reference | Comment |
---|---|---|---|
7.57 ± 0.03 | PI | Loguinov, Takhistov, et al., 1981 | LLK |
7.61 ± 0.05 | PE | Akopyan and Loginov, 1974 | LLK |
Appearance energy determinations
Ion | AE (eV) | Other Products | Method | Reference | Comment |
---|---|---|---|---|---|
C3H8N+ | 8.18 | C3H8N | EI | Burkey, Castelhano, et al., 1983 | LBLHLM |
C3H8N+ | 8.30 ± 0.05 | (CH3)2NCH2 | PI | Loguinov, Takhistov, et al., 1981 | LLK |

Kovats' RI, non-polar column, isothermal

View large format table.

Column type Active phase Temperature (C) I Reference Comment
PackedPMS-100150.1052.Anderson, Jurel, et al., 1973He, Celite 545 (44-60 mesh); Column length: 3. m
PackedPMS-100180.1065.Anderson, Jurel, et al., 1973He, Celite 545 (44-60 mesh); Column length: 3. m
PackedPMS-100200.1095.Anderson, Jurel, et al., 1973He, Celite 545 (44-60 mesh); Column length: 3. m

Kovats' RI, polar column, isothermal

View large format table.

Column type Active phase Temperature (C) I Reference Comment
PackedPEG-2000150.999.Anderson, Jurel, et al., 1973He, Celite 545 (44-60 mesh); Column length: 3. m
PackedPEG-2000152.1050.Anderson, Jurel, et al., 1973He, Celite 545 (44-60 mesh); Column length: 3. m
PackedPEG-2000179.1028.Anderson, Jurel, et al., 1973He, Celite 545 (44-60 mesh); Column length: 3. m
PackedPEG-2000180.988.Anderson, Jurel, et al., 1973He, Celite 545 (44-60 mesh); Column length: 3. m
PackedPEG-2000200.1015.Anderson, Jurel, et al., 1973He, Celite 545 (44-60 mesh); Column length: 3. m
PackedPEG-2000200.979.Anderson, Jurel, et al., 1973He, Celite 545 (44-60 mesh); Column length: 3. m

References

Weast and Grasselli, 1989
CRC Handbook of Data on Organic Compounds, 2nd Editon, Weast,R.C and Grasselli, J.G., ed(s)., CRC Press, Inc., Boca Raton, FL, 1989, 1. [all data]
Anonymous, 1959
Anonymous, R.,
, Am. Pet. Inst. Res. Proj. 6, Carnegie-Mellon Univ., 1959. [all data]
Razzouk, Hajjaji, et al., 2009
Razzouk, Antonio; Hajjaji, Ahmed; Mokbel, Ilham; Mougin, Pascal; Jose, Jacques,
Experimental vapor pressures of 1,2-bis(dimethylamino)ethane, 1-methylmorpholine, 1,2-bis(2-aminoethoxy)ethane and N-benzylethanolamine between 273.18 and 364.97K,
Fluid Phase Equilibria, 2009, 282, 1, 11-13, https://doi.org/10.1016/j.fluid.2009.04.006
. [all data]
Hunter and Lias, 1998
Hunter, E.P.; Lias, S.G.,
Evaluated Gas Phase Basicities and Proton Affinities of Molecules: An Update,
J. Phys. Chem. Ref. Data, 1998, 27, 3, 413-656, https://doi.org/10.1063/1.556018
. [all data]
Loguinov, Takhistov, et al., 1981
Loguinov, Y.; Takhistov, V.V.; Vatlina, L.P.,
Photoionization studies of substituted trimethylamines,
Org. Mass Spectrom., 1981, 16, 239. [all data]
Akopyan and Loginov, 1974
Akopyan, M.E.; Loginov, Yu.V.,
Photoelectron spectra of trimethylamine derivatives,
Opt. Spectrosc., 1974, 37, 250, In original 442. [all data]
Burkey, Castelhano, et al., 1983
Burkey, T.J.; Castelhano, A.L.; Griller, D.; Lossing, F.P.,
Heats of formation and ionization potentials of some α-aminoalkyl radicals,
J. Am. Chem. Soc., 1983, 105, 4701. [all data]