Di-tert-butyl disulfide
- Formula: C8H18S2
- Molecular weight: 178.359
- IUPAC Standard InChIKey: BKCNDTDWDGQHSD-UHFFFAOYSA-N
- CAS Registry Number: 110-06-5
- Chemical structure:
View 3d structure (requires JavaScript / HTML 5) - Other names: Disulfide, bis(1,1-dimethylethyl); tert-Butyl disulfide; Bis(1,1-dimethylethyl) disulfide; 2,2,5,5-Tetramethyl-3,4-dithiahexane; Di-tert-butyl disulphide; Bis(1,1-dimethylethyl) disulphide; (tert-C4H9S)2; t-Butyl disulfide; 2-(tert-Butyldisulfanyl)-2-methylpropane

Gas phase thermochemistry data

Data compiled by: Hussein Y. Afeefy, Joel F. Liebman, and Stephen E. Stein
Quantity | Value | Units | Method | Reference | Comment |
---|---|---|---|---|---|
ΔfH°gas | -200. | kJ/mol | Ion | Hawari, Griller, et al., 1986 | |
ΔfH°gas | -199.8 ± 2.3 | kJ/mol | Ccr | Good, 1972 | |
ΔfH°gas | -202.0 ± 2.3 | kJ/mol | Ccb | Mackle and McClean, 1964 | Reanalyzed by Cox and Pilcher, 1970, Original value = -196.9 ± 2.5 kJ/mol |

Condensed phase thermochemistry data

Data compiled by: Hussein Y. Afeefy, Joel F. Liebman, and Stephen E. Stein
Quantity | Value | Units | Method | Reference | Comment |
---|---|---|---|---|---|
ΔfH°liquid | -253.0 ± 1.5 | kJ/mol | Ccr | Good, 1972 | |
ΔfH°liquid | -251.0 ± 1.8 | kJ/mol | Ccb | Mackle and McClean, 1964 | Reanalyzed by Cox and Pilcher, 1970, Original value = -250.0 ± 1.6 kJ/mol |
Quantity | Value | Units | Method | Reference | Comment |
ΔcH°liquid | -6670.0 ± 1.3 | kJ/mol | Ccr | Good, 1972 | |
ΔcH°liquid | -6674.1 ± 1.6 | kJ/mol | Ccb | Mackle and McClean, 1964 | Reanalyzed by Cox and Pilcher, 1970, Original value = -6666.9 ± 1.6 kJ/mol |

Phase change data

Data compiled as indicated in comments:
BS - Robert L. Brown and Stephen E. Stein
AC - William E. Acree, Jr., James S. Chickos
ALS - Hussein Y. Afeefy, Joel F. Liebman, and Stephen E. Stein
DRB - Donald R. Burgess, Jr.
Quantity | Value | Units | Method | Reference | Comment |
---|---|---|---|---|---|
Tboil | 473.7 | K | N/A | Aldrich Chemical Company Inc., 1990 | BS |
Quantity | Value | Units | Method | Reference | Comment |
ΔvapH° | 53. ± 3. | kJ/mol | AVG | N/A | Average of 8 values; Individual data points |
Reduced pressure boiling point
Tboil (K) | Pressure (bar) | Reference | Comment |
---|---|---|---|
361.2 | 0.028 | Weast and Grasselli, 1989 | BS |

Reaction thermochemistry data

Data compiled by: Hussein Y. Afeefy, Joel F. Liebman, and Stephen E. Stein
Individual Reactions
By formula: C8H18S2 + C4H10S2 = 2C6H14S2
Quantity | Value | Units | Method | Reference | Comment |
---|---|---|---|---|---|
ΔrH° | 0.0 ± 0.2 | kJ/mol | Eqk | Haraldson, Olander, et al., 1960 | liquid phase; solvent: Nonpolar solvent |

Gas phase ion energetics data

Data compiled as indicated in comments:
LLK - Sharon G. Lias, Rhoda D. Levin, and Sherif A. Kafafi
LBLHLM - Sharon G. Lias, John E. Bartmess, Joel F. Liebman, John L. Holmes, Rhoda D. Levin, and W. Gary Mallard
Ionization energy determinations
IE (eV) | Method | Reference | Comment |
---|---|---|---|
8.15 | PE | Guimon, Guimon, et al., 1975 | Vertical value; LLK |
8.17 | PE | Wagner and Bock, 1974 | Vertical value; LLK |
8.20 | PE | Baker, Brisk, et al., 1974 | Vertical value; LLK |
8.17 | PE | Bock, Wagner, et al., 1972 | Vertical value; LLK |
Appearance energy determinations
Ion | AE (eV) | Other Products | Method | Reference | Comment |
---|---|---|---|---|---|
C4H9S2+ | 9.1 ± 0.8 | (CH3)3C | EI | Hawari, Griller, et al., 1986, 2 | LBLHLM |

Kovats' RI, non-polar column, isothermal

Column type | Active phase | Temperature (C) | I | Reference | Comment |
---|---|---|---|---|---|
Packed | Apiezon M | 130. | 1122. | Garbuzov, Misharina, et al., 1985 | He or N2, Chromosorb W, AW-DMCS; Column length: 2.1 m |

Van Den Dool and Kratz RI, polar column, temperature ramp

Column type | Active phase | I | Reference | Comment |
---|---|---|---|---|
Capillary | Supelcowax-10 | 1323. | Tanchotikul and Hsieh, 1989 | 60. m/0.25 mm/0.25 μm, 40. C @ 5. min, 2. K/min, 175. C @ 20. min |
Capillary | Supelcowax-10 | 1331. | Tanchotikul and Hsieh, 1989 | 60. m/0.25 mm/0.25 μm, 40. C @ 5. min, 2. K/min, 175. C @ 20. min |

Normal alkane RI, non-polar column, custom temperature program

Column type | Active phase | I | Reference | Comment |
---|---|---|---|---|
Capillary | Apieson M | 1122. | Gao, Wang, et al., 2003 | Program: not specified |

Normal alkane RI, polar column, custom temperature program

Column type | Active phase | I | Reference | Comment |
---|---|---|---|---|
Capillary | PEG-1000 | 1364. | Gao, Wang, et al., 2003 | Program: not specified |
Capillary | DB-Wax | 1323. | Peng, Yang, et al., 1991 | Program: not specified |

References

Hawari, Griller, et al., 1986
Hawari, J.A.; Griller, D.; Lossing, F.P.,
Thermochemistry of perthiyl radicals,
J. Am. Chem. Soc., 1986, 108, 3273-3275. [all data]
Good, 1972
Good, W.D.,
Enthalpies of combustion of 18 organic sulfur compounds related to petroleum,
J. Chem. Eng. Data, 1972, 17, 158-162. [all data]
Mackle and McClean, 1964
Mackle, H.; McClean, R.T.B.,
Studies in the thermochemistry of organic sulphides. Part 5.-Dithia-alkanes,
Trans. Faraday Soc., 1964, 60, 669-672. [all data]
Cox and Pilcher, 1970
Cox, J.D.; Pilcher, G.,
Thermochemistry of Organic and Organometallic Compounds, Academic Press, New York, 1970, 1-636. [all data]
Aldrich Chemical Company Inc., 1990
Aldrich Chemical Company Inc.,
Catalog Handbook of Fine Chemicals, Aldrich Chemical Company, Inc., Milwaukee WI, 1990, 1. [all data]
Weast and Grasselli, 1989
CRC Handbook of Data on Organic Compounds, 2nd Editon, Weast,R.C and Grasselli, J.G., ed(s)., CRC Press, Inc., Boca Raton, FL, 1989, 1. [all data]
Haraldson, Olander, et al., 1960
Haraldson, L.; Olander, C.J.; Sunner, S.; Varde, K.,
Equilibrium studies on the disproportionation reaction between some dialkyl disulfides,
Acta Chem. Scand., 1960, 14, 1509-1514. [all data]
Guimon, Guimon, et al., 1975
Guimon, M.-F.; Guimon, C.; Pfister-Guillouzo, G.,
Application of photoelectron spectroscopy to conformational analysis of 1,2,4-trithiolanes,
Tetrahedron Lett., 1975, 7, 441. [all data]
Wagner and Bock, 1974
Wagner, G.; Bock, H.,
Photoelektronenspektren und molekuleigenschaften, XXVI. Die delokalisation von schwefel-elektronenpaaren in alkylsulfiden und -disulfiden,
Chem. Ber., 1974, 107, 68. [all data]
Baker, Brisk, et al., 1974
Baker, A.D.; Brisk, M.; Gellender, M.,
Photoelectron spectra and dihedral angles of disulfides,
J. Electron Spectrosc. Relat. Phenom., 1974, 3, 227. [all data]
Bock, Wagner, et al., 1972
Bock, H.; Wagner, G.; Kroner, J.,
Photoelektronenspektren und molekuleigenschaften, XIV. Die delokalisation des schwefel-elektronenpaar in CH3S-substituierten aromaten,
Chem. Ber., 1972, 105, 3850. [all data]
Hawari, Griller, et al., 1986, 2
Hawari, J.A.; Griller, D.; Lossing, F.P.,
Thermochemistry of perthiyl radicals,
J. Am. Chem. Soc., 1986, 108, 3273. [all data]
Garbuzov, Misharina, et al., 1985
Garbuzov, V.G.; Misharina, T.A.; Aerov, A.F.; Golovnya, R.V.,
Gas chromatographic retention indices for sulphur(II)-containing organic substances,
J. Anal. Chem. USSR (Engl. Transl.), 1985, 40, 4, 576-586. [all data]
Tanchotikul and Hsieh, 1989
Tanchotikul, U.; Hsieh, T.C.-Y.,
Volatile Flavor Components in Crayfish Waste,
J. Food Sci., 1989, 54, 6, 1515-1520, https://doi.org/10.1111/j.1365-2621.1989.tb05149.x
. [all data]
Gao, Wang, et al., 2003
Gao, Y.; Wang, Y.; Yao, X.; Zhang, X.; Liu, M.; Hu, Z.; Fan, B.,
The prediction for gas chromatographic retention index of disulfides on stationary phases of different polarity,
Talanta, 2003, 59, 2, 229-237, https://doi.org/10.1016/S0039-9140(02)00500-3
. [all data]
Peng, Yang, et al., 1991
Peng, C.T.; Yang, Z.C.; Ding, S.F.,
Prediction of rentention idexes. II. Structure-retention index relationship on polar columns,
J. Chromatogr., 1991, 586, 1, 85-112, https://doi.org/10.1016/0021-9673(91)80028-F
. [all data]