Thiophene
- Formula: C4H4S
- Molecular weight: 84.140
- IUPAC Standard InChIKey: YTPLMLYBLZKORZ-UHFFFAOYSA-N
- CAS Registry Number: 110-02-1
- Chemical structure:
View 3d structure (requires JavaScript / HTML 5) - Other names: Thiacyclopentadiene; CP 34; Furan, thio-; Huile HSO; Huile H50; Thiaphene; Thiofuram; Thiofuran; Thiofurfuran; Thiole; Thiophen; Thiotetrole; Divinylene sulfide; USAF EK-1860; Thiofen; UN 2414; Hopkin's lactic acid reagent; NSC 405073

Gas phase thermochemistry data

Data compiled as indicated in comments:
DRB - Donald R. Burgess, Jr.
ALS - Hussein Y. Afeefy, Joel F. Liebman, and Stephen E. Stein
Quantity | Value | Units | Method | Reference | Comment |
---|---|---|---|---|---|
ΔfH°gas | 52.20 | kcal/mol | N/A | Zaheeruddin and Lodhi, 1991 | Value computed using ΔfHliquid° value of 183.0 kj/mol from Zaheeruddin and Lodhi, 1991 and ΔvapH° value of 35.4 kj/mol from Hubbard, Scott, et al., 1955.; DRB |
ΔfH°gas | 27.82 | kcal/mol | N/A | Sunner, 1963 | Value computed using ΔfHliquid° value of 81.0±0.6 kj/mol from Sunner, 1963 and ΔvapH° value of 35.4 kj/mol from Hubbard, Scott, et al., 1955.; DRB |
ΔfH°gas | 27.49 ± 0.24 | kcal/mol | Ccb | Hubbard, Scott, et al., 1955 | see Waddington, Knowlton, et al., 1949; ALS |
ΔfH°gas | 27.89 | kcal/mol | N/A | Moore, Renquist, et al., 1940 | Value computed using ΔfHliquid° value of 81.3±2.6 kj/mol from Moore, Renquist, et al., 1940 and ΔvapH° value of 35.4 kj/mol from Hubbard, Scott, et al., 1955.; DRB |

Condensed phase thermochemistry data

Data compiled as indicated in comments:
ALS - Hussein Y. Afeefy, Joel F. Liebman, and Stephen E. Stein
DH - Eugene S. Domalski and Elizabeth D. Hearing
Quantity | Value | Units | Method | Reference | Comment |
---|---|---|---|---|---|
ΔfH°liquid | Ccb | Zaheeruddin and Lodhi, 1991 | uncertain value: 43.728 kcal/mol; Author's hf_SO2=-320.5 kJ/mol; ALS | ||
ΔfH°liquid | 19.35 ± 0.15 | kcal/mol | Ccr | Sunner, 1963 | Correction of Sunner, 1955; ALS |
ΔfH°liquid | 19.02 ± 0.25 | kcal/mol | Ccb | Hubbard, Scott, et al., 1955 | Reanalyzed by Cox and Pilcher, 1970, Original value = 19.20 ± 0.24 kcal/mol; see Waddington, Knowlton, et al., 1949; ALS |
ΔfH°liquid | 19.44 ± 0.61 | kcal/mol | Ccb | Moore, Renquist, et al., 1940 | Reanalyzed by Cox and Pilcher, 1970, Original value = 19.54 kcal/mol; hf_H2SO4=-135.01; ALS |
Quantity | Value | Units | Method | Reference | Comment |
ΔcH°liquid | Ccb | Zaheeruddin and Lodhi, 1991 | uncertain value: -633.172 kcal/mol; Author's hf_SO2=-320.5 kJ/mol; ALS | ||
ΔcH°liquid | -676.09 | kcal/mol | Ccr | Sunner, 1963 | Correction of Sunner, 1955; ALS |
ΔcH°liquid | -675.81 ± 0.22 | kcal/mol | Ccb | Hubbard, Scott, et al., 1955 | Reanalyzed by Cox and Pilcher, 1970, Original value = -675.55 ± 0.22 kcal/mol; see Waddington, Knowlton, et al., 1949; ALS |
ΔcH°liquid | -676.23 ± 0.60 | kcal/mol | Ccb | Moore, Renquist, et al., 1940 | Reanalyzed by Cox and Pilcher, 1970, Original value = -667.39 ± 0.60 kcal/mol; hf_H2SO4=-135.01; ALS |
Quantity | Value | Units | Method | Reference | Comment |
S°liquid | 43.31 | cal/mol*K | N/A | Figuiere, Szwarc, et al., 1985 | DH |
S°liquid | 43.301 | cal/mol*K | N/A | Waddington, Knowlton, et al., 1949 | DH |
S°liquid | 42.21 | cal/mol*K | N/A | Jacobs and Parks, 1934 | Details of extrapolation below 90 K not given. Scatter in data for solid introduce uncertainty. Value good to about 4 J/mol*K.; DH |
Constant pressure heat capacity of liquid
Cp,liquid (cal/mol*K) | Temperature (K) | Reference | Comment |
---|---|---|---|
29.254 | 298.14 | Figuiere, Szwarc, et al., 1985 | T = 13 to 300 K. Value is unsmoothed experimental datum.; DH |
29.601 | 297.45 | Waddington, Knowlton, et al., 1949 | T = 11 to 336 K. Value is unsmoothed experimental datum.; DH |
29.450 | 289.3 | Jacobs and Parks, 1934 | T = 93 to 294 K. Data for solid, 90 to 237 K, not given (table omitted, apparently). Value is unsmoothed experimental datum.; DH |

Phase change data

Data compiled as indicated in comments:
BS - Robert L. Brown and Stephen E. Stein
TRC - Thermodynamics Research Center, NIST Boulder Laboratories, Chris Muzny director
AC - William E. Acree, Jr., James S. Chickos
ALS - Hussein Y. Afeefy, Joel F. Liebman, and Stephen E. Stein
DRB - Donald R. Burgess, Jr.
DH - Eugene S. Domalski and Elizabeth D. Hearing
Quantity | Value | Units | Method | Reference | Comment |
---|---|---|---|---|---|
Tboil | 357.3 ± 0.6 | K | AVG | N/A | Average of 7 values; Individual data points |
Quantity | Value | Units | Method | Reference | Comment |
Tfus | 234.93 | K | N/A | Goates, Ott, et al., 1973 | Uncertainty assigned by TRC = 0.05 K; TRC |
Tfus | 234.94 | K | N/A | Timmermans and Hennaut-Roland, 1959 | Uncertainty assigned by TRC = 0.1 K; TRC |
Tfus | 233.15 | K | N/A | Timmermans and Mattaar, 1921 | Uncertainty assigned by TRC = 0.4 K; TRC |
Quantity | Value | Units | Method | Reference | Comment |
Ttriple | 235.02 | K | N/A | Figuiere, Szwarc, et al., 1985, 2 | Crystal phase 1 phase; Uncertainty assigned by TRC = 0.05 K; TRC |
Ttriple | 234.900 | K | N/A | Waddington, Knowlton, et al., 1949, 2 | Crystal phase 1 phase; Uncertainty assigned by TRC = 0.08 K; TRC |
Ttriple | 234.95 | K | N/A | Waddington, Knowlton, et al., 1949, 2 | Crystal phase 1 phase; Uncertainty assigned by TRC = 0.06 K; TRC |
Ttriple | 233.7 | K | N/A | Jacobs and Parks, 1934, 2 | Uncertainty assigned by TRC = 0.4 K; TRC |
Quantity | Value | Units | Method | Reference | Comment |
Tc | 579.4 | K | N/A | Majer and Svoboda, 1985 | |
Tc | 579.4 | K | N/A | Cheng, McCoubrey, et al., 1962 | Uncertainty assigned by TRC = 0.3 K; Visual (5-cm 2-mm bore tubes) in nitrate-nitrite bath, TE or TH cal. vs NPL thermometer J.C.McCoubrey, A.R.Ubbelohde Trans. Faraday Soc. 1960,56,114; TRC |
Tc | 580. | K | N/A | Kobe, Ravicz, et al., 1956 | Uncertainty assigned by TRC = 2. K; TRC |
Quantity | Value | Units | Method | Reference | Comment |
Pc | 56.25 | atm | N/A | Kobe, Ravicz, et al., 1956 | Uncertainty assigned by TRC = 0.6804 atm; TRC |
Quantity | Value | Units | Method | Reference | Comment |
Vc | 0.220 | l/mol | N/A | Kobe, Ravicz, et al., 1956 | Uncertainty assigned by TRC = 0.005 l/mol; TRC |
Quantity | Value | Units | Method | Reference | Comment |
ΔvapH° | 8.315 | kcal/mol | N/A | Majer and Svoboda, 1985 | |
ΔvapH° | 8.27 | kcal/mol | N/A | Reid, 1972 | AC |
ΔvapH° | 8.29 ± 0.008 | kcal/mol | V | Hubbard, Scott, et al., 1955 | see Waddington, Knowlton, et al., 1949; ALS |
ΔvapH° | 8.46 | kcal/mol | N/A | Hubbard, Scott, et al., 1955 | DRB |
Enthalpy of vaporization
ΔvapH (kcal/mol) | Temperature (K) | Method | Reference | Comment |
---|---|---|---|---|
7.524 | 357.3 | N/A | Majer and Svoboda, 1985 | |
8.56 | 282. | N/A | Dykyj, Svoboda, et al., 1999 | Based on data from 267. to 381. K.; AC |
8.32 | 348. | I | Eon, Pommier, et al., 1971 | Based on data from 333. to 373. K.; AC |
8.15 | 315. | EB | White, Barnard--Smith, et al., 1952 | Based on data from 300. to 366. K.; AC |
8.05 | 326. | N/A | Waddington, Knowlton, et al., 1949 | Based on data from 311. to 393. K.; AC |
8.03 ± 0.02 | 319. | C | Waddington, Knowlton, et al., 1949 | AC |
7.82 ± 0.02 | 336. | C | Waddington, Knowlton, et al., 1949 | AC |
7.53 ± 0.02 | 357. | C | Waddington, Knowlton, et al., 1949 | AC |
7.79 | 353. | N/A | Fawcett and Rasmussen, 1945 | Based on data from 344. to 363. K.; AC |
8.4 | 270. | N/A | Milazzo, 1944 | Based on data from 228. to 289. K.; AC |
Enthalpy of vaporization
ΔvapH =
A exp(-βTr) (1 − Tr)β
ΔvapH =
Enthalpy of vaporization (at saturation pressure)
(kcal/mol)
Tr = reduced temperature (T / Tc)
View plot Requires a JavaScript / HTML 5 canvas capable browser.
Temperature (K) | A (kcal/mol) | β | Tc (K) | Reference | Comment |
---|---|---|---|---|---|
319. to 357. | 11.85 | 0.288 | 579.4 | Majer and Svoboda, 1985 |
Antoine Equation Parameters
log10(P) = A − (B / (T + C))
P = vapor pressure (atm)
T = temperature (K)
View plot Requires a JavaScript / HTML 5 canvas capable browser.
Temperature (K) | A | B | C | Reference | Comment |
---|---|---|---|---|---|
333.4 to 373.5 | 5.06145 | 1790.319 | -2.805 | Eon, Pommier, et al., 1971 | Coefficents calculated by NIST from author's data. |
312.21 to 392.94 | 4.06787 | 1239.578 | -52.585 | Waddington, Knowlton, et al., 1949 | Coefficents calculated by NIST from author's data. |
Enthalpy of sublimation
ΔsubH (kcal/mol) | Temperature (K) | Reference | Comment |
---|---|---|---|
11.2 | 213. | Stephenson and Malanowski, 1987 | Based on data from 195. to 228. K. See also Milazzo, 1956.; AC |
12. | 203. | Milazzo, 1944 | Based on data from 192. to 213. K.; AC |
Enthalpy of fusion
ΔfusH (kcal/mol) | Temperature (K) | Reference | Comment |
---|---|---|---|
1.19 | 235.2 | Domalski and Hearing, 1996 | See also Figuiere, Szwarc, et al., 1985.; AC |
Temperature of phase transition
Ttrs (K) | Initial Phase | Final Phase | Reference | Comment |
---|---|---|---|---|
90.76 | crystaline, V' | crystaline, IV' | Figuiere, Szwarc, et al., 1984 | Metastable transition.; DH |
139.2 | crystaline, IV' | crystaline, III' | Figuiere, Szwarc, et al., 1984 | Metastable transition.; DH |
112.35 | crystaline, V | crystaline, IV | Figuiere, Szwarc, et al., 1984 | DH |
138.5 | crystaline, IV | crystaline, III | Figuiere, Szwarc, et al., 1984 | DH |
170.70 | crystaline, III | crystaline, II | Figuiere, Szwarc, et al., 1984 | DH |
175.03 | crystaline, II | crystaline, I | Figuiere, Szwarc, et al., 1984 | DH |
235.03 | crystaline, I | liquid | Figuiere, Szwarc, et al., 1984 | DH |
111.3 | crystaline, V | crystaline, IV | Andre, Dworkin, et al., 1982 | DH |
136.8 | crystaline, IV | crystaline, III | Andre, Dworkin, et al., 1982 | DH |
170.5 | crystaline, III | crystaline, II | Andre, Dworkin, et al., 1982 | DH |
174.5 | crystaline, II | crystaline, I | Andre, Dworkin, et al., 1982 | DH |
Enthalpy of phase transition
ΔHtrs (kcal/mol) | Temperature (K) | Initial Phase | Final Phase | Reference | Comment |
---|---|---|---|---|---|
0.102 | 44. to 170. | crystaline, V | crystaline, III | Figuiere, Szwarc, et al., 1985 | DH |
0.1935 | 170.70 | crystaline, III | crystaline, II | Figuiere, Szwarc, et al., 1985 | DH |
0.4388 | 37. to 216. | crystaline, II' | crystaline, I | Figuiere, Szwarc, et al., 1985 | DH |
1.205 | 235.02 | crystaline, I | liquid | Figuiere, Szwarc, et al., 1985 | DH |
0.1524 | 171.6 | crystaline, II | crystaline, I | Waddington, Knowlton, et al., 1949 | Anomalous heat capacity 100 to 150 K. Apparently two second order transitions at about 112, 138 K, with small energies involved.; DH |
1.2156 | 234.95 | crystaline, I | liquid | Waddington, Knowlton, et al., 1949 | DH |
0.2890 | 171.1 | crystaline, II | crystaline, I | Jacobs and Parks, 1934 | DH |
1.187 | 233.7 | crystaline, I | liquid | Jacobs and Parks, 1934 | DH |
Entropy of phase transition
ΔStrs (cal/mol*K) | Temperature (K) | Initial Phase | Final Phase | Reference | Comment |
---|---|---|---|---|---|
0.96 | 44. to 170. | crystaline, V | crystaline, III | Figuiere, Szwarc, et al., 1985 | DH |
1.13 | 170.70 | crystaline, III | crystaline, II | Figuiere, Szwarc, et al., 1985 | DH |
3.59 | 37. to 216. | crystaline, II' | crystaline, I | Figuiere, Szwarc, et al., 1985 | DH |
5.122 | 235.02 | crystaline, I | liquid | Figuiere, Szwarc, et al., 1985 | DH |
0.889 | 171.6 | crystaline, II | crystaline, I | Waddington, Knowlton, et al., 1949 | Anomalous; DH |
5.174 | 234.95 | crystaline, I | liquid | Waddington, Knowlton, et al., 1949 | DH |
1.7 | 171.1 | crystaline, II | crystaline, I | Jacobs and Parks, 1934 | DH |
5.09 | 233.7 | crystaline, I | liquid | Jacobs and Parks, 1934 | DH |

Reaction thermochemistry data

Data compiled as indicated in comments:
B - John E. Bartmess
M - Michael M. Meot-Ner (Mautner) and Sharon G. Lias
Individual Reactions
C4H3S- + =
By formula: C4H3S- + H+ = C4H4S
Quantity | Value | Units | Method | Reference | Comment |
---|---|---|---|---|---|
ΔrH° | 381.2 ± 3.1 | kcal/mol | G+TS | DePuy, Kass, et al., 1988 | gas phase; Between MeOH, EtOH. D exchange implies anion at C-2.; B |
Quantity | Value | Units | Method | Reference | Comment |
ΔrG° | 373.0 ± 3.0 | kcal/mol | IMRB | DePuy, Kass, et al., 1988 | gas phase; Between MeOH, EtOH. D exchange implies anion at C-2.; B |
By formula: C4H4S+ + C4H4S = (C4H4S+ • C4H4S)
Quantity | Value | Units | Method | Reference | Comment |
---|---|---|---|---|---|
ΔrH° | 16.9 | kcal/mol | PHPMS | Hiraoka, Takimoto, et al., 1987 | gas phase; M |
Quantity | Value | Units | Method | Reference | Comment |
ΔrS° | 23.1 | cal/mol*K | PHPMS | Hiraoka, Takimoto, et al., 1987 | gas phase; M |
By formula: (C4H4S+ • C4H4S) + C4H4S = (C4H4S+ • 2C4H4S)
Quantity | Value | Units | Method | Reference | Comment |
---|---|---|---|---|---|
ΔrH° | 7.5 | kcal/mol | PHPMS | Hiraoka, Takimoto, et al., 1987 | gas phase; ΔrH<; M |
By formula: C4H5S+ + C4H4S = (C4H5S+ • C4H4S)
Quantity | Value | Units | Method | Reference | Comment |
---|---|---|---|---|---|
ΔrH° | 11.5 | kcal/mol | PHPMS | Hiraoka, Takimoto, et al., 1987 | gas phase; ΔrH<; M |

Henry's Law data

Data compiled by: Rolf Sander
Henry's Law constant (water solution)
kH(T) = k°H exp(d(ln(kH))/d(1/T) ((1/T) - 1/(298.15 K)))
k°H = Henry's law constant for solubility in water at 298.15 K (mol/(kg*bar))
d(ln(kH))/d(1/T) = Temperature dependence constant (K)
k°H (mol/(kg*bar)) | d(ln(kH))/d(1/T) (K) | Method | Reference | Comment |
---|---|---|---|---|
0.34 | Q | N/A | missing citation give several references for the Henry's law constants but don't assign them to specific species. | |
0.44 | 3700. | M | N/A |

Gas phase ion energetics data

Data evaluated as indicated in comments:
HL - Edward P. Hunter and Sharon G. Lias
L - Sharon G. Lias
Data compiled as indicated in comments:
B - John E. Bartmess
LBLHLM - Sharon G. Lias, John E. Bartmess, Joel F. Liebman, John L. Holmes, Rhoda D. Levin, and W. Gary Mallard
LLK - Sharon G. Lias, Rhoda D. Levin, and Sherif A. Kafafi
RDSH - Henry M. Rosenstock, Keith Draxl, Bruce W. Steiner, and John T. Herron
LL - Sharon G. Lias and Joel F. Liebman
Quantity | Value | Units | Method | Reference | Comment |
---|---|---|---|---|---|
IE (evaluated) | 8.86 ± 0.02 | eV | N/A | N/A | L |
Quantity | Value | Units | Method | Reference | Comment |
Proton affinity (review) | 194.8 | kcal/mol | N/A | Hunter and Lias, 1998 | HL |
Quantity | Value | Units | Method | Reference | Comment |
Gas basicity | 187.5 | kcal/mol | N/A | Hunter and Lias, 1998 | HL |
Ionization energy determinations
IE (eV) | Method | Reference | Comment |
---|---|---|---|
8.85 | PE | Klasinc, Sabljic, et al., 1982 | LBLHLM |
8.85 | PE | Galasso, Klasinc, et al., 1981 | LLK |
9.0 ± 0.1 | CEMS | Tedder and Vidaud, 1980 | LLK |
8.87 ± 0.01 | PE | Butler and Baer, 1980 | LLK |
~8.8 | EI | Van Veen, 1976 | LLK |
8.80 ± 0.05 | EI | Thorstad and Undheim, 1974 | LLK |
8.90 | PE | Clark, Gleiter, et al., 1973 | LLK |
9.05 | CTS | Aloisi and Pignataro, 1973 | LLK |
8.874 ± 0.005 | S | DiLonardo, Galloni, et al., 1972 | LLK |
9.12 ± 0.05 | EI | Linda, Marino, et al., 1971 | LLK |
8.87 ± 0.01 | PE | Derrick, Asbrink, et al., 1971 | LLK |
8.86 ± 0.01 | PI | Potapov and Bazhenov, 1970 | RDSH |
8.80 ± 0.05 | PE | Baker, Betteridge, et al., 1970 | RDSH |
8.87 ± 0.05 | PE | Eland, 1969 | RDSH |
8.860 ± 0.005 | PI | Watanabe, Nakayama, et al., 1962 | RDSH |
8.95 ± 0.02 | S | Price and Walsh, 1941 | RDSH |
8.85 | PE | Bajic, Humski, et al., 1985 | Vertical value; LBLHLM |
8.90 | PE | Bock and Roth, 1983 | Vertical value; LBLHLM |
8.90 | PE | Mellink and Janssen, 1978 | Vertical value; LLK |
8.85 | PE | Bozic, Humski, et al., 1977 | Vertical value; LLK |
8.87 | PE | Schafer, Schweig, et al., 1973 | Vertical value; LLK |
Appearance energy determinations
Ion | AE (eV) | Other Products | Method | Reference | Comment |
---|---|---|---|---|---|
CHS+ | 13.0 ± 0.2 | C3H3 | CEMS | Tedder and Vidaud, 1980 | LLK |
CHS+ | 13.19 ± 0.04 | C3H3 | PE | Butler and Baer, 1980 | LLK |
CHS+ | 13.0 ± 0.2 | ? | EI | Khvostenko, 1962 | RDSH |
C2H2S+ | 12.5 ± 0.2 | C2H2 | CEMS | Tedder and Vidaud, 1980 | LLK |
C2H2S+ | 12.1 ± 0.1 | C2H2 | PE | Butler and Baer, 1980 | LLK |
C2H2S+ | 10.8 ± 0.2 | ? | EI | Khvostenko, 1962 | RDSH |
C3HS+ | 12.95 ± 0.05 | CH3 | PE | Butler and Baer, 1980 | LLK |
C3H3+ | 13.0 ± 0.2 | CHS | CEMS | Tedder and Vidaud, 1980 | LLK |
C3H3+ | 13.06 ± 0.05 | CHS | PE | Butler and Baer, 1980 | LLK |
C3H3+ | 12.8 ± 0.2 | ? | EI | Khvostenko, 1962 | RDSH |
C4H3S+ | 12.93 ± 0.07 | H | PE | Butler and Baer, 1980 | LLK |
S+ | 20.0 ± 0.5 | ? | EI | Stepanov, Perov, et al., 1988 | LL |
De-protonation reactions
C4H3S- + =
By formula: C4H3S- + H+ = C4H4S
Quantity | Value | Units | Method | Reference | Comment |
---|---|---|---|---|---|
ΔrH° | 381.2 ± 3.1 | kcal/mol | G+TS | DePuy, Kass, et al., 1988 | gas phase; Between MeOH, EtOH. D exchange implies anion at C-2.; B |
Quantity | Value | Units | Method | Reference | Comment |
ΔrG° | 373.0 ± 3.0 | kcal/mol | IMRB | DePuy, Kass, et al., 1988 | gas phase; Between MeOH, EtOH. D exchange implies anion at C-2.; B |

Ion clustering data

Data compiled by: Michael M. Meot-Ner (Mautner) and Sharon G. Lias
Clustering reactions
By formula: C4H4S+ + C4H4S = (C4H4S+ • C4H4S)
Quantity | Value | Units | Method | Reference | Comment |
---|---|---|---|---|---|
ΔrH° | 16.9 | kcal/mol | PHPMS | Hiraoka, Takimoto, et al., 1987 | gas phase |
Quantity | Value | Units | Method | Reference | Comment |
ΔrS° | 23.1 | cal/mol*K | PHPMS | Hiraoka, Takimoto, et al., 1987 | gas phase |
By formula: (C4H4S+ • C4H4S) + C4H4S = (C4H4S+ • 2C4H4S)
Quantity | Value | Units | Method | Reference | Comment |
---|---|---|---|---|---|
ΔrH° | 7.5 | kcal/mol | PHPMS | Hiraoka, Takimoto, et al., 1987 | gas phase; ΔrH< |
By formula: C4H5S+ + C4H4S = (C4H5S+ • C4H4S)
Quantity | Value | Units | Method | Reference | Comment |
---|---|---|---|---|---|
ΔrH° | 11.5 | kcal/mol | PHPMS | Hiraoka, Takimoto, et al., 1987 | gas phase; ΔrH< |

Kovats' RI, non-polar column, isothermal

Data compiled by: NIST Mass Spectrometry Data Center, William E. Wallace, director

Column type PackedCapillaryCapillaryCapillaryCapillary
Active phase Apiezon LDB-5DB-5DB-5DB-5
Column length (m) 1.30.30.30.30.
Carrier gas
Substrate Chromaton N-AW
Column diameter (mm)  0.250.250.250.25
Phase thickness (μm)  0.10.10.10.1
Temperature (C) 160.100.120.60.80.
I 694.686.1700.0674.6679.6
ReferenceKurbatova, Finkelstein, et al., 2004Miller and Bruno, 2003Miller and Bruno, 2003Miller and Bruno, 2003Miller and Bruno, 2003
Comment Large deviations from similar measurements; MSDC-RI MSDC-RI MSDC-RI MSDC-RI MSDC-RI
Column type PackedCapillaryCapillaryCapillaryPacked
Active phase C78, Branched paraffinSPB-1SE-30OV-101C78, Branched paraffin
Column length (m) 3.360.60.60.3.3
Carrier gas He HeHe
Substrate     Chromosorb G HP
Column diameter (mm)  0.320.250.25
Phase thickness (μm)  0.250.500.50
Temperature (C) 130.100.100.100.130.
I 685.3668.668.668.683.0
ReferenceDallos, Sisak, et al., 2000Misharina, Beletsky, et al., 1994Golovnya, Misharina, et al., 1992Golovnya, Misharina, et al., 1992Reddy, Dutoit, et al., 1992
Comment MSDC-RI MSDC-RI MSDC-RI MSDC-RI MSDC-RI
Column type PackedPackedPackedPackedPacked
Active phase ApolaneApiezon MApiezon MApiezon MApolane
Column length (m) 3.72.12.12.12.4
Carrier gas  He or N2  He
Substrate  Chromosorb W, AW-DMCSChromosorb WAWChromosorb W, AW/DMSChromosorb
Column diameter (mm)
Phase thickness (μm)
Temperature (C) 130.130.60.130.70.
I 686.694.675.694.664.6
ReferenceDutoit, 1991Garbuzov, Misharina, et al., 1985Mikhailova, Gren, et al., 1985Golovnya, Garbuzov, et al., 1978Riedo, Fritz, et al., 1976
Comment MSDC-RI MSDC-RI MSDC-RI MSDC-RI MSDC-RI
Column type CapillaryCapillaryCapillaryCapillaryCapillary
Active phase SqualaneSqualaneApiezon LSqualaneSqualane
Column length (m) 50.50.
Carrier gas
Substrate
Column diameter (mm) 0.250.25
Phase thickness (μm)
Temperature (C) 60.60.120.120.86.
I 641.648.693.644.632.
ReferenceRyba, 1976Ryba, 1976Agr, Tesaric, et al., 1973Agr, Tesaric, et al., 1973Agr, Tesaric, et al., 1973
Comment MSDC-RI MSDC-RI MSDC-RI MSDC-RI MSDC-RI
Column type CapillaryCapillaryCapillaryPackedPacked
Active phase SqualaneSqualaneApiezon LDC-200DC-200
Column length (m) 50.50.100.4.4.
Carrier gas N2N2N2
Substrate Celite 545Celite 545 Celite
Column diameter (mm) 0.30.30.3
Phase thickness (μm)
Temperature (C) 120.86.120.120.100.
I 644.632.693.670.671.
ReferenceAgrawal, Tesarík, et al., 1972Agrawal, Tesarík, et al., 1972Agrawal, Tesarík, et al., 1972Reymond, Mueggler-Chavan, et al., 1966Rohrschneider, 1966
Comment MSDC-RI MSDC-RI MSDC-RI MSDC-RI MSDC-RI
Column type PackedPacked
Active phase SqualaneApiezon L
Column length (m) 5.5.
Carrier gas
Substrate
Column diameter (mm)
Phase thickness (μm)
Temperature (C) 100.100.
I 652.690.
ReferenceRohrschneider, 1966Rohrschneider, 1966
Comment MSDC-RI MSDC-RI

Normal alkane RI, non-polar column, temperature ramp

Data compiled by: NIST Mass Spectrometry Data Center, William E. Wallace, director

Column type CapillaryCapillaryCapillaryCapillaryCapillary
Active phase PONAPONAPONAMethyl SiliconeDB-1
Column length (m) 50.50.50.60.60.
Carrier gas N2 Helium He
Substrate
Column diameter (mm) 0.200.200.200.250.32
Phase thickness (μm) 0.500.500.500.251.0
Tstart (C) 35.30.30.40.40.
Tend (C) 170.150.170.220.280.
Heat rate (K/min) 2.2.2.5.2.
Initial hold (min)    10.
Final hold (min)
I 648.646.647.643.23685.
ReferenceYang, Wang, et al., 2004Yang, Wang, et al., 2003Yang, Yang, et al., 2003Baraldi, Rapparini, et al., 1999Tai and Ho, 1998
Comment MSDC-RI MSDC-RI MSDC-RI MSDC-RI MSDC-RI
Column type CapillaryCapillaryCapillaryCapillaryCapillary
Active phase OV-101DB-5CP-Sil 5CP-Sil 5CP Sil 5 CB
Column length (m) 50.60.25.25.25.
Carrier gas  HeHeliumHeliumHe
Substrate
Column diameter (mm) 0.220.250.320.320.32
Phase thickness (μm)   0.450.450.45
Tstart (C) 80.40.0.0.50.
Tend (C) 200.160.300.300.300.
Heat rate (K/min) 2.2.3.3.3.
Initial hold (min)  5.5.5.
Final hold (min)
I 650.677.644.645.644.
ReferenceEgolf and Jurs, 1993Macku and Shibamoto, 1991Damste, van Dalen, et al., 1988Damste, van Dalen, et al., 1988Damste, Kock-van Dalen, et al., 1988
Comment MSDC-RI MSDC-RI MSDC-RI MSDC-RI MSDC-RI
Column type Capillary
Active phase CP Sil 5 CB
Column length (m) 25.
Carrier gas He
Substrate
Column diameter (mm) 0.32
Phase thickness (μm) 0.45
Tstart (C) 50.
Tend (C) 300.
Heat rate (K/min) 3.
Initial hold (min)
Final hold (min)
I 645.
ReferenceDamste, Kock-van Dalen, et al., 1988
Comment MSDC-RI

Kovats' RI, polar column, isothermal

Data compiled by: NIST Mass Spectrometry Data Center, William E. Wallace, director

Column type PackedCapillaryPacked
Active phase Carbowax 20MCarbowax 40MCarbowax 20M
Column length (m) 1.50.2.
Carrier gas  He
Substrate Chromaton N-AW
Column diameter (mm)  0.32
Phase thickness (μm)  0.25
Temperature (C) 160.100.100.
I 1054.1039.1046.
ReferenceKurbatova, Finkelstein, et al., 2004Golovnya, Misharina, et al., 1992Rohrschneider, 1966
Comment MSDC-RI MSDC-RI MSDC-RI

Normal alkane RI, polar column, temperature ramp

Data compiled by: NIST Mass Spectrometry Data Center, William E. Wallace, director

Column type CapillaryCapillaryCapillaryCapillaryCapillary
Active phase HP-InnowaxFFAPFFAPTC-WaxHP-Wax
Column length (m) 15.30.30.60.60.
Carrier gas HeliumNitrogenN2HeHe
Substrate
Column diameter (mm) 0.320.320.320.250.25
Phase thickness (μm) 0.500.500.50.50.5
Tstart (C) 40.35.35.40.40.
Tend (C) 250.250.320.230.190.
Heat rate (K/min) 3.4.4.3.3.
Initial hold (min)  5.5.8.6.
Final hold (min)  45.45.
I 1010.1024.1024.1026.1021.
ReferencePuvipirom and Chaisei, 2012Budryn, Nebesny, et al., 2011Nebesny, Budryn, et al., 2007Ishikawa, Ito, et al., 2004Sanz, Maeztu, et al., 2002
Comment MSDC-RI MSDC-RI MSDC-RI MSDC-RI MSDC-RI
Column type CapillaryCapillaryCapillaryCapillaryCapillary
Active phase HP-WaxHP-WaxDB-WaxDB-WaxDB-Wax
Column length (m) 60.60.60.60.60.
Carrier gas HeHeHeHeHe
Substrate
Column diameter (mm) 0.250.250.320.320.25
Phase thickness (μm) 0.50.50.50.25
Tstart (C) 40.40.34.34.40.
Tend (C) 190.190.200.200.200.
Heat rate (K/min) 3.3.5.5.2.
Initial hold (min) 6.6.3.3.2.
Final hold (min)   10.10.
I 1021.1021.1041.995.1022.
ReferenceMaeztu, Sanz, et al., 2001Sanz, Ansorena, et al., 2001Schlüter, Steinhart, et al., 1999Schlüter, Steinhart, et al., 1999Umano, Hagi, et al., 1995
Comment MSDC-RI MSDC-RI MSDC-RI MSDC-RI MSDC-RI
Column type CapillaryCapillaryCapillaryCapillaryCapillary
Active phase Carbowax 20MCarbowax 20MCarbowax 20MCarbowax 20MCarbowax 20M
Column length (m) 80.100.100.100.100.
Carrier gas    N2N2
Substrate
Column diameter (mm) 0.20.250.250.250.25
Phase thickness (μm)
Tstart (C) 70.70.70.70.70.
Tend (C) 170.170.170.170.170.
Heat rate (K/min) 2.1.1.1.1.
Initial hold (min)
Final hold (min)
I 1035.1032.1034.1032.1035.
ReferenceEgolf and Jurs, 1993Shibamoto and Russell, 1977Shibamoto and Russell, 1977Shibamoto and Russell, 1976Shibamoto and Russell, 1976
Comment MSDC-RI MSDC-RI MSDC-RI MSDC-RI MSDC-RI

Van Den Dool and Kratz RI, polar column, custom temperature program

Data compiled by: NIST Mass Spectrometry Data Center, William E. Wallace, director

Column type CapillaryCapillaryCapillaryCapillary
Active phase Supelcowax-10CP-Wax 52CBStabilwaxStabilwax
Column length (m) 30.60.30.30.
Carrier gas HeHeHeHe
Substrate
Column diameter (mm) 0.250.250.320.32
Phase thickness (μm) 0.250.251.1.
Program 35C(8min) => 4C/min => 60C => 6C/min => 160C => 20C/min => 200C(1min)45C(5min) => 10C/min => 80C => 2C/min => 240C40C (2min) => 5C/min => 100C => 4C/min => 230C (10min)40C(2min) => 5C/min => 100C => 4C/min => 230C(10min)
I 1022.1028.1034.1030.
ReferenceBianchi, Careri, et al., 2007Condurso, Verzera, et al., 2006Klesk, Qian, et al., 2004Klesk and Qian, 2003
Comment MSDC-RI MSDC-RI MSDC-RI MSDC-RI

Van Den Dool and Kratz RI, polar column, temperature ramp

Data compiled by: NIST Mass Spectrometry Data Center, William E. Wallace, director

Column type CapillaryCapillaryCapillary
Active phase DB-WaxDB-WaxCarbowax 40M
Column length (m) 60.60.50.
Carrier gas HeHeHe
Substrate
Column diameter (mm) 0.250.250.32
Phase thickness (μm) 0.25 0.25
Tstart (C) 40.60.50.
Tend (C) 200.220.200.
Heat rate (K/min) 2.3.4.
Initial hold (min) 5.4.
Final hold (min) 30.30.
I 1017.1023.1028.
ReferenceKim, 2001Chung, Eiserich, et al., 1994Golovnya, Misharina, et al., 1992
Comment MSDC-RI MSDC-RI MSDC-RI

Kovats' RI, polar column, temperature ramp

Data compiled by: NIST Mass Spectrometry Data Center, William E. Wallace, director

Column type Capillary
Active phase DB-Wax
Column length (m) 60.
Carrier gas He
Substrate
Column diameter (mm) 0.25
Phase thickness (μm)
Tstart (C) 40.
Tend (C) 190.
Heat rate (K/min) 3.
Initial hold (min) 6.
Final hold (min)
I 1023.
ReferenceShimoda and Shibamoto, 1990
Comment MSDC-RI

References

Zaheeruddin and Lodhi, 1991
Zaheeruddin, M.; Lodhi, Z.H.,
Enthalpies of formation of some cyclic compounds,
Phys. Chem. (Peshawar Pak.), 1991, 10, 111-118. [all data]
Hubbard, Scott, et al., 1955
Hubbard, W.N.; Scott, D.W.; Frow, F.R.; Waddington, G.,
Thiophene: Heat of combustion and chemical thermodynamic properties,
J. Am. Chem. Soc., 1955, 77, 5855-58. [all data]
Sunner, 1963
Sunner, S.,
Corrected heat of combustion and formation values for a number of organic sulphur compounds,
Acta Chem. Scand., 1963, 17, 728-730. [all data]
Waddington, Knowlton, et al., 1949
Waddington, G.; Knowlton, J.W.; Scott, D.W.; Oliver, G.D.; Todd, S.S.; Hubbard, W.N.; Smith, J.C.; Huffman, H.M.,
Thermodynamic propertie of thiophene,
J. Am. Chem. Soc., 1949, 71, 797-808. [all data]
Moore, Renquist, et al., 1940
Moore, G.E.; Renquist, M.L.; Parks, G.S.,
Thermal data on organic compounds. XX. Modern combustion data for two methylnonanes, methyl ethyl ketone, thiophene and six cycloparaffins,
J. Am. Chem. Soc., 1940, 62, 1505-1507. [all data]
Sunner, 1955
Sunner, S.,
Thermochemical investigations on organic sulfur compounds. V. On the resonance energy of thiolacetic acid, thiourea, thiosemicarbzaide, thiophene and thianthrene,
Acta Chem. Scand., 1955, 9, 847-854. [all data]
Cox and Pilcher, 1970
Cox, J.D.; Pilcher, G.,
Thermochemistry of Organic and Organometallic Compounds, Academic Press, New York, 1970, 1-636. [all data]
Figuiere, Szwarc, et al., 1985
Figuiere, P.; Szwarc, H.; Oguni, M.; Suga, H.,
Calorimetric study of thiophene from 13 to 300 K. Emergence of two glassy crystalline states,
J. Chem. Thermodynam., 1985, 17, 949-966. [all data]
Jacobs and Parks, 1934
Jacobs, C.J.; Parks, G.S.,
Thermal data on organic compounds. XIV. Some heat capacity, entropy and free energy data for cyclic substances,
J. Am. Chem. Soc., 1934, 56, 1513-1517. [all data]
Goates, Ott, et al., 1973
Goates, J.R.; Ott, J.B.; Reeder, J.,
Solid + liquid phae equilibria and solid compound formation in hexafluorobenzene + benzene, + pyridine, + furan, and + thiophen,
J. Chem. Thermodyn., 1973, 5, 135. [all data]
Timmermans and Hennaut-Roland, 1959
Timmermans, J.; Hennaut-Roland, M.,
Work of the International Bureau of Physico-Chemical Properties physical constants of twenty organic compounds,
J. Chim. Phys. Phys.-Chim. Biol., 1959, 56, 984-1023. [all data]
Timmermans and Mattaar, 1921
Timmermans, J.; Mattaar, J.F.,
Freezing points of orgainic substances VI. New experimental determinations.,
Bull. Soc. Chim. Belg., 1921, 30, 213. [all data]
Figuiere, Szwarc, et al., 1985, 2
Figuiere, P.; Szwarc, H.; Oguni, M.; Suga, H.,
Calorimetric study of thiophene from 13 to 300 K. Emergence of two glassy crystalline states,
J. Chem. Thermodyn., 1985, 17, 10, 949, https://doi.org/10.1016/0021-9614(85)90008-4
. [all data]
Waddington, Knowlton, et al., 1949, 2
Waddington, G.; Knowlton, J.W.; Scott, D.W.; Oliver, G.D.; Todd, S.S.; Hubbard, W.N.; Smith, J.C.; Huffman, H.M.,
Thermodynamic Properties of Thiophene,
J. Am. Chem. Soc., 1949, 71, 797. [all data]
Jacobs and Parks, 1934, 2
Jacobs, C.J.; Parks, G.S.,
Thermal data on organic compounds. XIV. Some heat capacity, entropy and free energy data for cyclic substances,
J. Am. Chem. Soc., 1934, 56, 1513-17. [all data]
Majer and Svoboda, 1985
Majer, V.; Svoboda, V.,
Enthalpies of Vaporization of Organic Compounds: A Critical Review and Data Compilation, Blackwell Scientific Publications, Oxford, 1985, 300. [all data]
Cheng, McCoubrey, et al., 1962
Cheng, D.C.H.; McCoubrey, J.C.; Phillips, D.G.,
Critical Temperatures of Some Organic Cyclic Compounds,
Trans. Faraday Soc., 1962, 58, 224. [all data]
Kobe, Ravicz, et al., 1956
Kobe, K.A.; Ravicz, A.E.; Vohra, S.P.,
Critical Properties and Vapor Pressures of Some Ethers and Heterocyclic Compounds,
J. Chem. Eng. Data, 1956, 1, 50. [all data]
Reid, 1972
Reid, Robert C.,
Handbook on vapor pressure and heats of vaporization of hydrocarbons and related compounds, R. C. Wilhort and B. J. Zwolinski, Texas A Research Foundation. College Station, Texas(1971). 329 pages.$10.00,
AIChE J., 1972, 18, 6, 1278-1278, https://doi.org/10.1002/aic.690180637
. [all data]
Dykyj, Svoboda, et al., 1999
Dykyj, J.; Svoboda, J.; Wilhoit, R.C.; Frenkel, M.L.; Hall, K.R.,
Vapor Pressure of Chemicals: Part A. Vapor Pressure and Antoine Constants for Hydrocarbons and Sulfur, Selenium, Tellurium and Hydrogen Containing Organic Compounds, Springer, Berlin, 1999, 373. [all data]
Eon, Pommier, et al., 1971
Eon, C.; Pommier, C.; Guiochon, G.,
Vapor pressures and second virial coefficients of some five-membered heterocyclic derivatives,
J. Chem. Eng. Data, 1971, 16, 4, 408-410, https://doi.org/10.1021/je60051a008
. [all data]
White, Barnard--Smith, et al., 1952
White, P.T.; Barnard--Smith, D.G.; Fidler, F.A.,
Vapor Pressure--Temperature Relationships of Sulfur Compounds Related to Petroleum,
Ind. Eng. Chem., 1952, 44, 6, 1430-1438, https://doi.org/10.1021/ie50510a064
. [all data]
Fawcett and Rasmussen, 1945
Fawcett, Frank S.; Rasmussen, Herbert E.,
Physical Properties of Thiophene 1,
J. Am. Chem. Soc., 1945, 67, 10, 1705-1709, https://doi.org/10.1021/ja01226a026
. [all data]
Milazzo, 1944
Milazzo, G.,
Gazz. Chim. Ital., 1944, 74, 58. [all data]
Stephenson and Malanowski, 1987
Stephenson, Richard M.; Malanowski, Stanislaw,
Handbook of the Thermodynamics of Organic Compounds, 1987, https://doi.org/10.1007/978-94-009-3173-2
. [all data]
Milazzo, 1956
Milazzo, G.,
Ann. Chim. (Rome), 1956, 46, 1105. [all data]
Domalski and Hearing, 1996
Domalski, Eugene S.; Hearing, Elizabeth D.,
Heat Capacities and Entropies of Organic Compounds in the Condensed Phase. Volume III,
J. Phys. Chem. Ref. Data, 1996, 25, 1, 1, https://doi.org/10.1063/1.555985
. [all data]
Figuiere, Szwarc, et al., 1984
Figuiere, P.; Szwarc, H.; Oguni, M.; Suga, H.,
Crystalline thiophene - calorimetric evidence for a glassy crystalline state in both phase sequences, J. Phys.,
Lett., 1984, 45(24), L1167-L1173. [all data]
Andre, Dworkin, et al., 1982
Andre, D.; Dworkin, A.; Figuiere, P.; Fuchs, A.H.; Szwarc, H.,
Heat capacity of stable and metastable phases of crystalline thiophene, C. R. Seances Acad. Sci.,
Ser. 2, 1982, 295, 145-147. [all data]
DePuy, Kass, et al., 1988
DePuy, C.H.; Kass, S.R.; Bean, G.P.,
Formation and Reactions of Heteroaromatic Anions in the Gas Phase,
J. Org. Chem., 1988, 53, 19, 4427, https://doi.org/10.1021/jo00254a001
. [all data]
Hiraoka, Takimoto, et al., 1987
Hiraoka, K.; Takimoto, H.; Yamabe, S.,
Stabilities and Structures in Cluster Ions of Five-Membered Heterocyclic Compounds Containing O, N and S Atoms,
J. Am. Chem. Soc., 1987, 109, 24, 7346, https://doi.org/10.1021/ja00258a018
. [all data]
Hunter and Lias, 1998
Hunter, E.P.; Lias, S.G.,
Evaluated Gas Phase Basicities and Proton Affinities of Molecules: An Update,
J. Phys. Chem. Ref. Data, 1998, 27, 3, 413-656, https://doi.org/10.1063/1.556018
. [all data]
Klasinc, Sabljic, et al., 1982
Klasinc, L.; Sabljic, A.; Kluge, G.; Rieger, J.; Scholz, M.,
Chemistry of excited states. Part 13. Assignment of lowest .PI.-ionizations in photoelectron spectra of thiophen, furan, and pyrrole,
J. Chem. Soc. Perkin Trans. 2, 1982, 539. [all data]
Galasso, Klasinc, et al., 1981
Galasso, V.; Klasinc, L.; Sabluic, A.; Trinajstic, N.; Pappalardo, G.C.; Steglich, W.,
Conformation and photoelectron spectra of 2-(2-Furyl)pyrrole and 2-(2-tThienyl)pyrrole,
J. Chem. Soc. Perkin Trans. 2, 1981, 127. [all data]
Tedder and Vidaud, 1980
Tedder, J.M.; Vidaud, P.H.,
Charge exchange mass spectra of thiophene, pyrrole and furan,
J. Chem. Soc. Faraday Trans. 2, 1980, 76, 1516. [all data]
Butler and Baer, 1980
Butler, J.J.; Baer, T.,
Thermochemistry and dissociation dynamics of state-selected C4H4X ions. 1. Thiophene,
J. Am. Chem. Soc., 1980, 102, 6764. [all data]
Van Veen, 1976
Van Veen, E.H.,
Triplet π-π* transitions in thiophene, furan and pyrrole by low-energy electron-impact spectroscopy,
Chem. Phys. Lett., 1976, 41, 535. [all data]
Thorstad and Undheim, 1974
Thorstad, O.; Undheim, K.,
Mass spectrometry of onium compounds. XXIV. Ionisation potential in structure analysis of pyridodiazo-oxides,
Chem. Scr., 1974, 6, 222. [all data]
Clark, Gleiter, et al., 1973
Clark, P.A.; Gleiter, R.; Heilbronner, E.,
Photoelectron spectra of planar sulfur J. Heterocycl. Chem.,
Tetrahedron, 1973, 29, 3085. [all data]
Aloisi and Pignataro, 1973
Aloisi, G.G.; Pignataro, S.,
Molecular complexes of substituted thiophens with σ and π acceptors,
J. Chem. Soc. Faraday Trans. 1, 1973, 69, 534. [all data]
DiLonardo, Galloni, et al., 1972
DiLonardo, G.; Galloni, G.; Trombetti, A.; Zauli, C.,
Electronic spectrum of thiophen and some deuterated thiophens,
J. Chem. Soc. Faraday Trans., 1972, 68, 2009. [all data]
Linda, Marino, et al., 1971
Linda, P.; Marino, G.; Pignataro, S.,
A comparison of sensitivities to substituent effects of five- membered heteroaromatic rings in gas phase ionization,
J. Chem. Soc. B, 1971, 1585. [all data]
Derrick, Asbrink, et al., 1971
Derrick, P.J.; Asbrink, L.; Edqvist, O.; Lindholm, E.,
Photoelectron-spectroscopical study of the vibrations of furan, thiophene, pyrrole and cyclopentadiene,
Spectrochim. Acta, 1971, 27A, 2525. [all data]
Potapov and Bazhenov, 1970
Potapov, V.K.; Bazhenov, B.A.,
The photionization of pyrrole, furan, and thiophene,
High Energy Chem., 1970, 505, In original 553. [all data]
Baker, Betteridge, et al., 1970
Baker, A.D.; Betteridge, D.; Kemp, N.R.; Kirby, R.E.,
Application of photoelectron spectrometry to pesticide analysis. Photoelectron spectra of fivemembered heterocycles and related molecules,
Anal. Chem., 1970, 42, 1064. [all data]
Eland, 1969
Eland, J.H.D.,
Photoelectron spectra of conjugated hydrocarbons and heteromolecules,
Intern. J. Mass Spectrom. Ion Phys., 1969, 2, 471. [all data]
Watanabe, Nakayama, et al., 1962
Watanabe, K.; Nakayama, T.; Mottl, J.,
Ionization potentials of some molecules,
J. Quant. Spectry. Radiative Transfer, 1962, 2, 369. [all data]
Price and Walsh, 1941
Price, W.C.; Walsh, A.D.,
The absorption spectra of the cyclic dienes in the vacuum ultra-violet,
Proc. Roy. Soc. (London), 1941, A179, 201. [all data]
Bajic, Humski, et al., 1985
Bajic, M.; Humski, K.; Klasinc, L.; Ruscic, B.,
Substitution effects on electronic structure of thiophene,
Z. Naturforsch. B:, 1985, 40, 1214. [all data]
Bock and Roth, 1983
Bock, H.; Roth, B.,
Radical ions. 49. Redox reactions of some thiophene derivatives,
Phosphorus Sulfur, 1983, 14, 211. [all data]
Mellink and Janssen, 1978
Mellink, W.A.; Janssen, M.J.,
Photoelectron spectra of aromatic sulphides and sulphones,
J. Chem. Res. Synop., 1978, 422. [all data]
Bozic, Humski, et al., 1977
Bozic, Z.; Humski, K.; Cvitas, T.; Klasinc, L.,
Photoelectron spectra of bromo- and iodo- thiophens,
J. Chem. Soc. Perkin Trans. 2, 1977, 1413. [all data]
Schafer, Schweig, et al., 1973
Schafer, W.; Schweig, A.; Gronowitz, S.; Taticchi, A.; Fringuelli, F.,
Reversal in the sequence of two highest occupied molecular orbitals in the series thiophen, selenophen, and tellurophen,
J. Chem. Soc. Chem. Commun., 1973, 541. [all data]
Khvostenko, 1962
Khvostenko, V.I.,
Ionisation of thiophen and some of its derivatives by electron impact,
Zh. Fiz. Khim., 1962, 36, 384, In original 197. [all data]
Stepanov, Perov, et al., 1988
Stepanov, A.N.; Perov, A.A.; Kabanov, S.P.; Simonov, A.P.,
Formation of long-lived, highly excited atoms during dissociative excitation of CH3CN, CH3CH2OH, CH3COOH, HCOOH, and C4H4S molecules on electron impact,
Russ. J. Phys. Chem., 1988, 22, 81. [all data]