Furan
- Formula: C4H4O
- Molecular weight: 68.0740
- IUPAC Standard InChIKey: YLQBMQCUIZJEEH-UHFFFAOYSA-N
- CAS Registry Number: 110-00-9
- Chemical structure:
View 3d structure (requires JavaScript / HTML 5) - Other names: Divinylene oxide; Furfuran; Oxacyclopentadiene; Oxole; Tetrole; Furane; Furfurane; NCI-C56202; Rcra waste number U124; UN 2389; 1,4-Epoxy-1,3-butadiene

Gas phase thermochemistry data

Data compiled as indicated in comments:
DRB - Donald R. Burgess, Jr.
ALS - Hussein Y. Afeefy, Joel F. Liebman, and Stephen E. Stein
GT - Glushko Thermocenter, Russian Academy of Sciences, Moscow
Quantity | Value | Units | Method | Reference | Comment |
---|---|---|---|---|---|
ΔfH°gas | -27.7 | kJ/mol | N/A | Zaheeruddin and Lodhi, 1991 | Value computed using ΔfHliquid° value of -55.4 kj/mol from Zaheeruddin and Lodhi, 1991 and ΔvapH° value of 27.6 kj/mol from Guthrie, Scott, et al., 1952.; DRB |
ΔfH°gas | -34.7 | kJ/mol | Ccb | Guthrie, Scott, et al., 1952 | ALS |
ΔfH°gas | -29.8 | kJ/mol | N/A | Landrieu, Baylocq, et al., 1929 | Value computed using ΔfHliquid° value of -57.5 kj/mol from Landrieu, Baylocq, et al., 1929 and ΔvapH° value of 27.6 kj/mol from Guthrie, Scott, et al., 1952.; DRB |
Constant pressure heat capacity of gas
Cp,gas (J/mol*K) | Temperature (K) | Reference | Comment |
---|---|---|---|
33.26 | 50. | Dorofeeva O.V., 1992 | p=1 bar. Selected entropies and heat capacities are in good agreement with those obtained in other statistical calculations [ Guthrie G.B., 1952, Bak B., 1955, Rico M., 1967, Soptrajanov B., 1968, Chao J., 1986, Klots T.D., 1994].; GT |
33.53 | 100. | ||
36.39 | 150. | ||
43.60 | 200. | ||
59.43 | 273.15 | ||
65.4 ± 1.5 | 298.15 | ||
65.85 | 300. | ||
88.80 | 400. | ||
107.82 | 500. | ||
122.77 | 600. | ||
134.59 | 700. | ||
144.13 | 800. | ||
152.00 | 900. | ||
158.60 | 1000. | ||
164.20 | 1100. | ||
168.97 | 1200. | ||
173.08 | 1300. | ||
176.62 | 1400. | ||
179.69 | 1500. |
Constant pressure heat capacity of gas
Cp,gas (J/mol*K) | Temperature (K) | Reference | Comment |
---|---|---|---|
70.29 | 317.25 | Guthrie G.B., 1952 | GT |
80.12 | 358.20 | ||
90.00 | 402.20 | ||
99.58 | 449.20 | ||
106.48 | 487.20 |

Condensed phase thermochemistry data

Data compiled as indicated in comments:
ALS - Hussein Y. Afeefy, Joel F. Liebman, and Stephen E. Stein
DH - Eugene S. Domalski and Elizabeth D. Hearing
Quantity | Value | Units | Method | Reference | Comment |
---|---|---|---|---|---|
ΔfH°liquid | Ccb | Zaheeruddin and Lodhi, 1991 | uncertain value: -55.36 kJ/mol; ALS | ||
ΔfH°liquid | -62.34 | kJ/mol | Ccb | Guthrie, Scott, et al., 1952 | ALS |
ΔfH°liquid | -57.45 | kJ/mol | Ccb | Landrieu, Baylocq, et al., 1929 | ALS |
Quantity | Value | Units | Method | Reference | Comment |
ΔcH°liquid | Ccb | Zaheeruddin and Lodhi, 1991 | uncertain value: -2090.36 kJ/mol; ALS | ||
ΔcH°liquid | -2083.5 | kJ/mol | Ccb | Guthrie, Scott, et al., 1952 | Corresponding ΔfHºliquid = -62.17 kJ/mol (simple calculation by NIST; no Washburn corrections); ALS |
ΔcH°liquid | -2088. | kJ/mol | Ccb | Landrieu, Baylocq, et al., 1929 | Corresponding ΔfHºliquid = -57.3 kJ/mol (simple calculation by NIST; no Washburn corrections); ALS |
Quantity | Value | Units | Method | Reference | Comment |
S°liquid | 176.65 | J/mol*K | N/A | Guthrie, Scott, et al., 1952, 2 | DH |
Constant pressure heat capacity of liquid
Cp,liquid (J/mol*K) | Temperature (K) | Reference | Comment |
---|---|---|---|
114.56 | 298.15 | Guthrie, Scott, et al., 1952, 2 | T = 11 to 300 K.; DH |

Phase change data

Data compiled as indicated in comments:
BS - Robert L. Brown and Stephen E. Stein
TRC - Thermodynamics Research Center, NIST Boulder Laboratories, Chris Muzny director
AC - William E. Acree, Jr., James S. Chickos
DRB - Donald R. Burgess, Jr.
DH - Eugene S. Domalski and Elizabeth D. Hearing
ALS - Hussein Y. Afeefy, Joel F. Liebman, and Stephen E. Stein
CAL - James S. Chickos, William E. Acree, Jr., Joel F. Liebman, Students of Chem 202 (Introduction to the Literature of Chemistry), University of Missouri -- St. Louis
Quantity | Value | Units | Method | Reference | Comment |
---|---|---|---|---|---|
Tboil | 304.7 ± 0.6 | K | AVG | N/A | Average of 12 out of 13 values; Individual data points |
Quantity | Value | Units | Method | Reference | Comment |
Tfus | 187.44 | K | N/A | Guanquan, Ott, et al., 1986 | Uncertainty assigned by TRC = 0.2 K; TRC |
Tfus | 187.56 | K | N/A | Goates, Ott, et al., 1973 | Uncertainty assigned by TRC = 0.05 K; TRC |
Tfus | 187.15 | K | N/A | Brooks and Pilcher, 1959 | Uncertainty assigned by TRC = 1. K; TRC |
Tfus | 187.47 | K | N/A | Boord, Greenlee, et al., 1946 | Uncertainty assigned by TRC = 0.2 K; TRC |
Tfus | 187.55 | K | N/A | Dolliver, Gresham, et al., 1938 | Uncertainty assigned by TRC = 0.3 K; TRC |
Quantity | Value | Units | Method | Reference | Comment |
Ttriple | 187.54 | K | N/A | Wilhoit, Chao, et al., 1985 | Crystal phase 1 phase; Uncertainty assigned by TRC = 0.05 K; TRC |
Ttriple | 187.55 | K | N/A | Guthrie, Scott, et al., 1952, 3 | Crystal phase 1 phase; Uncertainty assigned by TRC = 0.02 K; TRC |
Quantity | Value | Units | Method | Reference | Comment |
Tc | 490.2 | K | N/A | Majer and Svoboda, 1985 | |
Tc | 490.2 | K | N/A | Cheng, McCoubrey, et al., 1962 | Uncertainty assigned by TRC = 0.3 K; Visual (5-cm 2-mm bore tubes) in nitrate-nitrite bath, TE or TH cal. vs NPL thermometer.; TRC |
Tc | 487. | K | N/A | Kobe, Ravicz, et al., 1956 | Uncertainty assigned by TRC = 2. K; TRC |
Quantity | Value | Units | Method | Reference | Comment |
Pc | 53.20 | bar | N/A | Kobe, Ravicz, et al., 1956 | Uncertainty assigned by TRC = 1.172 bar; TRC |
Quantity | Value | Units | Method | Reference | Comment |
Vc | 0.219 | l/mol | N/A | Kobe, Ravicz, et al., 1956 | Uncertainty assigned by TRC = 0.005 l/mol; TRC |
Quantity | Value | Units | Method | Reference | Comment |
ΔvapH° | 27.71 | kJ/mol | N/A | Majer and Svoboda, 1985 | |
ΔvapH° | 28.2 | kJ/mol | N/A | Moiseev and Antonova, 1970 | Based on data from 277. to 323. K.; AC |
ΔvapH° | 27.6 | kJ/mol | N/A | Guthrie, Scott, et al., 1952 | DRB |
Reduced pressure boiling point
Tboil (K) | Pressure (bar) | Reference | Comment |
---|---|---|---|
305.2 | 1.01 | Aldrich Chemical Company Inc., 1990 | BS |
Enthalpy of vaporization
ΔvapH (kJ/mol) | Temperature (K) | Method | Reference | Comment |
---|---|---|---|---|
27.1 | 304.5 | N/A | Majer and Svoboda, 1985 | |
27.451 | 298.15 | N/A | Guthrie, Scott, et al., 1952, 2 | P = 79.934 kPa; DH |
30.2 | 253. | A | Stephenson and Malanowski, 1987 | Based on data from 238. to 356. K.; AC |
27.7 | 304.36 | E | Guthrie, Scott, et al., 1952 | ALS |
28.6 | 290. | N/A | Guthrie, Scott, et al., 1952, 2 | Based on data from 275. to 334. K. See also Boublik, Fried, et al., 1984.; AC |
27.2 | 304.2 | V | Mathews and Fehlandt, 1931 | ALS |
Enthalpy of vaporization
ΔvapH =
A exp(-βTr) (1 − Tr)β
ΔvapH =
Enthalpy of vaporization (at saturation pressure)
(kJ/mol)
Tr = reduced temperature (T / Tc)
View plot Requires a JavaScript / HTML 5 canvas capable browser.
Temperature (K) | A (kJ/mol) | β | Tc (K) | Reference | Comment |
---|---|---|---|---|---|
279. to 305. | 42.32 | 0.2802 | 490.2 | Majer and Svoboda, 1985 |
Entropy of vaporization
ΔvapS (J/mol*K) | Temperature (K) | Reference | Comment |
---|---|---|---|
92.07 | 298.15 | Guthrie, Scott, et al., 1952, 2 | P; DH |
Antoine Equation Parameters
log10(P) = A − (B / (T + C))
P = vapor pressure (bar)
T = temperature (K)
View plot Requires a JavaScript / HTML 5 canvas capable browser.
Temperature (K) | A | B | C | Reference | Comment |
---|---|---|---|---|---|
275.70 to 334.58 | 4.10003 | 1060.801 | -45.416 | Guthrie, Scott, et al., 1952, 2 | Coefficents calculated by NIST from author's data. |
Enthalpy of fusion
ΔfusH (kJ/mol) | Temperature (K) | Reference | Comment |
---|---|---|---|
3.8 | 187.6 | Domalski and Hearing, 1996 | AC |
Entropy of fusion
ΔfusS (J/mol*K) | Temperature (K) | Reference | Comment |
---|---|---|---|
13.64 | 150.0 | Domalski and Hearing, 1996 | CAL |
20.29 | 187.6 |
Enthalpy of phase transition
ΔHtrs (kJ/mol) | Temperature (K) | Initial Phase | Final Phase | Reference | Comment |
---|---|---|---|---|---|
2.0468 | 150.0 | crystaline, II | crystaline, I | Guthrie, Scott, et al., 1952, 2 | DH |
3.8024 | 187.55 | crystaline, I | liquid | Guthrie, Scott, et al., 1952, 2 | DH |
Entropy of phase transition
ΔStrs (J/mol*K) | Temperature (K) | Initial Phase | Final Phase | Reference | Comment |
---|---|---|---|---|---|
13.65 | 150.0 | crystaline, II | crystaline, I | Guthrie, Scott, et al., 1952, 2 | DH |
20.27 | 187.55 | crystaline, I | liquid | Guthrie, Scott, et al., 1952, 2 | DH |

Gas phase ion energetics data

Data evaluated as indicated in comments:
HL - Edward P. Hunter and Sharon G. Lias
L - Sharon G. Lias
Data compiled as indicated in comments:
B - John E. Bartmess
MM - Michael M. Meot-Ner (Mautner)
LL - Sharon G. Lias and Joel F. Liebman
LBLHLM - Sharon G. Lias, John E. Bartmess, Joel F. Liebman, John L. Holmes, Rhoda D. Levin, and W. Gary Mallard
LLK - Sharon G. Lias, Rhoda D. Levin, and Sherif A. Kafafi
RDSH - Henry M. Rosenstock, Keith Draxl, Bruce W. Steiner, and John T. Herron
Quantity | Value | Units | Method | Reference | Comment |
---|---|---|---|---|---|
IE (evaluated) | 8.88 ± 0.01 | eV | N/A | N/A | L |
Quantity | Value | Units | Method | Reference | Comment |
Proton affinity (review) | 803.4 | kJ/mol | N/A | Hunter and Lias, 1998 | HL |
Quantity | Value | Units | Method | Reference | Comment |
Gas basicity | 770.9 | kJ/mol | N/A | Hunter and Lias, 1998 | HL |
Proton affinity at 298K
Proton affinity (kJ/mol) | Reference | Comment |
---|---|---|
812. ± 8. | van Beelen, Koblenz, et al., 2004 | T = 298K; PA derived by authors from GB with protonation entropy equated to Rlnσ(B)/σ(BH+); MM |
813. ± 8. | van Beelen, Koblenz, et al., 2004 | T = 298K; PA derived by authors from GB with protonation entropy equated to Rlnσ(B)/σ(BH+); MM |
Gas basicity at 298K
Gas basicity (review) (kJ/mol) | Reference | Comment |
---|---|---|
781. ± 8. | van Beelen, Koblenz, et al., 2004 | T = 298K; PA derived by authors from GB with protonation entropy equated to Rlnσ(B)/σ(BH+); MM |
782. ± 8. | van Beelen, Koblenz, et al., 2004 | T = 298K; PA derived by authors from GB with protonation entropy equated to Rlnσ(B)/σ(BH+); MM |
Ionization energy determinations
Appearance energy determinations
Ion | AE (eV) | Other Products | Method | Reference | Comment |
---|---|---|---|---|---|
CHO+ | 13.2 ± 0.1 | C3H3 | PE | Willett and Baer, 1980 | LLK |
CHO+ | 13.7 ± 0.1 | C3H3 | CEMS | Tedder and Vidaud, 1980 | LLK |
C2HO+ | 12.5 ± 0.2 | C2H3 | CEMS | Tedder and Vidaud, 1980 | LLK |
C2H2O+ | 11.80 ± 0.10 | C2H2 | PE | Willett and Baer, 1980 | LLK |
C3H3+ | 12.10 ± 0.10 | CHO | PE | Willett and Baer, 1980 | LLK |
C3H3+ | 12.8 ± 0.1 | CHO | CEMS | Tedder and Vidaud, 1980 | LLK |
C3H4+ | 11.48 ± 0.05 | CO | EI | Mommers, Burgers, et al., 1984 | LBLHLM |
C3H4+ | 11.60 ± 0.10 | CO | PE | Willett and Baer, 1980 | LLK |
C3H4+ | 12.7 ± 0.1 | CO | CEMS | Tedder and Vidaud, 1980 | LLK |
De-protonation reactions
C4H3O- + =
By formula: C4H3O- + H+ = C4H4O
Quantity | Value | Units | Method | Reference | Comment |
---|---|---|---|---|---|
ΔrH° | 1636.2 ± 1.5 | kJ/mol | G+TS | Grabowski and Owusu | gas phase; B |
ΔrH° | 1624. ± 13. | kJ/mol | G+TS | DePuy, Kass, et al., 1988 | gas phase; Order:H2O < furan < 2-Me-furan < MeOH. D exchange indicates anion at C-2.; B |
Quantity | Value | Units | Method | Reference | Comment |
ΔrG° | 1602.1 ± 0.84 | kJ/mol | IMRE | Grabowski and Owusu | gas phase; B |
ΔrG° | 1590. ± 13. | kJ/mol | IMRB | DePuy, Kass, et al., 1988 | gas phase; Order:H2O < furan < 2-Me-furan < MeOH. D exchange indicates anion at C-2.; B |

Ion clustering data

Data compiled as indicated in comments:
M - Michael M. Meot-Ner (Mautner) and Sharon G. Lias
RCD - Robert C. Dunbar
Clustering reactions
By formula: C4H4O+ + C4H4O = (C4H4O+ • C4H4O)
Quantity | Value | Units | Method | Reference | Comment |
---|---|---|---|---|---|
ΔrH° | 72.0 | kJ/mol | PHPMS | Hiraoka, Takimoto, et al., 1987 | gas phase; M |
Quantity | Value | Units | Method | Reference | Comment |
ΔrS° | 99.2 | J/mol*K | PHPMS | Hiraoka, Takimoto, et al., 1987 | gas phase; M |
By formula: (C4H4O+ • C4H4O) + C4H4O = (C4H4O+ • 2C4H4O)
Quantity | Value | Units | Method | Reference | Comment |
---|---|---|---|---|---|
ΔrH° | 30. | kJ/mol | PHPMS | Hiraoka, Takimoto, et al., 1987 | gas phase; ΔrH<; M |
By formula: C4H5O+ + C4H4O = (C4H5O+ • C4H4O)
Bond type: Hydrogen bonds of the type OH-O between organics
Quantity | Value | Units | Method | Reference | Comment |
---|---|---|---|---|---|
ΔrH° | 42. | kJ/mol | PHPMS | Hiraoka, Takimoto, et al., 1987 | gas phase; ΔrH<; M |
ΔrH° | 79. | kJ/mol | PHPMS | Meot-Ner (Mautner), Ross, et al., 1985 | gas phase; Entropy change calculated or estimated, ΔrH<; M |
Quantity | Value | Units | Method | Reference | Comment |
ΔrS° | 130. | J/mol*K | N/A | Meot-Ner (Mautner), Ross, et al., 1985 | gas phase; Entropy change calculated or estimated, ΔrH<; M |
Free energy of reaction
ΔrG° (kJ/mol) | T (K) | Method | Reference | Comment |
---|---|---|---|---|
28. | 382. | PHPMS | Meot-Ner (Mautner), Ross, et al., 1985 | gas phase; Entropy change calculated or estimated, ΔrH<; M |
By formula: Na+ + C4H4O = (Na+ • C4H4O)
Free energy of reaction
ΔrG° (kJ/mol) | T (K) | Method | Reference | Comment |
---|---|---|---|---|
49.0 | 298. | IMRE | McMahon and Ohanessian, 2000 | Anchor alanine=39.89; RCD |

Reaction thermochemistry data

Data compiled as indicated in comments:
M - Michael M. Meot-Ner (Mautner) and Sharon G. Lias
B - John E. Bartmess
ALS - Hussein Y. Afeefy, Joel F. Liebman, and Stephen E. Stein
RCD - Robert C. Dunbar
Individual Reactions
By formula: C4H5O+ + C4H4O = (C4H5O+ • C4H4O)
Bond type: Hydrogen bonds of the type OH-O between organics
Quantity | Value | Units | Method | Reference | Comment |
---|---|---|---|---|---|
ΔrH° | 10. | kcal/mol | PHPMS | Hiraoka, Takimoto, et al., 1987 | gas phase; ΔrH<; M |
ΔrH° | 19. | kcal/mol | PHPMS | Meot-Ner (Mautner), Ross, et al., 1985 | gas phase; Entropy change calculated or estimated, ΔrH<; M |
Quantity | Value | Units | Method | Reference | Comment |
ΔrS° | 32. | cal/mol*K | N/A | Meot-Ner (Mautner), Ross, et al., 1985 | gas phase; Entropy change calculated or estimated, ΔrH<; M |
Free energy of reaction
ΔrG° (kcal/mol) | T (K) | Method | Reference | Comment |
---|---|---|---|---|
6.6 | 382. | PHPMS | Meot-Ner (Mautner), Ross, et al., 1985 | gas phase; Entropy change calculated or estimated, ΔrH<; M |
C4H3O- + =
By formula: C4H3O- + H+ = C4H4O
Quantity | Value | Units | Method | Reference | Comment |
---|---|---|---|---|---|
ΔrH° | 391.07 ± 0.36 | kcal/mol | G+TS | Grabowski and Owusu | gas phase; B |
ΔrH° | 388.2 ± 3.1 | kcal/mol | G+TS | DePuy, Kass, et al., 1988 | gas phase; Order:H2O < furan < 2-Me-furan < MeOH. D exchange indicates anion at C-2.; B |
Quantity | Value | Units | Method | Reference | Comment |
ΔrG° | 382.90 ± 0.20 | kcal/mol | IMRE | Grabowski and Owusu | gas phase; B |
ΔrG° | 380.0 ± 3.0 | kcal/mol | IMRB | DePuy, Kass, et al., 1988 | gas phase; Order:H2O < furan < 2-Me-furan < MeOH. D exchange indicates anion at C-2.; B |
By formula: C4H4O + 2H2 = C4H8O
Quantity | Value | Units | Method | Reference | Comment |
---|---|---|---|---|---|
ΔrH° | -36.12 ± 0.12 | kcal/mol | Chyd | Dolliver, Gresham, et al., 1938 | gas phase; Reanalyzed by Cox and Pilcher, 1970, Original value = -36.63 ± 0.12 kcal/mol; At 355 °K; ALS |
By formula: C4H4O+ + C4H4O = (C4H4O+ • C4H4O)
Quantity | Value | Units | Method | Reference | Comment |
---|---|---|---|---|---|
ΔrH° | 17.2 | kcal/mol | PHPMS | Hiraoka, Takimoto, et al., 1987 | gas phase; M |
Quantity | Value | Units | Method | Reference | Comment |
ΔrS° | 23.7 | cal/mol*K | PHPMS | Hiraoka, Takimoto, et al., 1987 | gas phase; M |
By formula: (C4H4O+ • C4H4O) + C4H4O = (C4H4O+ • 2C4H4O)
Quantity | Value | Units | Method | Reference | Comment |
---|---|---|---|---|---|
ΔrH° | 7. | kcal/mol | PHPMS | Hiraoka, Takimoto, et al., 1987 | gas phase; ΔrH<; M |
By formula: Na+ + C4H4O = (Na+ • C4H4O)
Free energy of reaction
ΔrG° (kcal/mol) | T (K) | Method | Reference | Comment |
---|---|---|---|---|
11.7 | 298. | IMRE | McMahon and Ohanessian, 2000 | Anchor alanine=39.89; RCD |

Henry's Law data

Data compiled by: Rolf Sander
Henry's Law constant (water solution)
kH(T) = k°H exp(d(ln(kH))/d(1/T) ((1/T) - 1/(298.15 K)))
k°H = Henry's law constant for solubility in water at 298.15 K (mol/(kg*bar))
d(ln(kH))/d(1/T) = Temperature dependence constant (K)
k°H (mol/(kg*bar)) | d(ln(kH))/d(1/T) (K) | Method | Reference | Comment |
---|---|---|---|---|
0.18 | Q | N/A | missing citation give several references for the Henry's law constants but don't assign them to specific species. |

Vibrational and/or electronic energy levels

Data compiled by: Takehiko Shimanouchi
Symmetry: C2ν Symmetry Number σ = 2
Sym. | No | Approximate | Selected Freq. | Infrared | Raman | Comments | ||||
---|---|---|---|---|---|---|---|---|---|---|
Species | type of mode | Value | Rating | Value | Phase | Value | Phase | |||
a1 | 1 | CH str | 3154 | D | 3154 VS p | liq. | ||||
a1 | 2 | CH str | 3140 | D | 3140 sh | gas | ||||
a1 | 3 | ip-Ring II | 1491 | C | 1491 VS | gas | 1483 VS p | liq. | ||
a1 | 4 | ip-Ring III | 1384 | C | 1384 M | gas | 1380 S p | liq. | ||
a1 | 5 | ip-Ring IV | 1140 | D | 1140 sh | liq. | 1137 VS p | liq. | ||
a1 | 6 | CH ip-bend | 1066 | C | 1066 S | gas | 1061 M p | liq. | ||
a1 | 7 | CH ip-bend | 995 | C | 995 VS | gas | 986 M p | liq. | ||
a1 | 8 | ip-Ring VII | 871 | C | 871 S | gas | ||||
a2 | 9 | CH op-bend | 863 | C | ia | OC(ν9+ν16, ν9+ν17, ν9+ν19, ν9+ν2) | ||||
a2 | 10 | CH op-bend | 728 | D | ia | 728 W dp | liq. | |||
a2 | 11 | op-Ring I | 613 | D | ia | 613 VW dp | liq. | |||
b1 | 12 | CH str | 3161 | C | 3161 M | gas | ||||
b1 | 13 | CH str | 3129 | C | 3129 M | gas | 3121 S dp | liq. | ||
b1 | 14 | ip-Ring I | 1556 | C | 1556 W | gas | ||||
b1 | 15 | CH ip-bend | 1267 | C | 1267 VW | gas | 1270 VW dp | liq. | ||
b1 | 16 | CH ip-bend | 1180 | C | 1180 VS | gas | 1171 W dp | liq. | ||
b1 | 17 | ip-Ring V | 1040 | D | 1040 sh | liq. | 1034 M dp | liq. | ||
b1 | 18 | ip-Ring VI | 873 | D | 873 W dp | liq. | ||||
b2 | 19 | CH op-bend | 838 | C | 838 VW | gas | 839 W dp | liq. | ||
b2 | 20 | CH op-bend | 745 | C | 745 VS | gas | ||||
b2 | 21 | op-Ring II | 603 | C | 603 S | gas | 601 W dp | liq. | ||
Source: Shimanouchi, 1972

Normal alkane RI, polar column, temperature ramp

Data compiled by: NIST Mass Spectrometry Data Center, William E. Wallace, director

Column type CapillaryCapillaryCapillary
Active phase HP-InnowaxZB-WaxSupelcowax-10
Column length (m) 60.60.60.
Carrier gas HeliumHeliumHe
Substrate
Column diameter (mm) 0.250.320.25
Phase thickness (μm) 0.250.500.25
Tstart (C) 60.40.35.
Tend (C) 220.220.200.
Heat rate (K/min) 3.4.4.
Initial hold (min) 1.5.10.
Final hold (min) 5.5.
I 827.813.800.
ReferenceFeng, Zhuang, et al., 2011Marin, Pozrl, et al., 2008Girard and Durance, 2000
Comment MSDC-RI MSDC-RI MSDC-RI

Kovats' RI, polar column, isothermal

Data compiled by: NIST Mass Spectrometry Data Center, William E. Wallace, director

Column type PackedPackedPackedPackedPacked
Active phase PEG-2000PEG-2000PEG-2000PEG-2000PEG-2000
Column length (m) 3.3.3.3.3.
Carrier gas HeHeHeHeHe
Substrate Celite 545 (44-60 mesh)Celite 545 (44-60 mesh)Celite 545 (44-60 mesh)Celite 545 (44-60 mesh)Celite 545 (44-60 mesh)
Column diameter (mm)
Phase thickness (μm)
Temperature (C) 150.152.179.180.200.
I 798.779.790.800.797.
ReferenceAnderson, Jurel, et al., 1973Anderson, Jurel, et al., 1973Anderson, Jurel, et al., 1973Anderson, Jurel, et al., 1973Anderson, Jurel, et al., 1973
Comment MSDC-RI MSDC-RI MSDC-RI MSDC-RI MSDC-RI
Column type Packed
Active phase PEG-2000
Column length (m) 3.
Carrier gas He
Substrate Celite 545 (44-60 mesh)
Column diameter (mm)
Phase thickness (μm)
Temperature (C) 200.
I 802.
ReferenceAnderson, Jurel, et al., 1973
Comment MSDC-RI

References

Zaheeruddin and Lodhi, 1991
Zaheeruddin, M.; Lodhi, Z.H.,
Enthalpies of formation of some cyclic compounds,
Phys. Chem. (Peshawar Pak.), 1991, 10, 111-118. [all data]
Guthrie, Scott, et al., 1952
Guthrie, G.B., Jr.; Scott, D.W.; Hubbard, W.N.; Katz, C.; McCullough, J.P.; Gross, M.E.; Williamson, K.D.; Waddington, G.,
Thermodynamic properties of furan,
J. Am. Chem. Soc., 1952, 74, 4662-46. [all data]
Landrieu, Baylocq, et al., 1929
Landrieu, P.; Baylocq, F.; Johnson, J.R.,
Etude thermochimique dans la serie furanique,
Bull. Soc. Chim. France, 1929, 45, 36-49. [all data]
Dorofeeva O.V., 1992
Dorofeeva O.V.,
Ideal gas thermodynamic properties of oxygen heterocyclic compounds. Part 1. Three-membered, four-membered and five-membered rings,
Thermochim. Acta, 1992, 194, 9-46. [all data]
Guthrie G.B., 1952
Guthrie G.B., Jr.,
Thermodynamic properties of furan,
J. Am. Chem. Soc., 1952, 74, 4662-4669. [all data]
Bak B., 1955
Bak B.,
Infrared absorption spectra of alpha and beta monodeutero, and alpha, alpha' dideutero furan vapors. Heat capacity and entropy of furan,
Acta Chem. Scand., 1955, 9, 749-762. [all data]
Rico M., 1967
Rico M.,
Fundamental vibrations of furan and deuterated derivatives,
J. Mol. Spectrosc., 1967, 24, 133-148. [all data]
Soptrajanov B., 1968
Soptrajanov B.,
Thermodynamic functions of furan and deuterated furans,
Croat. Chem. Acta, 1968, 40, 241-245. [all data]
Chao J., 1986
Chao J.,
Thermodynamic properties of key organic oxygen compounds in the carbon range C1 to C4. Part 2. Ideal gas properties,
J. Phys. Chem. Ref. Data, 1986, 15, 1369-1436. [all data]
Klots T.D., 1994
Klots T.D.,
Complete vapor phase assignment for the fundamental vibrations of furan, pyrrole and thiophene,
Spectrochim. Acta, 1994, A50, 765-795. [all data]
Guthrie, Scott, et al., 1952, 2
Guthrie, G.B., Jr.; Scott, D.W.; Hubbard, W.N.; Katz, C.; McCullough, J.P.; Gross, M.E.; Williamson, K.D.; Waddington, G.,
Thermodynamic properties of furan,
J. Am. Chem. Soc., 1952, 74, 4662-4669. [all data]
Guanquan, Ott, et al., 1986
Guanquan, C.; Ott, J.B.; Goates, J.R.,
(Solid + liquid) Phase Equilibria and Solid-Compound Formation in Tetrachloromethane + furan, + Pyridine, and + N-methylpyrrole,
J. Chem. Thermodyn., 1986, 18, 603. [all data]
Goates, Ott, et al., 1973
Goates, J.R.; Ott, J.B.; Reeder, J.,
Solid + liquid phae equilibria and solid compound formation in hexafluorobenzene + benzene, + pyridine, + furan, and + thiophen,
J. Chem. Thermodyn., 1973, 5, 135. [all data]
Brooks and Pilcher, 1959
Brooks, J.H.; Pilcher, G.,
A Simple Melting Point Calorimeter for Moderately Precise Determination of Purity,
J. Chem. Soc., 1959, 1959, 1535. [all data]
Boord, Greenlee, et al., 1946
Boord, C.E.; Greenlee, K.W.; Perilstein, W.L.,
The Synthesis, Purification and Prop. of Hydrocarbons of Low Mol. Weight, Am. Pet. Inst. Res. Proj. 45, Eighth Annu. Rep., Ohio State Univ., June 30, 1946. [all data]
Dolliver, Gresham, et al., 1938
Dolliver, M.A.; Gresham, T.L.; Kistiakowsky, G.B.; Smith, E.A.; Vaughan, W.E.,
Heats of Organic Reactions VI. Heats of Hydrogenation of Some Oxygen- Containing Compounds,
J. Am. Chem. Soc., 1938, 60, 440. [all data]
Wilhoit, Chao, et al., 1985
Wilhoit, R.C.; Chao, J.; Hall, K.R.,
Thermodynamic Properties of Key Organic Compounds in the Carbon Range C1 to C4. Part 1. Properties of Condensed Phases,
J. Phys. Chem. Ref. Data, 1985, 14, 1. [all data]
Guthrie, Scott, et al., 1952, 3
Guthrie, G.B.; Scott, D.W.; Hubbard, W.N.; Katz, C.; McCullough, J.P.; Gross, M.E.; Williamson, K.D.; Waddington, G.,
Thermodynamic properties of Furan,
J. Am. Chem. Soc., 1952, 74, 4662-9. [all data]
Majer and Svoboda, 1985
Majer, V.; Svoboda, V.,
Enthalpies of Vaporization of Organic Compounds: A Critical Review and Data Compilation, Blackwell Scientific Publications, Oxford, 1985, 300. [all data]
Cheng, McCoubrey, et al., 1962
Cheng, D.C.H.; McCoubrey, J.C.; Phillips, D.G.,
Critical Temperatures of Some Organic Cyclic Compounds,
Trans. Faraday Soc., 1962, 58, 224. [all data]
Kobe, Ravicz, et al., 1956
Kobe, K.A.; Ravicz, A.E.; Vohra, S.P.,
Critical Properties and Vapor Pressures of Some Ethers and Heterocyclic Compounds,
J. Chem. Eng. Data, 1956, 1, 50. [all data]
Moiseev and Antonova, 1970
Moiseev, V.D.; Antonova, N.D.,
Zh. Fiz. Khim., 1970, 44, 11, 2912. [all data]
Aldrich Chemical Company Inc., 1990
Aldrich Chemical Company Inc.,
Catalog Handbook of Fine Chemicals, Aldrich Chemical Company, Inc., Milwaukee WI, 1990, 1. [all data]
Stephenson and Malanowski, 1987
Stephenson, Richard M.; Malanowski, Stanislaw,
Handbook of the Thermodynamics of Organic Compounds, 1987, https://doi.org/10.1007/978-94-009-3173-2
. [all data]
Boublik, Fried, et al., 1984
Boublik, T.; Fried, V.; Hala, E.,
The Vapour Pressures of Pure Substances: Selected Values of the Temperature Dependence of the Vapour Pressures of Some Pure Substances in the Normal and Low Pressure Region, 2nd ed., Elsevier, New York, 1984, 972. [all data]
Mathews and Fehlandt, 1931
Mathews, J.H.; Fehlandt, P.R.,
The heats of vaporization of some organic compounds,
J. Am. Chem. Soc., 1931, 53, 3212-32. [all data]
Domalski and Hearing, 1996
Domalski, Eugene S.; Hearing, Elizabeth D.,
Heat Capacities and Entropies of Organic Compounds in the Condensed Phase. Volume III,
J. Phys. Chem. Ref. Data, 1996, 25, 1, 1, https://doi.org/10.1063/1.555985
. [all data]
Hunter and Lias, 1998
Hunter, E.P.; Lias, S.G.,
Evaluated Gas Phase Basicities and Proton Affinities of Molecules: An Update,
J. Phys. Chem. Ref. Data, 1998, 27, 3, 413-656, https://doi.org/10.1063/1.556018
. [all data]
van Beelen, Koblenz, et al., 2004
van Beelen, E.S.E.; Koblenz, T.A.; Ingemann, S.; Hammerum, S.,
Experimental and theoretical evaluation of proton affinities of furan, the methylphenols, and the related anisoles,
J. Phys. Chem. A, 2004, 108, 2787. [all data]
Klapstein, MacPherson, et al., 1990
Klapstein, D.; MacPherson, C.D.; O'Brien, R.T.,
The photoelectron spectra and electronic structure of 2-carbonyl furans,
Can. J. Chem., 1990, 68, 747. [all data]
Veszpremi, Nyulaszi, et al., 1987
Veszpremi, T.; Nyulaszi, L.; Nagy, J.,
Ultraviolet photoelectron spectroscopy and quantum-mechanical study of alkyl- and trimethylsilyl-furanes,
J. Organomet. Chem., 1987, 331, 175. [all data]
Arimura and Yoshikawa, 1984
Arimura, M.; Yoshikawa, Y.,
Ionization efficiency and ionization energy of cyclic compounds by electron impact,
Mass Spectrosc. (Tokyo), 1984, 32, 375. [all data]
Klasinc, Sabljic, et al., 1982
Klasinc, L.; Sabljic, A.; Kluge, G.; Rieger, J.; Scholz, M.,
Chemistry of excited states. Part 13. Assignment of lowest .PI.-ionizations in photoelectron spectra of thiophen, furan, and pyrrole,
J. Chem. Soc. Perkin Trans. 2, 1982, 539. [all data]
Kimura, Katsumata, et al., 1981
Kimura, K.; Katsumata, S.; Achiba, Y.; Yamazaki, T.; Iwata, S.,
Ionization energies, Ab initio assignments, and valence electronic structure for 200 molecules
in Handbook of HeI Photoelectron Spectra of Fundamental Organic Compounds, Japan Scientific Soc. Press, Tokyo, 1981. [all data]
Galasso, Klasinc, et al., 1981
Galasso, V.; Klasinc, L.; Sabluic, A.; Trinajstic, N.; Pappalardo, G.C.; Steglich, W.,
Conformation and photoelectron spectra of 2-(2-Furyl)pyrrole and 2-(2-tThienyl)pyrrole,
J. Chem. Soc. Perkin Trans. 2, 1981, 127. [all data]
Willett and Baer, 1980
Willett, G.D.; Baer, T.,
Thermochemistry and dissociation dynamics of state-selected C4H4X ions. 2. Furan 3-butyn-2-one,
J. Am. Chem. Soc., 1980, 102, 6769. [all data]
Tedder and Vidaud, 1980
Tedder, J.M.; Vidaud, P.H.,
Charge exchange mass spectra of thiophene, pyrrole and furan,
J. Chem. Soc. Faraday Trans. 2, 1980, 76, 1516. [all data]
Holmes and Terlouw, 1979
Holmes, J.L.; Terlouw, J.K.,
Structures of [C4H4O]+ ions produced from 2- and 4-pyrone,
J. Am. Chem. Soc., 1979, 101, 4973. [all data]
Van Veen, 1976
Van Veen, E.H.,
Triplet π-π* transitions in thiophene, furan and pyrrole by low-energy electron-impact spectroscopy,
Chem. Phys. Lett., 1976, 41, 535. [all data]
Aloisi, Santini, et al., 1975
Aloisi, G.; Santini, S.; Savelli, G.,
Molecular complexes of heteroaromatic five membered ring compounds with tetracyanoethylene. Charge transfer spectra, equilibrium constants and ionization potentials of the donors,
J. Chem. Soc. Faraday Trans. 1, 1975, 70, 2045. [all data]
Thorstad and Undheim, 1974
Thorstad, O.; Undheim, K.,
Mass spectrometry of onium compounds. XXIV. Ionisation potential in structure analysis of pyridodiazo-oxides,
Chem. Scr., 1974, 6, 222. [all data]
Linda, Marino, et al., 1971
Linda, P.; Marino, G.; Pignataro, S.,
A comparison of sensitivities to substituent effects of five- membered heteroaromatic rings in gas phase ionization,
J. Chem. Soc. B, 1971, 1585. [all data]
Derrick, Asbrink, et al., 1971
Derrick, P.J.; Asbrink, L.; Edqvist, O.; Jonsson, B.-O.; Lindholm, E.,
Rydberg series in small molecules. X. Photoelectron spectroscopy and electronic structure of furan,
Intern. J. Mass Spectrom. Ion Phys., 1971, 6, 161. [all data]
Potapov and Bazhenov, 1970
Potapov, V.K.; Bazhenov, B.A.,
The photionization of pyrrole, furan, and thiophene,
High Energy Chem., 1970, 505, In original 553. [all data]
Johnstone, Mellon, et al., 1970
Johnstone, R.A.W.; Mellon, F.A.; Ward, S.D.,
Online acquisition of ionization efficiency data,
Intern. J. Mass Spectrom. Ion Phys., 1970, 5, 241. [all data]
Baker, Betteridge, et al., 1970
Baker, A.D.; Betteridge, D.; Kemp, N.R.; Kirby, R.E.,
Application of photoelectron spectrometry to pesticide analysis. Photoelectron spectra of fivemembered heterocycles and related molecules,
Anal. Chem., 1970, 42, 1064. [all data]
Watanabe, 1957
Watanabe, K.,
Ionization potentials of some molecules,
J. Chem. Phys., 1957, 26, 542. [all data]
Zykov, Erchak, et al., 1983
Zykov, B.G.; Erchak, N.P.; Khvostenko, V.I.; Lukevits, E.; Matorykina, V.F.; Asfandiarov, N.L.,
Photoelectron spectra of furylsilanes and their carbon analogs,
J. Organomet. Chem., 1983, 253, 301. [all data]
Bock and Roth, 1983
Bock, H.; Roth, B.,
Radical ions. 49. Redox reactions of some thiophene derivatives,
Phosphorus Sulfur, 1983, 14, 211. [all data]
Kobayashi, Kubota, et al., 1982
Kobayashi, T.; Kubota, T.; Ezumi, K.; Utsunomiya, C.,
Photoelectron angular distribution study of some isoxazoles combined with perturbation theoretic approach,
Bull. Chem. Soc. Jpn., 1982, 55, 3915. [all data]
Bieri, Asbrink, et al., 1982
Bieri, G.; Asbrink, L.; Von Niessen, W.,
30.4-nm He(II) photoelectron spectra of organic molecules,
J. Electron Spectrosc. Relat. Phenom., 1982, 27, 129. [all data]
Schweig and Thiel, 1974
Schweig, A.; Thiel, W.,
Photoionization cross sections: He I- and He II-photoelectron spectra of homologous oxygen and sulphur compounds,
Mol. Phys., 1974, 27, 265. [all data]
Mommers, Burgers, et al., 1984
Mommers, A.A.; Burgers, P.C.; Holmes, J.L.; Terlouw, J.K.,
Isomeric [C3H4]+ ions: Their identification and generation in dissociative ionizations,
Org. Mass Spectrom., 1984, 19, 7. [all data]
Grabowski and Owusu
Grabowski, J.J.; Owusu, D.,
, as cited in 98CLI/WEN. [all data]
DePuy, Kass, et al., 1988
DePuy, C.H.; Kass, S.R.; Bean, G.P.,
Formation and Reactions of Heteroaromatic Anions in the Gas Phase,
J. Org. Chem., 1988, 53, 19, 4427, https://doi.org/10.1021/jo00254a001
. [all data]
Hiraoka, Takimoto, et al., 1987
Hiraoka, K.; Takimoto, H.; Yamabe, S.,
Stabilities and Structures in Cluster Ions of Five-Membered Heterocyclic Compounds Containing O, N and S Atoms,
J. Am. Chem. Soc., 1987, 109, 24, 7346, https://doi.org/10.1021/ja00258a018
. [all data]
Meot-Ner (Mautner), Ross, et al., 1985
Meot-Ner (Mautner), M.; Ross, M.M.; Campana, J.E.,
Stable Hydrogen - Bonded Isomers of Covalent Ions,
J. Am. Chem. Soc., 1985, 107, 4835. [all data]
McMahon and Ohanessian, 2000
McMahon, T.B.; Ohanessian, G.,
An Experimental and Ab Initio Study of the Nature of the Binding in Gas-Phase Complexes of Sodium Ions,
Chem. Eur. J., 2000, 6, 16, 2931, https://doi.org/10.1002/1521-3765(20000818)6:16<2931::AID-CHEM2931>3.0.CO;2-7
. [all data]