Ethyl-nitrite-
- Formula: C2H5NO2
- Molecular weight: 75.0666
- IUPAC Standard InChIKey: QQZWEECEMNQSTG-UHFFFAOYSA-N
- CAS Registry Number: 109-95-5
- Chemical structure:
View 3d structure (requires JavaScript / HTML 5) - Other names: Nitrous acid, ethyl ester

Gas phase thermochemistry data

Data compiled by: Hussein Y. Afeefy, Joel F. Liebman, and Stephen E. Stein
Quantity | Value | Units | Method | Reference | Comment |
---|---|---|---|---|---|
ΔfH°gas | -108. | kJ/mol | Kin | Rebbert and Laidler, 1952 |

Phase change data

Data compiled as indicated in comments:
TRC - Thermodynamics Research Center, NIST Boulder Laboratories, Chris Muzny director
AC - William E. Acree, Jr., James S. Chickos
Quantity | Value | Units | Method | Reference | Comment |
---|---|---|---|---|---|
Tboil | 290.15 | K | N/A | Cowley and Partington, 1933 | Uncertainty assigned by TRC = 1.5 K; TRC |
Enthalpy of vaporization
ΔvapH (kJ/mol) | Temperature (K) | Method | Reference | Comment |
---|---|---|---|---|
25.7 | 264. | A | Stephenson and Malanowski, 1987 | Based on data from 252. to 276. K. See also Thompson and Dainton, 1937.; AC |

Reaction thermochemistry data

Data compiled by: Hussein Y. Afeefy, Joel F. Liebman, and Stephen E. Stein
Individual Reactions
By formula: C2H5NO2 = NO + C2H5O
Quantity | Value | Units | Method | Reference | Comment |
---|---|---|---|---|---|
ΔrH° | 158. | kJ/mol | Kin | Rebbert and Laidler, 1952 | gas phase |

Gas phase ion energetics data

Data evaluated as indicated in comments:
HL - Edward P. Hunter and Sharon G. Lias
Data compiled as indicated in comments:
RDSH - Henry M. Rosenstock, Keith Draxl, Bruce W. Steiner, and John T. Herron
Quantity | Value | Units | Method | Reference | Comment |
---|---|---|---|---|---|
Proton affinity (review) | 818.9 | kJ/mol | N/A | Hunter and Lias, 1998 | HL |
Quantity | Value | Units | Method | Reference | Comment |
Gas basicity | 786.4 | kJ/mol | N/A | Hunter and Lias, 1998 | HL |
Ionization energy determinations
IE (eV) | Method | Reference | Comment |
---|---|---|---|
10.53 ± 0.01 | PE | Dewar, Shanshal, et al., 1969 | RDSH |
Appearance energy determinations
Ion | AE (eV) | Other Products | Method | Reference | Comment |
---|---|---|---|---|---|
C2H5O+ | 10.43 ± 0.10 | NO | EI | Haney and Franklin, 1969 | RDSH |
NO+ | 11.69 ± 0.05 | C2H5O | EI | Haney and Franklin, 1969 | RDSH |
NO+ | 11.28 ± 0.05 | C2H5O | EI | Williams and Hamill, 1968 | RDSH |

References

Rebbert and Laidler, 1952
Rebbert, R.E.; Laidler, K.J.,
Kinetics of the decomposition of diethyl peroxide,
J. Chem. Phys., 1952, 20, 574-577. [all data]
Cowley and Partington, 1933
Cowley, E.G.; Partington, J.R.,
Studies in dielectric polarisation,
J. Chem. Soc., 1933, 1933, 1252. [all data]
Stephenson and Malanowski, 1987
Stephenson, Richard M.; Malanowski, Stanislaw,
Handbook of the Thermodynamics of Organic Compounds, 1987, https://doi.org/10.1007/978-94-009-3173-2
. [all data]
Thompson and Dainton, 1937
Thompson, H.W.; Dainton, F.S.,
The photochemistry of alkyl nitrites. III,
Trans. Faraday Soc., 1937, 33, 1546, https://doi.org/10.1039/tf9373301546
. [all data]
Hunter and Lias, 1998
Hunter, E.P.; Lias, S.G.,
Evaluated Gas Phase Basicities and Proton Affinities of Molecules: An Update,
J. Phys. Chem. Ref. Data, 1998, 27, 3, 413-656, https://doi.org/10.1063/1.556018
. [all data]
Dewar, Shanshal, et al., 1969
Dewar, M.J.S.; Shanshal, M.; Worley, S.D.,
Calculated and observed ionization potentials gf nitroalkanes and of nitrous and nitric acids and esters. Extension of the MINDO method to nitrogen-oxygen compounds,
J. Am. Chem. Soc., 1969, 91, 3590. [all data]
Haney and Franklin, 1969
Haney, M.A.; Franklin, J.L.,
Excess energies in mass spectra of some oxygen-containing organic compounds,
J. Chem. Soc. Faraday Trans., 1969, 65, 1794. [all data]
Williams and Hamill, 1968
Williams, J.M.; Hamill, W.H.,
Ionization potentials of molecules and free radicals and appearance potentials by electron impact in the mass spectrometer,
J. Chem. Phys., 1968, 49, 4467. [all data]