Vinyl ether
- Formula: C4H6O
- Molecular weight: 70.0898
- IUPAC Standard InChIKey: QYKIQEUNHZKYBP-UHFFFAOYSA-N
- CAS Registry Number: 109-93-3
- Chemical structure:
View 3d structure (requires JavaScript / HTML 5) - Other names: Divinyl ether; Ethene, 1,1'-oxybis-; Divinyl oxide; Vinesthene; Vinesthesin; Vinethen; Vinethene; Vinether; Vinidyl; Vinydan; 1,1'-Oxybisethene; CH2=CHOCH=CH2; Ethenyloxyethene; Ether, divinyl

Gas phase thermochemistry data

Data compiled by: Hussein Y. Afeefy, Joel F. Liebman, and Stephen E. Stein
Quantity | Value | Units | Method | Reference | Comment |
---|---|---|---|---|---|
ΔfH°gas | -12.7 ± 0.84 | kJ/mol | Cm | Pilcher, Skinner, et al., 1963 | |
Quantity | Value | Units | Method | Reference | Comment |
ΔcH°gas | -2418.9 ± 0.79 | kJ/mol | Cm | Pilcher, Skinner, et al., 1963 | Corresponding ΔfHºgas = -12.6 kJ/mol (simple calculation by NIST; no Washburn corrections) |

Phase change data

Data compiled as indicated in comments:
BS - Robert L. Brown and Stephen E. Stein
TRC - Thermodynamics Research Center, NIST Boulder Laboratories, Chris Muzny director
ALS - Hussein Y. Afeefy, Joel F. Liebman, and Stephen E. Stein
AC - William E. Acree, Jr., James S. Chickos
Quantity | Value | Units | Method | Reference | Comment |
---|---|---|---|---|---|
Tboil | 301.2 | K | N/A | Weast and Grasselli, 1989 | BS |
Quantity | Value | Units | Method | Reference | Comment |
Tfus | 173.15 | K | N/A | Brooks and Pilcher, 1959 | Uncertainty assigned by TRC = 1. K; TRC |
Tfus | 172.05 | K | N/A | Dolliver, Gresham, et al., 1938 | Uncertainty assigned by TRC = 0.3 K; TRC |
Quantity | Value | Units | Method | Reference | Comment |
ΔvapH° | 6.260 | kJ/mol | V | Miles and Menzies, 1933 | ALS |
Enthalpy of vaporization
ΔvapH (kJ/mol) | Temperature (K) | Method | Reference | Comment |
---|---|---|---|---|
29.2 | 268. | A | Stephenson and Malanowski, 1987 | Based on data from 253. to 323. K.; AC |
26.1 | 301. | I | Miles and Menzies, 1932 | Based on data from 253. to 323. K.; AC |

Reaction thermochemistry data

Data compiled by: Hussein Y. Afeefy, Joel F. Liebman, and Stephen E. Stein
Individual Reactions
By formula: C4H6O + 2H2 = C4H10O
Quantity | Value | Units | Method | Reference | Comment |
---|---|---|---|---|---|
ΔrH° | -237.4 ± 0.42 | kJ/mol | Chyd | Dolliver, Gresham, et al., 1938, 2 | gas phase; Reanalyzed by Cox and Pilcher, 1970, Original value = -239.5 ± 0.4 kJ/mol; At 355°K |

Gas phase ion energetics data

Data compiled as indicated in comments:
LLK - Sharon G. Lias, Rhoda D. Levin, and Sherif A. Kafafi
LBLHLM - Sharon G. Lias, John E. Bartmess, Joel F. Liebman, John L. Holmes, Rhoda D. Levin, and W. Gary Mallard
Quantity | Value | Units | Method | Reference | Comment |
---|---|---|---|---|---|
ΔfH°(+) ion | 824. | kJ/mol | N/A | N/A |
Ionization energy determinations
IE (eV) | Method | Reference | Comment |
---|---|---|---|
8.68 ± 0.05 | EI | Holmes, Burgers, et al., 1981 | LLK |
Appearance energy determinations
Ion | AE (eV) | Other Products | Method | Reference | Comment |
---|---|---|---|---|---|
C2H3O+ | 10.46 ± 0.05 | C2H3 | EI | Burgers and Holmes, 1982 | LBLHLM |

Normal alkane RI, non-polar column, custom temperature program

Column type | Active phase | I | Reference | Comment |
---|---|---|---|---|
Capillary | Methyl Silicone | 480. | Zenkevich, 1996 | Program: not specified |

References

Pilcher, Skinner, et al., 1963
Pilcher, G.; Skinner, H.A.; Pell, A.S.; Pope, A.E.,
Measurements of heats of combustion by flame calorimetry. Part 1.-Diethyl ether, ethyl vinyl ether and divinyl ether,
Trans. Faraday Soc., 1963, 59, 316-330. [all data]
Weast and Grasselli, 1989
CRC Handbook of Data on Organic Compounds, 2nd Editon, Weast,R.C and Grasselli, J.G., ed(s)., CRC Press, Inc., Boca Raton, FL, 1989, 1. [all data]
Brooks and Pilcher, 1959
Brooks, J.H.; Pilcher, G.,
A Simple Melting Point Calorimeter for Moderately Precise Determination of Purity,
J. Chem. Soc., 1959, 1959, 1535. [all data]
Dolliver, Gresham, et al., 1938
Dolliver, M.A.; Gresham, T.L.; Kistiakowsky, G.B.; Smith, E.A.; Vaughan, W.E.,
Heats of Organic Reactions VI. Heats of Hydrogenation of Some Oxygen- Containing Compounds,
J. Am. Chem. Soc., 1938, 60, 440. [all data]
Miles and Menzies, 1933
Miles, F.T.; Menzies, A.W.C.,
Certain physical properties of divinyl ether,
J. Phys. Chem., 1933, 37, 425-430. [all data]
Stephenson and Malanowski, 1987
Stephenson, Richard M.; Malanowski, Stanislaw,
Handbook of the Thermodynamics of Organic Compounds, 1987, https://doi.org/10.1007/978-94-009-3173-2
. [all data]
Miles and Menzies, 1932
Miles, Francis T.; Menzies, Alan W.C.,
Certain Physical Properties of Divinyl Ether.,
J. Phys. Chem., 1932, 37, 4, 425-430, https://doi.org/10.1021/j150346a003
. [all data]
Dolliver, Gresham, et al., 1938, 2
Dolliver, M.A.; Gresham, T.L.; Kistiakowsky, G.B.; Smith, E.A.; Vaughan, W.E.,
Heats of organic reactions. VI. Heats of hydrogenation of some oxygen-containing compounds,
J. Am. Chem. Soc., 1938, 60, 440-450. [all data]
Cox and Pilcher, 1970
Cox, J.D.; Pilcher, G.,
Thermochemistry of Organic and Organometallic Compounds, Academic Press, New York, 1970, 1-636. [all data]
Holmes, Burgers, et al., 1981
Holmes, J.L.; Burgers, P.C.; Terlouw, J.K.,
Water elimination from the keto and enol tautomers of ionised ethylacetate,
Can. J. Chem., 1981, 59, 1805. [all data]
Burgers and Holmes, 1982
Burgers, P.C.; Holmes, J.L.,
Metastable ion studies. XIII. The measurement of appearance energies of metastable peaks,
Org. Mass Spectrom., 1982, 17, 123. [all data]
Harrison, Gaddis, et al., 1950
Harrison, A.J.; Gaddis, C.L.; Coffin, E.M.,
Quantitative determination of extinction coefficients in the vacuum ultraviolet: divinyl ether,
J. Chem. Phys., 1950, 18, 2, 221-223. [all data]
Zenkevich, 1996
Zenkevich, I.G.,
Informational Maitenance of Gas Chromatographic Identification of Organic Compounds in Ecoanalytical Investigations,
Z. Anal. Chem., 1996, 51, 11, 1140-1148. [all data]