Ethene, ethoxy-
- Formula: C4H8O
- Molecular weight: 72.1057
- IUPAC Standard InChIKey: FJKIXWOMBXYWOQ-UHFFFAOYSA-N
- CAS Registry Number: 109-92-2
- Chemical structure:
View 3d structure (requires JavaScript / HTML 5) - Other names: Vinamar; Ether, ethyl vinyl; Ethoxyethene; Ethoxyethylene; Ethyl vinyl ether; EVE; Vinyl ethyl ether; 1-Ethoxyethene; CH2=CHOC2H5; Ethyl ethenyl ether; Ether, vinyl ethyl; 1-Ethoxyethylene; Ethyloxyethene; NSC 8405; ((Vinyl)oxy)ethane

Phase change data

Data compiled as indicated in comments:
BS - Robert L. Brown and Stephen E. Stein
TRC - Thermodynamics Research Center, NIST Boulder Laboratories, Chris Muzny director
DRB - Donald R. Burgess, Jr.
ALS - Hussein Y. Afeefy, Joel F. Liebman, and Stephen E. Stein
AC - William E. Acree, Jr., James S. Chickos
Quantity | Value | Units | Method | Reference | Comment |
---|---|---|---|---|---|
Tboil | 306.2 | K | N/A | Aldrich Chemical Company Inc., 1990 | BS |
Tboil | 306. | K | N/A | Farchan Laboratories, 1990 | BS |
Tboil | 308.7 | K | N/A | Weast and Grasselli, 1989 | BS |
Tboil | 308.65 | K | N/A | Owen and Sorensen, 1979 | Uncertainty assigned by TRC = 1.5 K; TRC |
Tboil | 308.87 | K | N/A | Dolliver, Gresham, et al., 1938 | Uncertainty assigned by TRC = 0.15 K; TRC |
Quantity | Value | Units | Method | Reference | Comment |
Tfus | 157.35 | K | N/A | Dolliver, Gresham, et al., 1938 | Uncertainty assigned by TRC = 0.3 K; TRC |
Quantity | Value | Units | Method | Reference | Comment |
Tc | 475. | K | N/A | Kobe, Ravicz, et al., 1956 | Uncertainty assigned by TRC = 2. K; TRC |
Quantity | Value | Units | Method | Reference | Comment |
Pc | 40.7479 | bar | N/A | Kobe, Ravicz, et al., 1956 | Uncertainty assigned by TRC = 0.6894 bar; TRC |
Quantity | Value | Units | Method | Reference | Comment |
ΔvapH° | 26.4 | kJ/mol | N/A | Pilcher, Skinner, et al., 1963 | DRB |
ΔvapH° | 26.6 ± 1.3 | kJ/mol | E | Dolliver, Gresham, et al., 1938, 2 | Heat of formation derived by Cox and Pilcher, 1970; ALS |
ΔvapH° | 26.6 | kJ/mol | N/A | Dolliver, Gresham, et al., 1938, 2 | DRB |
Enthalpy of vaporization
ΔvapH (kJ/mol) | Temperature (K) | Method | Reference | Comment |
---|---|---|---|---|
29.5 | 238. | A | Stephenson and Malanowski, 1987 | Based on data from 223. to 309. K.; AC |

Reaction thermochemistry data

Data compiled by: Hussein Y. Afeefy, Joel F. Liebman, and Stephen E. Stein
Individual Reactions
By formula: C4H8O + H2 = C4H10O
Quantity | Value | Units | Method | Reference | Comment |
---|---|---|---|---|---|
ΔrH° | -110.9 ± 0.59 | kJ/mol | Chyd | Allinger, Glaser, et al., 1981 | liquid phase; solvent: Hexane |
ΔrH° | -110.8 ± 0.3 | kJ/mol | Chyd | Dolliver, Gresham, et al., 1938, 2 | gas phase; Reanalyzed by Cox and Pilcher, 1970, Original value = -112. ± 3. kJ/mol; At 355°K |
By formula: C4H9ClO = C4H8O + HCl
Quantity | Value | Units | Method | Reference | Comment |
---|---|---|---|---|---|
ΔrH° | 68.2 ± 2.1 | kJ/mol | Eqk | Failes and Stimson, 1967 | gas phase; Reanalyzed by Cox and Pilcher, 1970, Original value = 69.0 kJ/mol; At 450 K |

Gas phase ion energetics data

Data evaluated as indicated in comments:
HL - Edward P. Hunter and Sharon G. Lias
Data compiled as indicated in comments:
LBLHLM - Sharon G. Lias, John E. Bartmess, Joel F. Liebman, John L. Holmes, Rhoda D. Levin, and W. Gary Mallard
LLK - Sharon G. Lias, Rhoda D. Levin, and Sherif A. Kafafi
Quantity | Value | Units | Method | Reference | Comment |
---|---|---|---|---|---|
Proton affinity (review) | 870.1 | kJ/mol | N/A | Hunter and Lias, 1998 | HL |
Quantity | Value | Units | Method | Reference | Comment |
Gas basicity | 840.4 | kJ/mol | N/A | Hunter and Lias, 1998 | HL |
Ionization energy determinations
IE (eV) | Method | Reference | Comment |
---|---|---|---|
~8.98 | PE | Morizur, Mercier, et al., 1982 | LBLHLM |
Appearance energy determinations
Ion | AE (eV) | Other Products | Method | Reference | Comment |
---|---|---|---|---|---|
C2H3O+ | 12.3 ± 0.1 | C2H4+H | EI | Burgers and Holmes, 1982 | LBLHLM |
C2H4O+ | 10.19 | C2H4 | EI | Holmes, Terlouw, et al., 1976 | LLK |

Condensed phase thermochemistry data

Data compiled by: Hussein Y. Afeefy, Joel F. Liebman, and Stephen E. Stein
Quantity | Value | Units | Method | Reference | Comment |
---|---|---|---|---|---|
ΔfH°liquid | -166.6 ± 1.6 | kJ/mol | Ccb | Pilcher, Skinner, et al., 1963 | Heat of formation derived by Cox and Pilcher, 1970 |
ΔfH°liquid | -167.9 ± 1.6 | kJ/mol | Chyd | Dolliver, Gresham, et al., 1938 | Heat of formation derived by Cox and Pilcher, 1970 |
Quantity | Value | Units | Method | Reference | Comment |
ΔcH°liquid | -2540. ± 10. | kJ/mol | Ccb | Favorskii and Shostakovskii, 1943 | Corresponding ΔfHºliquid = -178. kJ/mol (simple calculation by NIST; no Washburn corrections) |

Gas phase thermochemistry data

Data compiled by: Hussein Y. Afeefy, Joel F. Liebman, and Stephen E. Stein
Quantity | Value | Units | Method | Reference | Comment |
---|---|---|---|---|---|
ΔfH°gas | -140.2 ± 0.96 | kJ/mol | Cm | Pilcher, Skinner, et al., 1963 | |
ΔfH°gas | -140.1 ± 0.96 | kJ/mol | Ccb | Pilcher, Skinner, et al., 1963 | Heat of formation derived by Cox and Pilcher, 1970 |
ΔfH°gas | -141.3 ± 0.92 | kJ/mol | Chyd | Dolliver, Gresham, et al., 1938 | Heat of formation derived by Cox and Pilcher, 1970 |
Quantity | Value | Units | Method | Reference | Comment |
ΔcH°gas | -2577.3 ± 0.92 | kJ/mol | Cm | Pilcher, Skinner, et al., 1963 | Corresponding ΔfHºgas = -140.1 kJ/mol (simple calculation by NIST; no Washburn corrections) |

Kovats' RI, non-polar column, isothermal

Column type | Active phase | Temperature (C) | I | Reference | Comment |
---|---|---|---|---|---|
Packed | SE-30 | 120. | 499. | García-Raso, Martínez-Castro, et al., 1987 | N2, Supelcoport; Column length: 3. m |
Packed | Squalane | 50. | 475. | Becerra, Sánchez, et al., 1982 | N2, Chromosorb W-AM; Column length: 6. m |
Packed | Apiezon L | 120. | 477. | Bogoslovsky, Anvaer, et al., 1978 | Celite 545 |
Packed | Apiezon L | 160. | 475. | Bogoslovsky, Anvaer, et al., 1978 | Celite 545 |
Packed | Apiezon M | 130. | 484. | Golovnya, Misharina, et al., 1978 | Chromosorb W, AW-DMCS; Column length: 2.1 m |

Kovats' RI, polar column, isothermal

Column type | Active phase | Temperature (C) | I | Reference | Comment |
---|---|---|---|---|---|
Capillary | Carbowax 20M | 120. | 677. | García-Raso, Martínez-Castro, et al., 1987 | N2, Supelcoport; Column length: 25. m; Column diameter: 0.22 mm |

Normal alkane RI, non-polar column, custom temperature program

Column type | Active phase | I | Reference | Comment |
---|---|---|---|---|
Capillary | Methyl Silicone | 495. | Zenkevich, 1999 | Program: not specified |
Capillary | Polydimethyl siloxanes | 495. | Zenkevich, 1997 | Program: not specified |

References

Aldrich Chemical Company Inc., 1990
Aldrich Chemical Company Inc.,
Catalog Handbook of Fine Chemicals, Aldrich Chemical Company, Inc., Milwaukee WI, 1990, 1. [all data]
Farchan Laboratories, 1990
Farchan Laboratories,
Research Chemicals Catalog, Farchan Laboratories, Gainesville, FL, 1990, 91. [all data]
Weast and Grasselli, 1989
CRC Handbook of Data on Organic Compounds, 2nd Editon, Weast,R.C and Grasselli, J.G., ed(s)., CRC Press, Inc., Boca Raton, FL, 1989, 1. [all data]
Owen and Sorensen, 1979
Owen, N.L.; Sorensen, G.O.,
Microwave spectrum, conformation, and barrier to internal rotation of ethyl vinyl ether,
J. Phys. Chem., 1979, 83, 1483. [all data]
Dolliver, Gresham, et al., 1938
Dolliver, M.A.; Gresham, T.L.; Kistiakowsky, G.B.; Smith, E.A.; Vaughan, W.E.,
Heats of Organic Reactions VI. Heats of Hydrogenation of Some Oxygen- Containing Compounds,
J. Am. Chem. Soc., 1938, 60, 440. [all data]
Kobe, Ravicz, et al., 1956
Kobe, K.A.; Ravicz, A.E.; Vohra, S.P.,
Critical Properties and Vapor Pressures of Some Ethers and Heterocyclic Compounds,
J. Chem. Eng. Data, 1956, 1, 50. [all data]
Pilcher, Skinner, et al., 1963
Pilcher, G.; Skinner, H.A.; Pell, A.S.; Pope, A.E.,
Measurements of heats of combustion by flame calorimetry. Part 1.-Diethyl ether, ethyl vinyl ether and divinyl ether,
Trans. Faraday Soc., 1963, 59, 316-330. [all data]
Dolliver, Gresham, et al., 1938, 2
Dolliver, M.A.; Gresham, T.L.; Kistiakowsky, G.B.; Smith, E.A.; Vaughan, W.E.,
Heats of organic reactions. VI. Heats of hydrogenation of some oxygen-containing compounds,
J. Am. Chem. Soc., 1938, 60, 440-450. [all data]
Cox and Pilcher, 1970
Cox, J.D.; Pilcher, G.,
Thermochemistry of Organic and Organometallic Compounds, Academic Press, New York, 1970, 1-636. [all data]
Stephenson and Malanowski, 1987
Stephenson, Richard M.; Malanowski, Stanislaw,
Handbook of the Thermodynamics of Organic Compounds, 1987, https://doi.org/10.1007/978-94-009-3173-2
. [all data]
Allinger, Glaser, et al., 1981
Allinger, N.L.; Glaser, J.A.; Davis, H.E.,
Heats of hydrogenation of some vinyl ethers and related compounds,
J. Org. Chem., 1981, 46, 658-661. [all data]
Failes and Stimson, 1967
Failes, R.L.; Stimson, V.R.,
The thermal decomposition of 1-ethoxyethyl chloride and the reverse combination,
Aust. J. Chem., 1967, 20, 1553-1560. [all data]
Hunter and Lias, 1998
Hunter, E.P.; Lias, S.G.,
Evaluated Gas Phase Basicities and Proton Affinities of Molecules: An Update,
J. Phys. Chem. Ref. Data, 1998, 27, 3, 413-656, https://doi.org/10.1063/1.556018
. [all data]
Morizur, Mercier, et al., 1982
Morizur, J.-P.; Mercier, J.; Sarraf, M.,
2-Substituted-2,3-dihydro-4H-pyrans: Competition between 'Retro Diels-Alder' fragmentation and substituent loss,
Org. Mass Spectrom., 1982, 17, 327. [all data]
Burgers and Holmes, 1982
Burgers, P.C.; Holmes, J.L.,
Metastable ion studies. XIII. The measurement of appearance energies of metastable peaks,
Org. Mass Spectrom., 1982, 17, 123. [all data]
Holmes, Terlouw, et al., 1976
Holmes, J.L.; Terlouw, J.K.; Lossing, F.P.,
The thermochemistry of C2H4O+ ions,
J. Phys. Chem., 1976, 80, 2860. [all data]