Ethane, isocyanato-
- Formula: C3H5NO
- Molecular weight: 71.0779
- IUPAC Standard InChIKey: WUDNUHPRLBTKOJ-UHFFFAOYSA-N
- CAS Registry Number: 109-90-0
- Chemical structure:
View 3d structure (requires JavaScript / HTML 5) - Other names: Isocyanic acid, ethyl ester; Ethyl isocyanate; Isocyanatoethane; C2H5NCO; UN 2481

Gas phase ion energetics data

Data compiled by: Sharon G. Lias, Rhoda D. Levin, and Sherif A. Kafafi
Ionization energy determinations
IE (eV) | Method | Reference | Comment |
---|---|---|---|
10.1 | PE | Neijzen and DeLange, 1980 | |
10.32 ± 0.05 | PE | Neijzen and DeLange, 1980 | Vertical value |

References

Neijzen and DeLange, 1980
Neijzen, B.J.M.; DeLange, C.A.,
Photoelectron spectroscopy of some thiocyanates, isocyanates and isothiocyanates,
J. Electron Spectrosc. Relat. Phenom., 1980, 18, 179. [all data]