Methylal
- Formula: C3H8O2
- Molecular weight: 76.0944
- IUPAC Standard InChIKey: NKDDWNXOKDWJAK-UHFFFAOYSA-N
- CAS Registry Number: 109-87-5
- Chemical structure:
View 3d structure (requires JavaScript / HTML 5) - Other names: Methane, dimethoxy-; Dimethyl formal; Anesthenyl; Dimethoxymethane; Formal; Formaldehyde dimethyl acetal; Methoxymethyl methyl ether; Methylene dimethyl ether; Methylene glycol dimethylether; (CH3O)2CH2; Methylenedioxydimethane; Metylal; UN 1234; Formaldehyde methyl ketal; 2,4-Dioxapentane; Dimethylacetal formaldehyde; Bis(methoxy)methane

Gas phase ion energetics data

Data compiled as indicated in comments:
LBLHLM - Sharon G. Lias, John E. Bartmess, Joel F. Liebman, John L. Holmes, Rhoda D. Levin, and W. Gary Mallard
LLK - Sharon G. Lias, Rhoda D. Levin, and Sherif A. Kafafi
RDSH - Henry M. Rosenstock, Keith Draxl, Bruce W. Steiner, and John T. Herron
Ionization energy determinations
IE (eV) | Method | Reference | Comment |
---|---|---|---|
9.7 | PE | Zverev, Villem, et al., 1982 | LBLHLM |
10.00 ± 0.05 | PI | Watanabe, Nakayama, et al., 1962 | RDSH |
10.42 | PE | Zverev, Villem, et al., 1982 | Vertical value; LBLHLM |
10.20 | PE | Kimura, Katsumata, et al., 1981 | Vertical value; LLK |
10.29 | PE | Jorgensen, 1981 | Vertical value; LLK |
Appearance energy determinations
Ion | AE (eV) | Other Products | Method | Reference | Comment |
---|---|---|---|---|---|
C2H5O+ | 10.69 ± 0.05 | CH3O | EI | Holmes and Lossing, 1984 | LBLHLM |
C2H5O+ | 11.1 | CH3O | EI | Harrison, Ivko, et al., 1966 | RDSH |
C3H7O2+ | 10.38 ± 0.03 | H | EI | Martin, Lampe, et al., 1966 | RDSH |

Gas phase thermochemistry data

Data compiled as indicated in comments:
ALS - Hussein Y. Afeefy, Joel F. Liebman, and Stephen E. Stein
GT - Glushko Thermocenter, Russian Academy of Sciences, Moscow
Quantity | Value | Units | Method | Reference | Comment |
---|---|---|---|---|---|
ΔfH°gas | -83.21 ± 0.19 | kcal/mol | Cm | Pilcher and Fletcher, 1969 | ALS |
Quantity | Value | Units | Method | Reference | Comment |
ΔcH°gas | -472.20 ± 0.18 | kcal/mol | Cm | Pilcher and Fletcher, 1969 | Corresponding ΔfHºgas = -83.21 kcal/mol (simple calculation by NIST; no Washburn corrections); ALS |
Quantity | Value | Units | Method | Reference | Comment |
S°gas | 80.24 ± 0.15 | cal/mol*K | N/A | McEachern D.M., 1964 | GT |

Condensed phase thermochemistry data

Data compiled by: Eugene S. Domalski and Elizabeth D. Hearing
Quantity | Value | Units | Method | Reference | Comment |
---|---|---|---|---|---|
S°liquid | 58.320 | cal/mol*K | N/A | McEachern and Kilpatrick, 1964 |
Constant pressure heat capacity of liquid
Cp,liquid (cal/mol*K) | Temperature (K) | Reference | Comment |
---|---|---|---|
38.580 | 298.15 | McEachern and Kilpatrick, 1964 | T = 15 to 300 K. |
39.10 | 298. | von Reis, 1881 | T = 289 to 323 K. |

Phase change data

Data compiled as indicated in comments:
BS - Robert L. Brown and Stephen E. Stein
TRC - Thermodynamics Research Center, NIST Boulder Laboratories, Chris Muzny director
AC - William E. Acree, Jr., James S. Chickos
ALS - Hussein Y. Afeefy, Joel F. Liebman, and Stephen E. Stein
DH - Eugene S. Domalski and Elizabeth D. Hearing
Quantity | Value | Units | Method | Reference | Comment |
---|---|---|---|---|---|
Tboil | 315.3 ± 0.5 | K | AVG | N/A | Average of 10 values; Individual data points |
Quantity | Value | Units | Method | Reference | Comment |
Tfus | 168. | K | N/A | Timmermans, 1935 | Uncertainty assigned by TRC = 2. K; TRC |
Tfus | 168.35 | K | N/A | Timmermans, 1934 | Uncertainty assigned by TRC = 0.5 K; TRC |
Tfus | 168.15 | K | N/A | Timmermans and Martin, 1928 | Uncertainty assigned by TRC = 0.4 K; TRC |
Tfus | 168.35 | K | N/A | Timmermans, 1911 | Uncertainty assigned by TRC = 0.3 K; TRC |
Quantity | Value | Units | Method | Reference | Comment |
Ttriple | 168.03 | K | N/A | Wilhoit, Chao, et al., 1985 | Uncertainty assigned by TRC = 0.05 K; TRC |
Ttriple | 168.01 | K | N/A | McEachern and Kilpatrick, 1964, 2 | Uncertainty assigned by TRC = 0.02 K; TRC |
Quantity | Value | Units | Method | Reference | Comment |
Tc | 480.6 | K | N/A | Kobe and Mathews, 1970 | Uncertainty assigned by TRC = 1. K; TRC |
Tc | 488.4 | K | N/A | Bourgou, 1924 | Uncertainty assigned by TRC = 6. K; TRC |
Tc | 496.8 | K | N/A | Pawlewski, 1883 | Uncertainty assigned by TRC = 10. K; TRC |
Quantity | Value | Units | Method | Reference | Comment |
Pc | 38.98 | atm | N/A | Kobe and Mathews, 1970 | Uncertainty assigned by TRC = 0.6999 atm; TRC |
Quantity | Value | Units | Method | Reference | Comment |
ρc | 4.69 | mol/l | N/A | Kobe and Mathews, 1970 | Uncertainty assigned by TRC = 0.39 mol/l; TRC |
Quantity | Value | Units | Method | Reference | Comment |
ΔvapH° | 7.07 | kcal/mol | N/A | Albert, Hahnenstein, et al., 2001 | Based on data from 273. to 357. K.; AC |
ΔvapH° | 6.904 ± 0.050 | kcal/mol | V | McEachern and Kilpatrick, 1964, 3 | ALS |
Enthalpy of vaporization
ΔvapH (kcal/mol) | Temperature (K) | Method | Reference | Comment |
---|---|---|---|---|
6.9039 | 298.15 | N/A | McEachern and Kilpatrick, 1964 | P = 53.14 kPa; DH |
7.46 | 288. | A | Stephenson and Malanowski, 1987 | Based on data from 273. to 316. K.; AC |
7.12 | 288. | A | Stephenson and Malanowski, 1987 | Based on data from 273. to 318. K.; AC |
7.24 | 305. | N/A | Brazhnikov, Peshchenko, et al., 1976 | Based on data from 296. to 314. K.; AC |
7.19 | 288. | N/A | Nicolini and Laffitte, 1949 | Based on data from 273. to 308. K.; AC |
Entropy of vaporization
ΔvapS (cal/mol*K) | Temperature (K) | Reference | Comment |
---|---|---|---|
23.2 | 298.15 | McEachern and Kilpatrick, 1964 | P; DH |
Antoine Equation Parameters
log10(P) = A − (B / (T + C))
P = vapor pressure (atm)
T = temperature (K)
View plot Requires a JavaScript / HTML 5 canvas capable browser.
Temperature (K) | A | B | C | Reference | Comment |
---|---|---|---|---|---|
273. to 308. | 4.03104 | 1068.35 | -50.409 | Nicolini and Laffitte, 1949, 2 | Coefficents calculated by NIST from author's data. |
Enthalpy of fusion
ΔfusH (kcal/mol) | Temperature (K) | Reference | Comment |
---|---|---|---|
1.9913 | 168.01 | McEachern and Kilpatrick, 1964 | DH |
1.99 | 168. | Domalski and Hearing, 1996 | AC |
Entropy of fusion
ΔfusS (cal/mol*K) | Temperature (K) | Reference | Comment |
---|---|---|---|
11.85 | 168.01 | McEachern and Kilpatrick, 1964 | DH |

Reaction thermochemistry data

Data compiled as indicated in comments:
M - Michael M. Meot-Ner (Mautner) and Sharon G. Lias
ALS - Hussein Y. Afeefy, Joel F. Liebman, and Stephen E. Stein
Individual Reactions
By formula: H4N+ + C3H8O2 = (H4N+ • C3H8O2)
Quantity | Value | Units | Method | Reference | Comment |
---|---|---|---|---|---|
ΔrH° | 29.1 | kcal/mol | PHPMS | Meot-Ner (Mautner), Sieck, et al., 1996 | gas phase; M |
Quantity | Value | Units | Method | Reference | Comment |
ΔrS° | 25.2 | cal/mol*K | PHPMS | Meot-Ner (Mautner), Sieck, et al., 1996 | gas phase; M |
By formula: C3H8O2 + H2O = CH2O + 2CH4O
Quantity | Value | Units | Method | Reference | Comment |
---|---|---|---|---|---|
ΔrH° | 18.45 ± 0.12 | kcal/mol | Cm | Birley and Skinner, 1970 | liquid phase; Heat of hydrolysis; ALS |

Henry's Law data

Data compiled by: Rolf Sander
Henry's Law constant (water solution)
kH(T) = k°H exp(d(ln(kH))/d(1/T) ((1/T) - 1/(298.15 K)))
k°H = Henry's law constant for solubility in water at 298.15 K (mol/(kg*bar))
d(ln(kH))/d(1/T) = Temperature dependence constant (K)
k°H (mol/(kg*bar)) | d(ln(kH))/d(1/T) (K) | Method | Reference | Comment |
---|---|---|---|---|
5.8 | X | N/A | Value given here as quoted by missing citation. |

Ion clustering data

Data compiled by: Michael M. Meot-Ner (Mautner) and Sharon G. Lias
Clustering reactions
By formula: H4N+ + C3H8O2 = (H4N+ • C3H8O2)
Quantity | Value | Units | Method | Reference | Comment |
---|---|---|---|---|---|
ΔrH° | 29.1 | kcal/mol | PHPMS | Meot-Ner (Mautner), Sieck, et al., 1996 | gas phase |
Quantity | Value | Units | Method | Reference | Comment |
ΔrS° | 25.2 | cal/mol*K | PHPMS | Meot-Ner (Mautner), Sieck, et al., 1996 | gas phase |

Normal alkane RI, non-polar column, custom temperature program

Data compiled by: NIST Mass Spectrometry Data Center, William E. Wallace, director

Column type CapillaryCapillaryCapillaryCapillary
Active phase SPB-1SPB-1SPB-1OV-1
Column length (m) 60.60.60.
Carrier gas HeHeliumHelium
Substrate
Column diameter (mm) 0.530.530.53
Phase thickness (μm) 5.5.05.0
Program 40C(6min) => 5C/min => 80C => 10C/min => 200C40 0C (6 min) 5 0C/min -> 80 0C 10 0C/min -> 200 0Cnot specifiednot specified
I 508.508.505.505.
ReferenceFlanagan, Streete, et al., 1997Strete, Ruprah, et al., 1992Strete, Ruprah, et al., 1992Ramsey and Flanagan, 1982
Comment MSDC-RI MSDC-RI MSDC-RI MSDC-RI

Normal alkane RI, polar column, custom temperature program

Data compiled by: NIST Mass Spectrometry Data Center, William E. Wallace, director

Column type Capillary
Active phase Carbowax 20M
Column length (m)
Carrier gas
Substrate
Column diameter (mm)
Phase thickness (μm)
Program not specified
I 740.
ReferenceRamsey and Flanagan, 1982
Comment MSDC-RI

Kovats' RI, non-polar column, isothermal

Data compiled by: NIST Mass Spectrometry Data Center, William E. Wallace, director

Column type Capillary
Active phase Squalane
Column length (m) 100.
Carrier gas
Substrate
Column diameter (mm) 0.25
Phase thickness (μm)
Temperature (C) 115.
I 500.
ReferenceLafosse and Thuaud-Chourrout, 1975
Comment MSDC-RI

References

Zverev, Villem, et al., 1982
Zverev, V.V.; Villem, Ya.Ya.; Villem, N.V.; Klimovitskii, E.N.; Arbuzov, B.A.,
Photoelectron spectra and intramolecular interactions of dimethoxymethane and 4,7-dihydro-1,3-dioxepin,
J. Gen. Chem. USSR, 1982, 52, 1674, In original 1888. [all data]
Watanabe, Nakayama, et al., 1962
Watanabe, K.; Nakayama, T.; Mottl, J.,
Ionization potentials of some molecules,
J. Quant. Spectry. Radiative Transfer, 1962, 2, 369. [all data]
Kimura, Katsumata, et al., 1981
Kimura, K.; Katsumata, S.; Achiba, Y.; Yamazaki, T.; Iwata, S.,
Ionization energies, Ab initio assignments, and valence electronic structure for 200 molecules
in Handbook of HeI Photoelectron Spectra of Fundamental Organic Compounds, Japan Scientific Soc. Press, Tokyo, 1981. [all data]
Jorgensen, 1981
Jorgensen, F.S.,
Photoelectron spectrum and molecular orbital (MNDO and PRDDO) study of dimethoxymethane,
J. Chem. Res. Synop., 1981, 212. [all data]
Holmes and Lossing, 1984
Holmes, J.L.; Lossing, F.P.,
Heats of formation of organic radicals from appearance energies,
Int. J. Mass Spectrom. Ion Processes, 1984, 58, 113. [all data]
Harrison, Ivko, et al., 1966
Harrison, A.G.; Ivko, A.; Van Raalte, D.,
Energetics of formation of some oxygenated ions and the proton affinities of carbonyl compounds,
Can. J. Chem., 1966, 44, 1625. [all data]
Martin, Lampe, et al., 1966
Martin, R.H.; Lampe, F.W.; Taft, R.W.,
An electron-impact study of ionization and dissociation in methoxy- and halogen- substituted methanes,
J. Am. Chem. Soc., 1966, 88, 1353. [all data]