Ethanol, 2-(methylamino)-
- Formula: C3H9NO
- Molecular weight: 75.1097
- IUPAC Standard InChIKey: OPKOKAMJFNKNAS-UHFFFAOYSA-N
- CAS Registry Number: 109-83-1
- Chemical structure:
View 3d structure (requires JavaScript / HTML 5) - Other names: β-(Methylamino)ethanol; (Hydroxyethyl)methylamine; (2-Hydroxyethyl)methylamine; Methyl(β-hydroxyethyl)amine; Methyl(hydroxyethyl)amine; Methyl(2-hydroxyethyl)amine; Methylaminoethanol; Methylethanolamine; Methylethylolamine; Monomethylaminoethanol; Monomethylethanolamine; Monomethylmonoethanolamine; N-(2-Hydroxyethyl)methylamine; N-Methyl-N-(β-hydroxyethyl)amine; N-Methyl-N-(2-hydroxyethyl)amine; N-Methyl-N-hydroxyethylamine; N-Methyl-2-aminoethanol; N-Methyl-2-ethanolamine; N-Methyl-2-hydroxyethylamine; N-Methylaminoethanol; N-Methylethanolamine; N-Methylmonoethanolamine; N-Monomethylaminoethanol; N-Monomethylethanolamine; 2-(Methylamino)ethanol; 2-(N-Methylamino)ethanol; 2-(N-Monomethylamino)ethanol; 2-Hydroxy-N-methylethylamine; Amietol M 11; Monomethyl-aminoaethanol; USAF DO-50; 2-Hydroxyethyl-N-methylamine; 2-Methylamino-1-ethanol; NSC 62776

Phase change data

Data compiled as indicated in comments:
BS - Robert L. Brown and Stephen E. Stein
TRC - Thermodynamics Research Center, NIST Boulder Laboratories, Chris Muzny director
AC - William E. Acree, Jr., James S. Chickos
Quantity | Value | Units | Method | Reference | Comment |
---|---|---|---|---|---|
Tboil | 431.2 | K | N/A | Weast and Grasselli, 1989 | BS |
Tboil | 428. to 429. | K | N/A | Buckingham and Donaghy, 1982 | BS |
Quantity | Value | Units | Method | Reference | Comment |
Tc | 630. | K | N/A | Steele, Chirico, et al., 1997 | Uncertainty assigned by TRC = 10. K; derived from fit of obs. vapor pressure; TRC |
Quantity | Value | Units | Method | Reference | Comment |
Pc | 53.00 | bar | N/A | Steele, Chirico, et al., 1997 | Uncertainty assigned by TRC = 5.00 bar; derived from fit of obs. vapor pressure; TRC |
Quantity | Value | Units | Method | Reference | Comment |
ρc | 3.86 | mol/l | N/A | Steele, Chirico, et al., 1997 | Uncertainty assigned by TRC = 0.27 mol/l; TRC |
Quantity | Value | Units | Method | Reference | Comment |
ΔvapH° | 57.8 ± 0.2 | kJ/mol | GS | Kapteina, Slowik, et al., 2005 | Based on data from 275. to 320. K.; AC |
ΔvapH° | 57.9 | kJ/mol | N/A | Noll, Valtz, et al., 1998 | Based on data from 269. to 401. K. See also Kapteina, Slowik, et al., 2005.; AC |
ΔvapH° | 57.0 ± 0.5 | kJ/mol | EB | Steele, Chirico, et al., 1997, 2 | Based on data from 340. to 461. K.; AC |
ΔvapH° | 57.6 | kJ/mol | EB | Smirnova, Tereshchenko, et al., 1987 | Based on data from 351. to 410. K. See also Kapteina, Slowik, et al., 2005.; AC |
ΔvapH° | 57.5 | kJ/mol | N/A | Touhara, Okazaki, et al., 1982 | Based on data from 298. to 308. K. See also Kapteina, Slowik, et al., 2005.; AC |
Reduced pressure boiling point
Tboil (K) | Pressure (bar) | Reference | Comment |
---|---|---|---|
388. to 391. | 0.007 | Buckingham and Donaghy, 1982 | BS |

Gas phase ion energetics data

Data compiled by: Sharon G. Lias, Rhoda D. Levin, and Sherif A. Kafafi
Appearance energy determinations
Ion | AE (eV) | Other Products | Method | Reference | Comment |
---|---|---|---|---|---|
C2H7N+ | 8.99 | CH2OH | EI | Lossing, Lam, et al., 1981 |

References

Weast and Grasselli, 1989
CRC Handbook of Data on Organic Compounds, 2nd Editon, Weast,R.C and Grasselli, J.G., ed(s)., CRC Press, Inc., Boca Raton, FL, 1989, 1. [all data]
Buckingham and Donaghy, 1982
Buckingham, J.; Donaghy, S.M.,
Dictionary of Organic Compounds: Fifth Edition, Chapman and Hall, New York, 1982, 1. [all data]
Steele, Chirico, et al., 1997
Steele, W.V.; Chirico, R.D.; Knipmeyer, S.E.; Nguyen, A.,
Vapor Pressure, Heat Capacity, and Density along the Saturted Line, Measurements for Cyclohexanol, 2-Cyclohexen-1-one, 1,2-Dichloropropane, 1,4-Di-tert-butylbenzene, (±)-2-Ethylhexanoic Acid, 1-(m,
J. Chem. Eng. Data, 1997, 42, 1021-36. [all data]
Kapteina, Slowik, et al., 2005
Kapteina, Simon; Slowik, Krzysztof; Verevkin, Sergey P.; Heintz, Andreas,
Vapor Pressures and Vaporization Enthalpies of a Series of Ethanolamines,
J. Chem. Eng. Data, 2005, 50, 2, 398-402, https://doi.org/10.1021/je049761y
. [all data]
Noll, Valtz, et al., 1998
Noll, O.; Valtz, A.; Richon, D.; Getachew-Sawaya, T.; Mokbel, I.; Jose, J.,
Vapor pressures and liquid densities of N-methylethanolamine, diethanolamine, and N-methyldiethanolamine,
ELDATA: Int. Electron. J. Phys. Chem. Data, 1998, 4, 3, 105. [all data]
Steele, Chirico, et al., 1997, 2
Steele, W.V.; Chirico, R.D.; Knipmeyer, S.E.; Nguyen, A.,
Vapor Pressure, Heat Capacity, and Density along the Saturation Line, Measurements for Cyclohexanol, 2-Cyclohexen-1-one, 1,2-Dichloropropane, 1,4-Di- tert -butylbenzene, (±)-2-Ethylhexanoic Acid, 2-(Methylamino)ethanol, Perfluoro- n -heptane, and Sulfolane,
J. Chem. Eng. Data, 1997, 42, 6, 1021-1036, https://doi.org/10.1021/je9701036
. [all data]
Smirnova, Tereshchenko, et al., 1987
Smirnova, G.G.; Tereshchenko, G.F.; Blagushina, M.A.,
Zh. Prikl. Khim. (S.-Peterburg), 1987, 62, 182. [all data]
Touhara, Okazaki, et al., 1982
Touhara, H.; Okazaki, S.; Okino, F.; Tanaka, H.; Ikari, K.; Nakanishi, K.,
Thermodynamic properties of aqueous mixtures of hydrophilic compounds 2. Aminoethanol and its methyl derivatives,
The Journal of Chemical Thermodynamics, 1982, 14, 2, 145-156, https://doi.org/10.1016/0021-9614(82)90026-X
. [all data]
Lossing, Lam, et al., 1981
Lossing, F.P.; Lam, Y.-T.; Maccoll, A.,
Gas phase heats of formation of alkyl immonium ions,
Can. J. Chem., 1981, 59, 2228. [all data]