Propanenitrile, 3-hydroxy-
- Formula: C3H5NO
- Molecular weight: 71.0779
- IUPAC Standard InChIKey: WSGYTJNNHPZFKR-UHFFFAOYSA-N
- CAS Registry Number: 109-78-4
- Chemical structure:
View 3d structure (requires JavaScript / HTML 5) - Other names: Hydracrylonitrile; β-Cyanoethanol; β-Hydroxypropionitrile; Ethylene cyanohydrin; Glycol cyanohydrin; Methanolacetonitrile; 2-Cyanoethanol; 2-Cyanoethyl alcohol; 2-Hydroxycyanoethane; 3-Hydroxypropanenitrile; 3-Hydroxypropionitrile; 3-Hydroxyacrylonitrile; beta-Hpn3; Hydroxypropanenitrile; Propionitrile, 3-hydroxy-; USAF RH-7; beta-Hpn; 2-Hydroxyethylkyanid; 2-Hydroxyethyl cyanide; 2-Cyano-1-ethanol; NSC 2598; 1-Cyano-2-hydroxyethane; 3-hydroxypropiononitrile

Phase change data

Data compiled as indicated in comments:
BS - Robert L. Brown and Stephen E. Stein
AC - William E. Acree, Jr., James S. Chickos
Quantity | Value | Units | Method | Reference | Comment |
---|---|---|---|---|---|
Tboil | 501.2 | K | N/A | Weast and Grasselli, 1989 | BS |
Quantity | Value | Units | Method | Reference | Comment |
ΔvapH° | 62.3 ± 0.5 | kJ/mol | GS | Roux, Notario, et al., 2007 | Based on data from 306. to 361. K.; AC |
Reduced pressure boiling point
Tboil (K) | Pressure (bar) | Reference | Comment |
---|---|---|---|
379. to 381. | 0.015 | Frinton Laboratories Inc., 1986 | BS |
Enthalpy of vaporization
ΔvapH (kJ/mol) | Temperature (K) | Method | Reference | Comment |
---|---|---|---|---|
53.4 | 346. | A | Stephenson and Malanowski, 1987 | Based on data from 331. to 494. K.; AC |
Antoine Equation Parameters
log10(P) = A − (B / (T + C))
P = vapor pressure (bar)
T = temperature (K)
View plot Requires a JavaScript / HTML 5 canvas capable browser.
Temperature (K) | A | B | C | Reference | Comment |
---|---|---|---|---|---|
331.9 to 494. | 6.44877 | 3396.536 | 32.595 | Stull, 1947 | Coefficents calculated by NIST from author's data. |

Gas phase ion energetics data

Data compiled by: Sharon G. Lias and Joel F. Liebman
Appearance energy determinations
Ion | AE (eV) | Other Products | Method | Reference | Comment |
---|---|---|---|---|---|
CH3O+ | 10.84 ± 0.02 | C2H2N | EI | Holmes, Lossing, et al., 1993 |

References

Weast and Grasselli, 1989
CRC Handbook of Data on Organic Compounds, 2nd Editon, Weast,R.C and Grasselli, J.G., ed(s)., CRC Press, Inc., Boca Raton, FL, 1989, 1. [all data]
Roux, Notario, et al., 2007
Roux, María Victoria; Notario, Rafael; Vélez, Ederley; Temprado, Manuel; Guerrero, Andrés; Verevkin, Sergey P.; Quijano, Jairo; Gaviria, Jair,
Experimental and computational thermochemical study of 3-hydroxypropanenitrile,
The Journal of Chemical Thermodynamics, 2007, 39, 10, 1377-1383, https://doi.org/10.1016/j.jct.2007.03.011
. [all data]
Frinton Laboratories Inc., 1986
Frinton Laboratories Inc.,
Catalog Number 11, Frinton Laboratories Inc., Vineland, NJ, 1986, 99. [all data]
Stephenson and Malanowski, 1987
Stephenson, Richard M.; Malanowski, Stanislaw,
Handbook of the Thermodynamics of Organic Compounds, 1987, https://doi.org/10.1007/978-94-009-3173-2
. [all data]
Stull, 1947
Stull, Daniel R.,
Vapor Pressure of Pure Substances. Organic and Inorganic Compounds,
Ind. Eng. Chem., 1947, 39, 4, 517-540, https://doi.org/10.1021/ie50448a022
. [all data]
Holmes, Lossing, et al., 1993
Holmes, J.L.; Lossing, F.P.; Mayer, P.M.,
The effects of methyl substitution on the structure and thermochemistry of the cyanomethyl radical and cation,
Chem. Phys. Lett., 1993, 212, 134. [all data]