Butanenitrile
- Formula: C4H7N
- Molecular weight: 69.1051
- IUPAC Standard InChIKey: KVNRLNFWIYMESJ-UHFFFAOYSA-N
- CAS Registry Number: 109-74-0
- Chemical structure:
View 3d structure (requires JavaScript / HTML 5) - Other names: Butyronitrile; n-Butyronitrile; Butyrylonitrile; Propyl cyanide; 1-Cyanopropane; n-C3H7CN; n-Butanitrile; n-Butanenitrile; Butyric acid nitrile; Propylkyanid; UN 2411; NSC 8412

Gas phase thermochemistry data

Data compiled by: Hussein Y. Afeefy, Joel F. Liebman, and Stephen E. Stein
Quantity | Value | Units | Method | Reference | Comment |
---|---|---|---|---|---|
ΔfH°gas | 31.2 | kJ/mol | Ccb | Evans and Skinner, 1959 | |
Quantity | Value | Units | Method | Reference | Comment |
ΔcH°gas | -2568.7 ± 0.92 | kJ/mol | Ccb | Evans and Skinner, 1959 |

Condensed phase thermochemistry data

Data compiled as indicated in comments:
ALS - Hussein Y. Afeefy, Joel F. Liebman, and Stephen E. Stein
DH - Eugene S. Domalski and Elizabeth D. Hearing
Quantity | Value | Units | Method | Reference | Comment |
---|---|---|---|---|---|
ΔfH°liquid | -5.8 ± 1.0 | kJ/mol | Ccb | Evans and Skinner, 1959 | ALS |
Quantity | Value | Units | Method | Reference | Comment |
ΔcH°liquid | -2579. | kJ/mol | Ccb | Lemoult and Jungfleisch, 1909 | ALS |
Constant pressure heat capacity of liquid
Cp,liquid (J/mol*K) | Temperature (K) | Reference | Comment |
---|---|---|---|
134.2 | 298.15 | Mirzaliev, Shakhuradov, et al., 1987 | T = 173 to 373 K. Unsmoothed experimental datum given as 1.930 kJ/kg*K at 293 K. Cp (liq) = 1.8787 + 0.0018882T/K + 7.0408x10-6T2/K2 kJ/kg*K (173 to 373 K). Note, second coefficient should be negative.; DH |
134.9 | 303.15 | Guseinov and Mirzaliev, 1985 | T = 303 to 383 K. p = 0.1 MPa. Unsmoothed experimental datum given as 1.9520 kJ/kg*K.; DH |

Phase change data

Data compiled as indicated in comments:
BS - Robert L. Brown and Stephen E. Stein
TRC - Thermodynamics Research Center, NIST Boulder Laboratories, Chris Muzny director
AC - William E. Acree, Jr., James S. Chickos
ALS - Hussein Y. Afeefy, Joel F. Liebman, and Stephen E. Stein
DRB - Donald R. Burgess, Jr.
Quantity | Value | Units | Method | Reference | Comment |
---|---|---|---|---|---|
Tboil | 391. ± 1. | K | AVG | N/A | Average of 23 out of 25 values; Individual data points |
Quantity | Value | Units | Method | Reference | Comment |
Tfus | 161.25 | K | N/A | Anonymous, 1957 | Uncertainty assigned by TRC = 0.6 K; TRC |
Tfus | 161.15 | K | N/A | Timmermans, 1935 | Uncertainty assigned by TRC = 0.5 K; TRC |
Tfus | 160. | K | N/A | Joukovsky, 1934 | Uncertainty assigned by TRC = 2. K; TRC |
Tfus | 161.25 | K | N/A | Timmermans and Delcourt, 1934 | Uncertainty assigned by TRC = 0.5 K; TRC |
Tfus | 160.9 | K | N/A | Timmermans, 1927 | Uncertainty assigned by TRC = 0.5 K; TRC |
Quantity | Value | Units | Method | Reference | Comment |
Tc | 585.4 | K | N/A | Castillo-Lopez and Trejo Rodriguez, 1987 | Uncertainty assigned by TRC = 0.2 K; Visual, TE with digital voltmeter cal. by meas. on alkanes.; TRC |
Tc | 582.1 | K | N/A | Guye and Mallet, 1902 | Uncertainty assigned by TRC = 2. K; TRC |
Tc | 582.25 | K | N/A | Guye and Mallet, 1902, 2 | Uncertainty assigned by TRC = 0.9 K; TRC |
Tc | 582.15 | K | N/A | Guye and Mallet, 1902, 2 | Uncertainty assigned by TRC = 0.9 K; TRC |
Quantity | Value | Units | Method | Reference | Comment |
Pc | 38.0 ± 0.7 | bar | AVG | N/A | Average of 6 values; Individual data points |
Quantity | Value | Units | Method | Reference | Comment |
ΔvapH° | 38. ± 3. | kJ/mol | AVG | N/A | Average of 7 values; Individual data points |
Enthalpy of vaporization
ΔvapH (kJ/mol) | Temperature (K) | Method | Reference | Comment |
---|---|---|---|---|
33.68 | 390.8 | N/A | Majer and Svoboda, 1985 | |
37.7 | 347. | A,EB | Stephenson and Malanowski, 1987 | Based on data from 332. to 401. K. See also Stull, 1947 and Meyer and Hotz, 1973.; AC |
38.8 | 318. | EB | Meyer, Renner, et al., 1971 | Based on data from 303. to 493. K.; AC |
Antoine Equation Parameters
log10(P) = A − (B / (T + C))
P = vapor pressure (bar)
T = temperature (K)
View plot Requires a JavaScript / HTML 5 canvas capable browser.
Temperature (K) | A | B | C | Reference |
---|---|---|---|---|
332.96 to 400.86 | 3.2540 ± 0.0004 | 1452.08 ± 0.80 | -48.964 ± 0.028 | Meyer and Hotz, 1973 |

Reaction thermochemistry data

Data compiled by: Michael M. Meot-Ner (Mautner) and Sharon G. Lias
Individual Reactions
By formula: CH6N+ + C4H7N = (CH6N+ • C4H7N)
Quantity | Value | Units | Method | Reference | Comment |
---|---|---|---|---|---|
ΔrH° | 118. | kJ/mol | PHPMS | Speller and Meot-Ner (Mautner), 1985 | gas phase; Entropy change calculated or estimated |
Quantity | Value | Units | Method | Reference | Comment |
ΔrS° | 110. | J/mol*K | N/A | Speller and Meot-Ner (Mautner), 1985 | gas phase; Entropy change calculated or estimated |
By formula: H4N+ + C4H7N = (H4N+ • C4H7N)
Quantity | Value | Units | Method | Reference | Comment |
---|---|---|---|---|---|
ΔrH° | 119. | kJ/mol | PHPMS | Speller and Meot-Ner (Mautner), 1985 | gas phase |
Quantity | Value | Units | Method | Reference | Comment |
ΔrS° | 90.4 | J/mol*K | PHPMS | Speller and Meot-Ner (Mautner), 1985 | gas phase |

Henry's Law data

Data compiled by: Rolf Sander
Henry's Law constant (water solution)
kH(T) = k°H exp(d(ln(kH))/d(1/T) ((1/T) - 1/(298.15 K)))
k°H = Henry's law constant for solubility in water at 298.15 K (mol/(kg*bar))
d(ln(kH))/d(1/T) = Temperature dependence constant (K)
k°H (mol/(kg*bar)) | d(ln(kH))/d(1/T) (K) | Method | Reference |
---|---|---|---|
19. | M | N/A |

Gas phase ion energetics data

Data evaluated as indicated in comments:
HL - Edward P. Hunter and Sharon G. Lias
Data compiled as indicated in comments:
LBLHLM - Sharon G. Lias, John E. Bartmess, Joel F. Liebman, John L. Holmes, Rhoda D. Levin, and W. Gary Mallard
LLK - Sharon G. Lias, Rhoda D. Levin, and Sherif A. Kafafi
RDSH - Henry M. Rosenstock, Keith Draxl, Bruce W. Steiner, and John T. Herron
B - John E. Bartmess
Quantity | Value | Units | Method | Reference | Comment |
---|---|---|---|---|---|
Proton affinity (review) | 798.4 | kJ/mol | N/A | Hunter and Lias, 1998 | HL |
Quantity | Value | Units | Method | Reference | Comment |
Gas basicity | 767.7 | kJ/mol | N/A | Hunter and Lias, 1998 | HL |
Electron affinity determinations
EA (eV) | Reference | Comment |
---|---|---|
0.016089 ± 0.000087 | Hammer, Diri, et al., 2003 | B |
Ionization energy determinations
IE (eV) | Method | Reference | Comment |
---|---|---|---|
11.2 | PE | Ohno, Matumoto, et al., 1984 | LBLHLM |
11.8 ± 0.25 | EI | Chess, Lapp, et al., 1982 | LBLHLM |
11.67 ± 0.05 | PI | Watanabe, Nakayama, et al., 1962 | RDSH |
11.74 | PE | Ohno, Matumoto, et al., 1984 | Vertical value; LBLHLM |
11.74 | PE | Kimura, Katsumata, et al., 1981 | Vertical value; LLK |
Appearance energy determinations
Ion | AE (eV) | Other Products | Method | Reference | Comment |
---|---|---|---|---|---|
C2H2+ | 15.50 | ? | EI | Heerma, deRidder, et al., 1969 | RDSH |
C2H3+ | 15.10 | ? | EI | Heerma, deRidder, et al., 1969 | RDSH |
C2H3N+ | 12.46 | ? | EI | Heerma, deRidder, et al., 1969 | RDSH |
C2H5+ | 12.97 | ? | EI | Heerma, deRidder, et al., 1969 | RDSH |
C4H6N+ | 13.00 | H | EI | Heerma, deRidder, et al., 1969 | RDSH |

Ion clustering data

Data compiled by: Michael M. Meot-Ner (Mautner) and Sharon G. Lias
Clustering reactions
By formula: CH6N+ + C4H7N = (CH6N+ • C4H7N)
Quantity | Value | Units | Method | Reference | Comment |
---|---|---|---|---|---|
ΔrH° | 118. | kJ/mol | PHPMS | Speller and Meot-Ner (Mautner), 1985 | gas phase; Entropy change calculated or estimated |
Quantity | Value | Units | Method | Reference | Comment |
ΔrS° | 110. | J/mol*K | N/A | Speller and Meot-Ner (Mautner), 1985 | gas phase; Entropy change calculated or estimated |
By formula: H4N+ + C4H7N = (H4N+ • C4H7N)
Quantity | Value | Units | Method | Reference | Comment |
---|---|---|---|---|---|
ΔrH° | 119. | kJ/mol | PHPMS | Speller and Meot-Ner (Mautner), 1985 | gas phase |
Quantity | Value | Units | Method | Reference | Comment |
ΔrS° | 90.4 | J/mol*K | PHPMS | Speller and Meot-Ner (Mautner), 1985 | gas phase |

Kovats' RI, non-polar column, isothermal

Column type | Active phase | Temperature (C) | I | Reference | Comment |
---|---|---|---|---|---|
Capillary | HP-1 | 100. | 638.86 | Görgényi and Héberger, 2003 | N2; Column length: 30. m; Phase thickness: 3. μm |
Capillary | HP-1 | 110. | 639.74 | Görgényi and Héberger, 2003 | N2; Column length: 30. m; Phase thickness: 3. μm |
Capillary | HP-1 | 120. | 640.72 | Görgényi and Héberger, 2003 | N2; Column length: 30. m; Phase thickness: 3. μm |
Capillary | HP-1 | 130. | 641.67 | Görgényi and Héberger, 2003 | N2; Column length: 30. m; Phase thickness: 3. μm |
Capillary | HP-1 | 140. | 642.74 | Görgényi and Héberger, 2003 | N2; Column length: 30. m; Phase thickness: 3. μm |
Capillary | HP-1 | 150. | 643.90 | Görgényi and Héberger, 2003 | N2; Column length: 30. m; Phase thickness: 3. μm |
Capillary | HP-1 | 160. | 645.19 | Görgényi and Héberger, 2003 | N2; Column length: 30. m; Phase thickness: 3. μm |
Capillary | HP-1 | 170. | 646.43 | Görgényi and Héberger, 2003 | N2; Column length: 30. m; Phase thickness: 3. μm |
Capillary | HP-1 | 180. | 647.77 | Görgényi and Héberger, 2003 | N2; Column length: 30. m; Phase thickness: 3. μm |
Capillary | HP-1 | 190. | 649.23 | Görgényi and Héberger, 2003 | N2; Column length: 30. m; Phase thickness: 3. μm |
Capillary | HP-1 | 20. | 635.94 | Görgényi and Héberger, 2003 | N2; Column length: 30. m; Phase thickness: 3. μm |
Capillary | HP-1 | 30. | 635.87 | Görgényi and Héberger, 2003 | N2; Column length: 30. m; Phase thickness: 3. μm |
Capillary | HP-1 | 40. | 635.97 | Görgényi and Héberger, 2003 | N2; Column length: 30. m; Phase thickness: 3. μm |
Capillary | HP-1 | 50. | 636.14 | Görgényi and Héberger, 2003 | N2; Column length: 30. m; Phase thickness: 3. μm |
Capillary | HP-1 | 60. | 636.54 | Görgényi and Héberger, 2003 | N2; Column length: 30. m; Phase thickness: 3. μm |
Capillary | HP-1 | 70. | 636.93 | Görgényi and Héberger, 2003 | N2; Column length: 30. m; Phase thickness: 3. μm |
Capillary | HP-1 | 80. | 637.50 | Görgényi and Héberger, 2003 | N2; Column length: 30. m; Phase thickness: 3. μm |
Capillary | HP-1 | 90. | 638.14 | Görgényi and Héberger, 2003 | N2; Column length: 30. m; Phase thickness: 3. μm |
Capillary | BPX-5 | 30. | 686. | Aflalaye, Sternberg, et al., 1995 | 12. m/0.15 mm/0.25 μm, H2 |
Capillary | CP Sil 5 CB | 20. | 638.1 | Do and Raulin, 1992 | 25. m/0.15 mm/2. μm, H2 |
Capillary | PoraPLOT Q | 100. | 624. | Do and Raulin, 1989 | 10. m/0.32 mm/10. μm, H2 |
Capillary | PoraPLOT Q | 160. | 622. | Do and Raulin, 1989 | 10. m/0.32 mm/10. μm, H2 |
Packed | SE-30 | 100. | 642. | Winskowski, 1983 | Gaschrom Q; Column length: 2. m |
Packed | SE-30 | 70. | 640. | Heintz, Druilhe, et al., 1977 | N2, Chromosorb W AW (0.20-0.25 mm); Column length: 3. m |
Packed | Apiezon L | 150. | 633. | Brown, Chapman, et al., 1968 | N2, DCMS-treated Chromosorb W; Column length: 2.3 m |
Packed | Apiezon L | 130. | 619. | Wehrli and Kováts, 1959 | Celite; Column length: 2.25 m |

Normal alkane RI, non-polar column, isothermal

Column type | Active phase | Temperature (C) | I | Reference | Comment |
---|---|---|---|---|---|
Capillary | Polydimethyl siloxane | 105. | 641. | Tello, Lebron-Aguilar, et al., 2009 | |
Capillary | Polydimethyl siloxane | 75. | 640. | Tello, Lebron-Aguilar, et al., 2009 | |
Capillary | Polydimethyl siloxane | 90. | 640. | Tello, Lebron-Aguilar, et al., 2009 | |
Capillary | Methyl Silicone | 100. | 640. | Lebrón-Aguilar, Quintanilla-López, et al., 2007 | |
Capillary | Methyl Silicone | 120. | 641. | Lebrón-Aguilar, Quintanilla-López, et al., 2007 | |
Capillary | Methyl Silicone | 140. | 643. | Lebrón-Aguilar, Quintanilla-López, et al., 2007 | |
Capillary | Methyl Silicone | 80. | 638. | Lebrón-Aguilar, Quintanilla-López, et al., 2007 | |
Capillary | OV-101 | 32. | 646. | Blazso, Ujszaszi, et al., 1980 | Column length: 20. m; Column diameter: 0.23 mm |

Normal alkane RI, non-polar column, temperature ramp

Column type | Active phase | I | Reference | Comment |
---|---|---|---|---|
Capillary | DB-5 | 680. | Macku and Shibamoto, 1991 | He, 40. C @ 5. min, 2. K/min; Column length: 60. m; Column diameter: 0.25 mm; Tend: 160. C |

Normal alkane RI, non-polar column, custom temperature program

Column type | Active phase | I | Reference | Comment |
---|---|---|---|---|
Capillary | OV-1, SE-30, Methyl silicone, SP-2100, OV-101, DB-1, etc. | 642. | Waggott and Davies, 1984 | Hydrogen; Column length: 50. m; Column diameter: 0.32 mm; Program: not specified |

Normal alkane RI, polar column, temperature ramp

Column type | Active phase | I | Reference | Comment |
---|---|---|---|---|
Capillary | DB-Wax | 1100. | Umano, Hagi, et al., 1995 | He, 40. C @ 2. min, 2. K/min; Column length: 60. m; Column diameter: 0.25 mm; Tend: 200. C |

References

Evans and Skinner, 1959
Evans, F.W.; Skinner, H.A.,
The heats of combustion of organic compounds of nitrogen Part 2.-n-Propyl, isopropyl and phenyl cyandies,
Trans. Faraday Soc., 1959, 55, 255-259. [all data]
Lemoult and Jungfleisch, 1909
Lemoult, M.P.; Jungfleisch, M.E.,
Thermochimie. - Comparaisons entre les nitriles et les carbylamines,
Compt. Rend., 1909, 148, 1602-1604. [all data]
Mirzaliev, Shakhuradov, et al., 1987
Mirzaliev, A.A.; Shakhuradov, Sh.G.; Guseinov, S.O.,
Investigation of the isobaric heat capacity of nitriles at different temperatures, Izv. Vyssh. Ucheb. Zaved.,
Neft i Gaz, 1987, 30(4), 55-58. [all data]
Guseinov and Mirzaliev, 1985
Guseinov, S.O.; Mirzaliev, A.A.,
Experimental investigation of volumetric and isobaric heat capacity of saturated nitriles at elevated temperatures and different pressures, Izv. Vyssh. Ucheb. Zaved.,
Neft i Gaz, 1985, 28(5), 58-62. [all data]
Anonymous, 1957
Anonymous, R.,
, Am. Pet. Inst. Res. Proj. 6, Carnegie-Mellon Univ., 1957. [all data]
Timmermans, 1935
Timmermans, J.,
Researches in Stoichiometry. I. The Heat of Fusion of Organic Compounds.,
Bull. Soc. Chim. Belg., 1935, 44, 17-40. [all data]
Joukovsky, 1934
Joukovsky, N.I.,
Experimental Study of the Theory of Concentrated Solutions. XI. Thermodynamic Properties of Concentrated Solutions of Aliphatic Organic Compounds Containing Nitrogen.,
Bull. Soc. Chim. Belg., 1934, 43, 397. [all data]
Timmermans and Delcourt, 1934
Timmermans, J.; Delcourt, Y.,
Work of the International Bureau of Physico-Chemical Standards.VI. Physical Constants of Twenty Organic Compounds.,
J. Chim. Phys. Phys.-Chim. Biol., 1934, 31, 85-121. [all data]
Timmermans, 1927
Timmermans, J.,
The Melting Point of Organic Substances,
Bull. Soc. Chim. Belg., 1927, 36, 502. [all data]
Castillo-Lopez and Trejo Rodriguez, 1987
Castillo-Lopez, N.; Trejo Rodriguez, A.,
The critical temperatures and pressures of several n-alkanenitriles,
J. Chem. Thermodyn., 1987, 19, 671. [all data]
Guye and Mallet, 1902
Guye, P.A.; Mallet, E.,
Critical Constant and Molecular Complexity of Several Organic Compds.,
C. R. Hebd. Seances Acad. Sci., 1902, 133, 168. [all data]
Guye and Mallet, 1902, 2
Guye, P.A.; Mallet, E.,
Measurement of Critical Constants,
Arch. Sci. Phys. Nat., 1902, 13, 274-296. [all data]
Majer and Svoboda, 1985
Majer, V.; Svoboda, V.,
Enthalpies of Vaporization of Organic Compounds: A Critical Review and Data Compilation, Blackwell Scientific Publications, Oxford, 1985, 300. [all data]
Stephenson and Malanowski, 1987
Stephenson, Richard M.; Malanowski, Stanislaw,
Handbook of the Thermodynamics of Organic Compounds, 1987, https://doi.org/10.1007/978-94-009-3173-2
. [all data]
Stull, 1947
Stull, Daniel R.,
Vapor Pressure of Pure Substances. Organic and Inorganic Compounds,
Ind. Eng. Chem., 1947, 39, 4, 517-540, https://doi.org/10.1021/ie50448a022
. [all data]
Meyer and Hotz, 1973
Meyer, Edwin F.; Hotz, Roger D.,
High-precision vapor-pressure data for eight organic compounds,
J. Chem. Eng. Data, 1973, 18, 4, 359-362, https://doi.org/10.1021/je60059a008
. [all data]
Meyer, Renner, et al., 1971
Meyer, Edwin F.; Renner, Terrence A.; Stec, Kenneth S.,
Cohesive energies in polar organic liquids. II. n-Alkane nitriles and the 1-chloro alkanes,
J. Phys. Chem., 1971, 75, 5, 642-648, https://doi.org/10.1021/j100675a008
. [all data]
Speller and Meot-Ner (Mautner), 1985
Speller, C.V.; Meot-Ner (Mautner), M.,
The Ionic Hydrogen Bond and Ion Solvation. 3. Bonds Involving Cyanides. Correlations with Proton Affinites,
J. Phys. Chem., 1985, 81, 24, 5217, https://doi.org/10.1021/j100270a020
. [all data]
Hunter and Lias, 1998
Hunter, E.P.; Lias, S.G.,
Evaluated Gas Phase Basicities and Proton Affinities of Molecules: An Update,
J. Phys. Chem. Ref. Data, 1998, 27, 3, 413-656, https://doi.org/10.1063/1.556018
. [all data]
Hammer, Diri, et al., 2003
Hammer, N.I.; Diri, K.; Jordan, K.D.; Desfrancois, C.; Compton, R.N.,
Dipole-bound anions of carbonyl, nitrile, and sulfoxide containing molecules,
J. Chem. Phys., 2003, 119, 7, 3650-3660, https://doi.org/10.1063/1.1590959
. [all data]
Ohno, Matumoto, et al., 1984
Ohno, K.; Matumoto, S.; Imai, K.; Haraa, Y.,
Penning ionization electron spectroscopy of nitriles,
J. Phys. Chem., 1984, 88, 206. [all data]
Chess, Lapp, et al., 1982
Chess, E.K.; Lapp, R.L.; Gross, M.L.,
The question of tautomerism of alkylnitrile and isonitrile radical cations,
Org. Mass Spectrom., 1982, 17, 475. [all data]
Watanabe, Nakayama, et al., 1962
Watanabe, K.; Nakayama, T.; Mottl, J.,
Ionization potentials of some molecules,
J. Quant. Spectry. Radiative Transfer, 1962, 2, 369. [all data]
Kimura, Katsumata, et al., 1981
Kimura, K.; Katsumata, S.; Achiba, Y.; Yamazaki, T.; Iwata, S.,
Ionization energies, Ab initio assignments, and valence electronic structure for 200 molecules
in Handbook of HeI Photoelectron Spectra of Fundamental Organic Compounds, Japan Scientific Soc. Press, Tokyo, 1981. [all data]
Heerma, deRidder, et al., 1969
Heerma, W.; deRidder, J.J.; Dijkstra, G.,
The electron-impact-induced fragmentation of n-alkyl cyanides,
Org. Mass Spectrom., 1969, 2, 1103. [all data]
Görgényi and Héberger, 2003
Görgényi, M.; Héberger, K.,
Minimum in the temperature dependence of the Kováts retention indices of nitroalkanes and alkanenitriles on an apolar phase,
J. Chromatogr. A, 2003, 985, 1-2, 11-19, https://doi.org/10.1016/S0021-9673(02)01842-3
. [all data]
Aflalaye, Sternberg, et al., 1995
Aflalaye, A.; Sternberg, R.; Raulin, F.; Vidal-Madjar, C.,
Gas chromatography of Titan's atmosphere. VI. Analysis of low-molecular-mass hydrocarbons and nitriles with BPX5 capillary columns,
J. Chromatogr. A, 1995, 708, 2, 283-291, https://doi.org/10.1016/0021-9673(95)00410-O
. [all data]
Do and Raulin, 1992
Do, L.; Raulin, F.,
Gas chromatography of Titan's atmosphere. III. Analysis of low-molecular-weight hydrocarbons and nitriles with a CP-Sil-5 CB WCOT capillary column,
J. Chromatogr., 1992, 591, 1-2, 297-301, https://doi.org/10.1016/0021-9673(92)80247-R
. [all data]
Do and Raulin, 1989
Do, L.; Raulin, F.,
Gas chromatography of Titan's atmosphere. I. Analysis of low-molecular-weight hydrocarbons and nitriles with a PoraPLOT Q porous polymer coated open-tubular capillary column,
J. Chromatogr., 1989, 481, 45-54, https://doi.org/10.1016/S0021-9673(01)96751-2
. [all data]
Winskowski, 1983
Winskowski, J.,
Gaschromatographische Identifizierung von Stoffen anhand von Indexziffem und unterschiedlichen Detektoren,
Chromatographia, 1983, 17, 3, 160-165, https://doi.org/10.1007/BF02271041
. [all data]
Heintz, Druilhe, et al., 1977
Heintz, M.; Druilhe, A.; De Peretti, D.; Seyden, J.; Lefort, D.,
Relations entre structure chimique et grandeurs de retention. VII. Composés de structure cyclopropanique,
Chromatographia, 1977, 10, 10, 588-592, https://doi.org/10.1007/BF02265036
. [all data]
Brown, Chapman, et al., 1968
Brown, I.; Chapman, I.L.; Nicholson, G.J.,
Gas chromatography of polar solutes in electron acceptor stationary phases,
Aust. J. Chem., 1968, 21, 5, 1125-1141, https://doi.org/10.1071/CH9681125
. [all data]
Wehrli and Kováts, 1959
Wehrli, A.; Kováts, E.,
Gas-chromatographische Charakterisierung ogranischer Verbindungen. Teil 3: Berechnung der Retentionsindices aliphatischer, alicyclischer und aromatischer Verbindungen,
Helv. Chim. Acta, 1959, 7, 7, 2709-2736, https://doi.org/10.1002/hlca.19590420745
. [all data]
Tello, Lebron-Aguilar, et al., 2009
Tello, A.M.; Lebron-Aguilar, R.; Quintanilla-Lopez, J.E.; Santiuste, J.M.,
Isothermal retention indices on poly93-cyanopropylmethyl)siloxane stationary phases,
J. Chromatogr. A, 2009, 1216, 10, 1630-1639, https://doi.org/10.1016/j.chroma.2008.10.025
. [all data]
Lebrón-Aguilar, Quintanilla-López, et al., 2007
Lebrón-Aguilar, R.; Quintanilla-López, J.E.; Tello, A.M.; Santiuste, J.M.,
Isothermal retention indices on poly (3,3,3-trifluoropropylmethylsiloxane) stationary phases,
J. Chromatogr. A, 2007, 1160, 1-2, 276-288, https://doi.org/10.1016/j.chroma.2007.05.025
. [all data]
Blazso, Ujszaszi, et al., 1980
Blazso, M.; Ujszaszi, K.; Jakab, E.,
Isomeric structure of styrene-acrylonitrile and styrene-methylacrylate copolymer pyrolysis products,
Chromatographia, 1980, 13, 3, 151-156, https://doi.org/10.1007/BF02259304
. [all data]
Macku and Shibamoto, 1991
Macku, C.; Shibamoto, T.,
Headspace volatile compounds formed from heated corn oil and corn oil with glycine,
J. Agric. Food Chem., 1991, 39, 7, 1265-1269, https://doi.org/10.1021/jf00007a014
. [all data]
Waggott and Davies, 1984
Waggott, A.; Davies, I.W.,
Identification of organic pollutants using linear temperature programmed retention indices (LTPRIs) - Part II, 1984, retrieved from http://dwi.defra.gov.uk/research/completed-research/reports/dwi0383.pdf. [all data]
Umano, Hagi, et al., 1995
Umano, K.; Hagi, Y.; Nakahara, K.; Shyoji, A.; Shibamoto, T.,
Volatile chemicals formed in the headspace of a heated D-glucose/L-cysteine Maillard model system,
J. Agric. Food Chem., 1995, 43, 8, 2212-2218, https://doi.org/10.1021/jf00056a046
. [all data]