1-Butanamine
- Formula: C4H11N
- Molecular weight: 73.1368
- IUPAC Standard InChIKey: HQABUPZFAYXKJW-UHFFFAOYSA-N
- CAS Registry Number: 109-73-9
- Chemical structure:
View 3d structure (requires JavaScript / HTML 5) - Other names: Butylamine; n-Butylamine; Mono-n-butylamine; Monobutylamine; Norvalamine; 1-Aminobutane; 1-Butylamine; n-C4H9NH2; N-Butylamin; 1-Amino-butaan; 1-Aminobutan; n-Butilamina; Monobutilamina; UN 1125; Norralamine; Butanamine; NSC 8029; Aminobutane (Related)

Gas phase thermochemistry data

Data compiled as indicated in comments:
ALS - Hussein Y. Afeefy, Joel F. Liebman, and Stephen E. Stein
DRB - Donald R. Burgess, Jr.
Quantity | Value | Units | Method | Reference | Comment |
---|---|---|---|---|---|
ΔfH°gas | -95. ± 2. | kJ/mol | Ccb | Evans, Fairbrother, et al., 1959 | Heat of formation derived by Cox and Pilcher, 1970; ALS |
ΔfH°gas | -149.3 | kJ/mol | N/A | Lemoult, 1907 | Value computed using ΔfHliquid° value of -182.0 kj/mol from Lemoult, 1907 and ΔvapH° value of 32.7 kj/mol from Evans, Fairbrother, et al., 1959.; DRB |

Condensed phase thermochemistry data

Data compiled as indicated in comments:
ALS - Hussein Y. Afeefy, Joel F. Liebman, and Stephen E. Stein
DH - Eugene S. Domalski and Elizabeth D. Hearing
Quantity | Value | Units | Method | Reference | Comment |
---|---|---|---|---|---|
ΔfH°liquid | -127.7 ± 1.2 | kJ/mol | Ccb | Evans, Fairbrother, et al., 1959 | Heat of formation derived by Cox and Pilcher, 1970; ALS |
ΔfH°liquid | -182. | kJ/mol | Ccb | Lemoult, 1907 | ALS |
Quantity | Value | Units | Method | Reference | Comment |
ΔcH°liquid | -3018.5 ± 1.1 | kJ/mol | Ccb | Evans, Fairbrother, et al., 1959 | Heat of formation derived by Cox and Pilcher, 1970; ALS |
ΔcH°liquid | -2984. | kJ/mol | Ccb | Lemoult, 1907 | ALS |
Quantity | Value | Units | Method | Reference | Comment |
ΔcH°solid | -3018. | kJ/mol | Ccb | Skuratov and Bonetskaya, 1966 | ALS |
Constant pressure heat capacity of liquid
Cp,liquid (J/mol*K) | Temperature (K) | Reference | Comment |
---|---|---|---|
188. | 298.15 | Konicek and Wadso, 1971 | DH |

Phase change data

Data compiled as indicated in comments:
BS - Robert L. Brown and Stephen E. Stein
TRC - Thermodynamics Research Center, NIST Boulder Laboratories, Chris Muzny director
AC - William E. Acree, Jr., James S. Chickos
ALS - Hussein Y. Afeefy, Joel F. Liebman, and Stephen E. Stein
DRB - Donald R. Burgess, Jr.
Quantity | Value | Units | Method | Reference | Comment |
---|---|---|---|---|---|
Tboil | 351. ± 1. | K | AVG | N/A | Average of 25 out of 27 values; Individual data points |
Quantity | Value | Units | Method | Reference | Comment |
Tfus | 224. | K | N/A | Favier, Rosso, et al., 1981 | Uncertainty assigned by TRC = 0.1 K; TRC |
Tfus | 222.65 | K | N/A | Timmermans and Mattaar, 1921 | Uncertainty assigned by TRC = 0.5 K; TRC |
Quantity | Value | Units | Method | Reference | Comment |
Tc | 524. | K | N/A | Majer and Svoboda, 1985 | |
Tc | 531.9 | K | N/A | Toczylkin. L.S. and Young, 1980 | Uncertainty assigned by TRC = 0.53 K; TRC |
Tc | 524.15 | K | N/A | Glaser and Ruland, 1957 | Uncertainty assigned by TRC = 1.5 K; TRC |
Quantity | Value | Units | Method | Reference | Comment |
Pc | 42.00 | bar | N/A | Toczylkin. L.S. and Young, 1980 | Uncertainty assigned by TRC = 0.4196 bar; Visual; TRC |
Pc | 41.5433 | bar | N/A | Glaser and Ruland, 1957 | Uncertainty assigned by TRC = 0.015 bar; TRC |
Quantity | Value | Units | Method | Reference | Comment |
ΔvapH° | 34. ± 5. | kJ/mol | AVG | N/A | Average of 10 values; Individual data points |
Enthalpy of vaporization
ΔvapH (kJ/mol) | Temperature (K) | Method | Reference | Comment |
---|---|---|---|---|
31.81 | 350.2 | N/A | Majer and Svoboda, 1985 | |
35.2 | 313. | I | Belaribi, Belaribi-Boukais, et al., 2000 | Based on data from 298. to 343. K.; AC |
34.7 | 328. | A | Stephenson and Malanowski, 1987 | Based on data from 313. to 350. K.; AC |
35.5 | 311. | EB | Majer, Svoboda, et al., 1979 | Based on data from 296. to 349. K.; AC |
34.7 ± 0.1 | 313. | C | Majer, Svoboda, et al., 1979 | AC |
33.5 ± 0.1 | 323. | C | Majer, Svoboda, et al., 1979 | AC |
32.4 ± 0.1 | 343. | C | Majer, Svoboda, et al., 1979 | AC |
31.1 ± 0.1 | 358. | C | Majer, Svoboda, et al., 1979 | AC |
Enthalpy of vaporization
ΔvapH =
A exp(-βTr) (1 − Tr)β
ΔvapH =
Enthalpy of vaporization (at saturation pressure)
(kJ/mol)
Tr = reduced temperature (T / Tc)
View plot Requires a JavaScript / HTML 5 canvas capable browser.
Temperature (K) | A (kJ/mol) | β | Tc (K) | Reference | Comment |
---|---|---|---|---|---|
298. to 358. | 56.14 | 0.3205 | 524. | Majer and Svoboda, 1985 |

Reaction thermochemistry data

Data compiled as indicated in comments:
M - Michael M. Meot-Ner (Mautner) and Sharon G. Lias
ALS - Hussein Y. Afeefy, Joel F. Liebman, and Stephen E. Stein
Individual Reactions
By formula: C3H9Si+ + C4H11N = (C3H9Si+ • C4H11N)
Quantity | Value | Units | Method | Reference | Comment |
---|---|---|---|---|---|
ΔrH° | 249. | kJ/mol | PHPMS | Li and Stone, 1990 | gas phase; switching reaction,Thermochemical ladder((CH3)3Si+)C6H5COOC2H5; Wojtyniak and Stone, 1986; M |
Quantity | Value | Units | Method | Reference | Comment |
ΔrS° | 171. | J/mol*K | PHPMS | Li and Stone, 1990 | gas phase; switching reaction,Thermochemical ladder((CH3)3Si+)C6H5COOC2H5; Wojtyniak and Stone, 1986; M |
By formula: C4H6O3 + C4H11N = C6H13NO + C2H4O2
Quantity | Value | Units | Method | Reference | Comment |
---|---|---|---|---|---|
ΔrH° | -113.2 ± 0.46 | kJ/mol | Cm | Wadso, 1962 | liquid phase; ALS |
ΔrH° | -163.7 ± 0.3 | kJ/mol | Cm | Wadso, 1958 | liquid phase; Heat of aminolysis; ALS |
By formula: C4H11N + C6H12OS = C4H10S + C6H13NO
Quantity | Value | Units | Method | Reference | Comment |
---|---|---|---|---|---|
ΔrH° | -57.74 ± 0.63 | kJ/mol | Cm | Wadso, 1958 | liquid phase; Heat of aminolysis; ALS |
By formula: C4H11N + C4H5N3O = C6H13NO + C2H3N3
Quantity | Value | Units | Method | Reference | Comment |
---|---|---|---|---|---|
ΔrH° | -85.8 ± 0.3 | kJ/mol | Cm | Wadso, 1962 | solid phase; ALS |
By formula: C4H11N + C5H6N2O = C6H13NO + C3H4N2
Quantity | Value | Units | Method | Reference | Comment |
---|---|---|---|---|---|
ΔrH° | -75.6 ± 0.3 | kJ/mol | Cm | Wadso, 1962 | solid phase; ALS |
By formula: C6H13NO + H2O = C4H11N + C2H4O2
Quantity | Value | Units | Method | Reference | Comment |
---|---|---|---|---|---|
ΔrH° | 55.2 ± 0.2 | kJ/mol | Cm | Wadso, 1962 | liquid phase; ALS |
By formula: C7H5NO + C4H11N = C11H16NO2
Quantity | Value | Units | Method | Reference | Comment |
---|---|---|---|---|---|
ΔrH° | -112. | kJ/mol | Cm | Pannone and Macosko, 1987 | liquid phase; ALS |

Henry's Law data

Data compiled by: Rolf Sander
Henry's Law constant (water solution)
kH(T) = k°H exp(d(ln(kH))/d(1/T) ((1/T) - 1/(298.15 K)))
k°H = Henry's law constant for solubility in water at 298.15 K (mol/(kg*bar))
d(ln(kH))/d(1/T) = Temperature dependence constant (K)
k°H (mol/(kg*bar)) | d(ln(kH))/d(1/T) (K) | Method | Reference |
---|---|---|---|
57. | M | N/A | |
66. | M | N/A |

Gas phase ion energetics data

Data evaluated as indicated in comments:
HL - Edward P. Hunter and Sharon G. Lias
L - Sharon G. Lias
Data compiled as indicated in comments:
LLK - Sharon G. Lias, Rhoda D. Levin, and Sherif A. Kafafi
RDSH - Henry M. Rosenstock, Keith Draxl, Bruce W. Steiner, and John T. Herron
LL - Sharon G. Lias and Joel F. Liebman
Quantity | Value | Units | Method | Reference | Comment |
---|---|---|---|---|---|
IE (evaluated) | 8.73 ± 0.04 | eV | N/A | N/A | L |
Quantity | Value | Units | Method | Reference | Comment |
Proton affinity (review) | 921.5 | kJ/mol | N/A | Hunter and Lias, 1998 | HL |
Quantity | Value | Units | Method | Reference | Comment |
Gas basicity | 886.6 | kJ/mol | N/A | Hunter and Lias, 1998 | HL |
Ionization energy determinations
IE (eV) | Method | Reference | Comment |
---|---|---|---|
8.7 | PE | Aue and Bowers, 1979 | LLK |
8.79 | PE | Al-Joboury and Turner, 1964 | RDSH |
8.71 ± 0.03 | PI | Watanabe and Mottl, 1957 | RDSH |
9.40 | PE | Katsumata, Iwai, et al., 1973 | Vertical value; LLK |
Appearance energy determinations
Ion | AE (eV) | Other Products | Method | Reference | Comment |
---|---|---|---|---|---|
CH4N+ | 9.62 | 1-C3H7 | EI | Holmes, Lossing, et al., 1988 | LL |
C2H6N+ | 9.49 ± 0.09 | C2H5 | EI | Solka and Russell, 1974 | LLK |

Ion clustering data

Data compiled by: Michael M. Meot-Ner (Mautner) and Sharon G. Lias
Clustering reactions
By formula: C3H9Si+ + C4H11N = (C3H9Si+ • C4H11N)
Quantity | Value | Units | Method | Reference | Comment |
---|---|---|---|---|---|
ΔrH° | 249. | kJ/mol | PHPMS | Li and Stone, 1990 | gas phase; switching reaction,Thermochemical ladder((CH3)3Si+)C6H5COOC2H5; Wojtyniak and Stone, 1986 |
Quantity | Value | Units | Method | Reference | Comment |
ΔrS° | 171. | J/mol*K | PHPMS | Li and Stone, 1990 | gas phase; switching reaction,Thermochemical ladder((CH3)3Si+)C6H5COOC2H5; Wojtyniak and Stone, 1986 |

Kovats' RI, non-polar column, isothermal

Column type | Active phase | Temperature (C) | I | Reference | Comment |
---|---|---|---|---|---|
Packed | C78, Branched paraffin | 130. | 609.4 | Dallos, Sisak, et al., 2000 | He; Column length: 3.3 m |
Packed | C78, Branched paraffin | 130. | 609.4 | Reddy, Dutoit, et al., 1992 | Chromosorb G HP; Column length: 3.3 m |
Packed | Apolane | 130. | 610. | Dutoit, 1991 | Column length: 3.7 m |
Packed | SE-30 | 180. | 629. | Oszczapowicz, Osek, et al., 1985 | N2, Chromosorb A AW; Column length: 3. m |
Packed | SE-30 | 180. | 629. | Oszczapowicz, Osek, et al., 1984 | N2, Chromosorb W AW; Column length: 3. m |
Packed | PMS-100 | 130. | 621. | Anderson, Jurel, et al., 1973 | He, Celite 545 (44-60 mesh); Column length: 3. m |
Packed | PMS-100 | 150. | 619. | Anderson, Jurel, et al., 1973 | He, Celite 545 (44-60 mesh); Column length: 3. m |
Packed | PMS-100 | 180. | 617. | Anderson, Jurel, et al., 1973 | He, Celite 545 (44-60 mesh); Column length: 3. m |
Packed | Apiezon L | 130. | 614. | Landault and Guiochon, 1964 | Teflon-Haloport; Column length: 2.26 m |

Kovats' RI, polar column, isothermal

Column type | Active phase | Temperature (C) | I | Reference | Comment |
---|---|---|---|---|---|
Packed | PEG-2000 | 120. | 896. | Anderson, Jurel, et al., 1973 | He, Celite 545 (44-60 mesh); Column length: 3. m |
Packed | PEG-2000 | 150. | 890. | Anderson, Jurel, et al., 1973 | He, Celite 545 (44-60 mesh); Column length: 3. m |
Packed | PEG-2000 | 152. | 918. | Anderson, Jurel, et al., 1973 | He, Celite 545 (44-60 mesh); Column length: 3. m |
Packed | PEG-2000 | 179. | 912. | Anderson, Jurel, et al., 1973 | He, Celite 545 (44-60 mesh); Column length: 3. m |
Packed | PEG-2000 | 180. | 886. | Anderson, Jurel, et al., 1973 | He, Celite 545 (44-60 mesh); Column length: 3. m |
Packed | PEG-2000 | 200. | 904. | Anderson, Jurel, et al., 1973 | He, Celite 545 (44-60 mesh); Column length: 3. m |

Van Den Dool and Kratz RI, non-polar column, custom temperature program

Column type | Active phase | I | Reference | Comment |
---|---|---|---|---|
Capillary | DB-1 | 608. | Peng, 2000 | 15. m/0.53 mm/1. μm, He; Program: 40C(3min) => 8C/min => 200(1min) => 5C/min => 300C(25min) |
Capillary | Methyl Silicone | 626. | Peng, Yang, et al., 1991 | Program: not specified |
Packed | SE-30 | 626. | Peng, Ding, et al., 1988 | Supelcoport; Chromosorb; Column length: 3.05 m; Program: 40C(5min) => 10C/min => 200C or 250C (60min) |

Normal alkane RI, non-polar column, isothermal

Column type | Active phase | Temperature (C) | I | Reference | Comment |
---|---|---|---|---|---|
Capillary | Methyl Silicone | 100. | 628. | Lebrón-Aguilar, Quintanilla-López, et al., 2007 | |
Capillary | Methyl Silicone | 120. | 628. | Lebrón-Aguilar, Quintanilla-López, et al., 2007 | |
Capillary | Methyl Silicone | 140. | 628. | Lebrón-Aguilar, Quintanilla-López, et al., 2007 | |
Capillary | Methyl Silicone | 80. | 627. | Lebrón-Aguilar, Quintanilla-López, et al., 2007 |

Normal alkane RI, polar column, custom temperature program

Column type | Active phase | I | Reference | Comment |
---|---|---|---|---|
Capillary | DB-Wax | 908. | Peng, Yang, et al., 1991, 2 | Program: not specified |

References

Evans, Fairbrother, et al., 1959
Evans, F.W.; Fairbrother, D.M.; Skinner, H.A.,
The heats of combustion of organic compounds of nitrogen Part 3.-Butylamines, and the cis-dimer of nitrosoisobutane,
Trans. Faraday Soc., 1959, 55, 399-403. [all data]
Cox and Pilcher, 1970
Cox, J.D.; Pilcher, G.,
Thermochemistry of Organic and Organometallic Compounds, Academic Press, New York, 1970, 1-636. [all data]
Lemoult, 1907
Lemoult, M.P.,
Recherches theoriques et experimentales sur les chaleurs de combustion et de formation des composes organiques,
Ann. Chim. Phys., 1907, 12, 395-432. [all data]
Skuratov and Bonetskaya, 1966
Skuratov, S.M.; Bonetskaya, A.K.,
Enthalpy of formation of amide bonds,
Polym. Sci. USSR (Engl. Transl.), 1966, 8, 1754-1757. [all data]
Konicek and Wadso, 1971
Konicek, J.; Wadso, I.,
Thermochemical properties of some carboxylic acids, amines and N-substituted amides in aqueous solution,
Acta Chem. Scand., 1971, 25, 1541-1551. [all data]
Favier, Rosso, et al., 1981
Favier, R.; Rosso, J.; Carbonnel, L.,
Bull. Soc. Chim. Fr., 1981, 1981, 225. [all data]
Timmermans and Mattaar, 1921
Timmermans, J.; Mattaar, J.F.,
Freezing points of orgainic substances VI. New experimental determinations.,
Bull. Soc. Chim. Belg., 1921, 30, 213. [all data]
Majer and Svoboda, 1985
Majer, V.; Svoboda, V.,
Enthalpies of Vaporization of Organic Compounds: A Critical Review and Data Compilation, Blackwell Scientific Publications, Oxford, 1985, 300. [all data]
Toczylkin. L.S. and Young, 1980
Toczylkin. L.S.; Young, C.L.,
Gas-liquid criticl temperatures of mixtures containing electron donors. II. Amine mixtures,
J. Chem. Thermodyn., 1980, 12, 365. [all data]
Glaser and Ruland, 1957
Glaser, F.; Ruland, H.,
Untersuchungsen über dampfdruckkurven und kritische daten einiger technisch wichtiger organischer substanzen,
Chem. Ing. Techn., 1957, 29, 772. [all data]
Belaribi, Belaribi-Boukais, et al., 2000
Belaribi, B.F.; Belaribi-Boukais, G.; Ait Kaci, A.; Jose, J.,
Journal of Thermal Analysis and Calorimetry, 2000, 61, 3, 787-803, https://doi.org/10.1023/A:1010145130024
. [all data]
Stephenson and Malanowski, 1987
Stephenson, Richard M.; Malanowski, Stanislaw,
Handbook of the Thermodynamics of Organic Compounds, 1987, https://doi.org/10.1007/978-94-009-3173-2
. [all data]
Majer, Svoboda, et al., 1979
Majer, Vladimír; Svoboda, Václav; Koubek, Josef; Pick, Jirí,
Temperature dependence of heats of vaporization, saturated vapour pressures and cohesive energies for a group of amines,
Collect. Czech. Chem. Commun., 1979, 44, 12, 3521-3528, https://doi.org/10.1135/cccc19793521
. [all data]
Li and Stone, 1990
Li, X.; Stone, A.J.,
Gas-Phase (CH3)3Si+ Affinities of Alkylamines and Proton Affinities of Trimethylsilyl Alkylamines,
Int. J. Mass Spectrom. Ion Proc., 1990, 101, 2-3, 149, https://doi.org/10.1016/0168-1176(90)87008-5
. [all data]
Wojtyniak and Stone, 1986
Wojtyniak, A.C.M.; Stone, A.J.,
A High-Pressure Mass Spectrometric Study of the Bonding of Trimethylsilylium to Oxygen and Aromatic Bases,
Can. J. Chem., 1986, 74, 59. [all data]
Wadso, 1962
Wadso, I.,
Heats of aminolysis and hydrolysis of some N-acetyl compounds and of acetic anhydride,
Acta Chem. Scand., 1962, 16, 471-478. [all data]
Wadso, 1958
Wadso, I.,
The heats of aminolysis of n-butyl thiolacetate and acetic anhydride,
Acta Chem. Scand., 1958, 12, 635-640. [all data]
Pannone and Macosko, 1987
Pannone, M.C.; Macosko, C.W.,
Kinetics of isocyanate amine reactions,
J. Appl. Polym. Sci., 1987, 34, 2409-2432. [all data]
Hunter and Lias, 1998
Hunter, E.P.; Lias, S.G.,
Evaluated Gas Phase Basicities and Proton Affinities of Molecules: An Update,
J. Phys. Chem. Ref. Data, 1998, 27, 3, 413-656, https://doi.org/10.1063/1.556018
. [all data]
Aue and Bowers, 1979
Aue, D.H.; Bowers, M.T.,
Chapter 9. Stabilities of positive ions from equilibrium gas phase basicity measurements
in Ions Chemistry,, ed. M.T. Bowers, 1979. [all data]
Al-Joboury and Turner, 1964
Al-Joboury, M.I.; Turner, D.W.,
Molecular photoelectron spectroscopy. Part II. A summary of ionization potentials,
J. Chem. Soc., 1964, 4434. [all data]
Watanabe and Mottl, 1957
Watanabe, K.; Mottl, J.R.,
Ionization potentials of ammonia and some amines,
J. Chem. Phys., 1957, 26, 1773. [all data]
Katsumata, Iwai, et al., 1973
Katsumata, S.; Iwai, T.; Kimura, K.,
Photoelectron spectra and sum rule consideration. Higher alkyl amines and alcohols,
Bull. Chem. Soc. Jpn., 1973, 46, 3391. [all data]
Holmes, Lossing, et al., 1988
Holmes, J.L.; Lossing, F.P.; Maccoll, A.,
Heats of formation of alkyl radicals from appearance energies,
J. Am. Chem. Soc., 1988, 110, 7339. [all data]
Solka and Russell, 1974
Solka, B.H.; Russell, M.E.,
Energetics of formation of some structural isomers of gaseous C2H5O+ C2H6N+ ions,
J. Phys. Chem., 1974, 78, 1268. [all data]