Butane, 1-chloro-
- Formula: C4H9Cl
- Molecular weight: 92.567
- IUPAC Standard InChIKey: VFWCMGCRMGJXDK-UHFFFAOYSA-N
- CAS Registry Number: 109-69-3
- Chemical structure:
View 3d structure (requires JavaScript / HTML 5) - Other names: n-Butyl chloride; n-Propylcarbinyl chloride; Butyl chloride; 1-Chlorobutane; n-C4H9Cl; Chlorure de butyle; NBC wormer; NCI-C06155; Sure Shot; NSC 8419

Gas phase thermochemistry data

Data compiled by: Hussein Y. Afeefy, Joel F. Liebman, and Stephen E. Stein
Quantity | Value | Units | Method | Reference | Comment |
---|---|---|---|---|---|
ΔfH°gas | -154.6 ± 1.2 | kJ/mol | Ccr | Stridth and Sunner, 1975 |

Condensed phase thermochemistry data

Data compiled as indicated in comments:
ALS - Hussein Y. Afeefy, Joel F. Liebman, and Stephen E. Stein
DH - Eugene S. Domalski and Elizabeth D. Hearing
Quantity | Value | Units | Method | Reference | Comment |
---|---|---|---|---|---|
ΔfH°liquid | -188.2 ± 1.2 | kJ/mol | Ccr | Stridth and Sunner, 1975 | ALS |
Quantity | Value | Units | Method | Reference | Comment |
ΔcH°liquid | -2695.8 ± 1.1 | kJ/mol | Ccr | Stridth and Sunner, 1975 | ALS |
ΔcH°liquid | -2704.1 ± 8.4 | kJ/mol | Ccb | Smith, Bjellerup, et al., 1953 | Reanalyzed by Cox and Pilcher, 1970, Original value = -2698. ± 8. kJ/mol; ALS |
Constant pressure heat capacity of liquid
Cp,liquid (J/mol*K) | Temperature (K) | Reference | Comment |
---|---|---|---|
159.53 | 298.15 | Grolier, Roux-Desgranges, et al., 1993 | DH |
158.9 | 298.15 | Shehatta, 1993 | DH |
159.64 | 298.15 | Lainez, Wilhelm, et al., 1985 | DH |

Phase change data

Data compiled as indicated in comments:
BS - Robert L. Brown and Stephen E. Stein
TRC - Thermodynamics Research Center, NIST Boulder Laboratories, Chris Muzny director
AC - William E. Acree, Jr., James S. Chickos
ALS - Hussein Y. Afeefy, Joel F. Liebman, and Stephen E. Stein
Quantity | Value | Units | Method | Reference | Comment |
---|---|---|---|---|---|
Tboil | 350. ± 20. | K | AVG | N/A | Average of 14 values; Individual data points |
Quantity | Value | Units | Method | Reference | Comment |
Tfus | 149.95 | K | N/A | Dreisbach and Martin, 1949 | Uncertainty assigned by TRC = 0.05 K; TRC |
Tfus | 150.05 | K | N/A | Timmermans, 1921 | Uncertainty assigned by TRC = 0.2 K; TRC |
Quantity | Value | Units | Method | Reference | Comment |
Tc | 542. | K | N/A | Majer and Svoboda, 1985 | |
Quantity | Value | Units | Method | Reference | Comment |
ΔvapH° | 33.53 ± 0.09 | kJ/mol | AVG | N/A | Average of 6 values; Individual data points |
Enthalpy of vaporization
ΔvapH (kJ/mol) | Temperature (K) | Method | Reference | Comment |
---|---|---|---|---|
30.39 | 351.7 | N/A | Majer and Svoboda, 1985 | |
35. | 272. | A,EST | Stephenson and Malanowski, 1987 | Based on data from 257. to 389. K. See also Li and Rossini, 1961 and Dykyj, 1971.; AC |
32.7 ± 0.1 | 313. | C | Tekac, Majer, et al., 1981 | AC |
31.8 ± 0.1 | 328. | C | Tekac, Majer, et al., 1981 | AC |
30.9 ± 0.1 | 343. | C | Tekac, Majer, et al., 1981 | AC |
30.0 ± 0.1 | 358. | C | Tekac, Majer, et al., 1981 | AC |
29.4 ± 0.1 | 358. | C | Tekac, Majer, et al., 1981 | AC |
35.6 | 271. | DTA | Kemme and Kreps, 1969 | Based on data from 256. to 352. K.; AC |
30.9 | 349.5 | V | Mathews and Fehlandt, 1931 | ALS |
37.2 | 308. | N/A | Smyth and Engel, 1929 | Based on data from 293. to 343. K. See also Boublik, Fried, et al., 1984.; AC |
Antoine Equation Parameters
log10(P) = A − (B / (T + C))
P = vapor pressure (bar)
T = temperature (K)
View plot Requires a JavaScript / HTML 5 canvas capable browser.
Temperature (K) | A | B | C | Reference |
---|---|---|---|---|
256.4 to 351.7 | 3.99588 | 1182.903 | -54.885 | Kemme and Kreps, 1969 |

Henry's Law data

Data compiled by: Rolf Sander
Henry's Law constant (water solution)
kH(T) = k°H exp(d(ln(kH))/d(1/T) ((1/T) - 1/(298.15 K)))
k°H = Henry's law constant for solubility in water at 298.15 K (mol/(kg*bar))
d(ln(kH))/d(1/T) = Temperature dependence constant (K)
k°H (mol/(kg*bar)) | d(ln(kH))/d(1/T) (K) | Method | Reference | Comment |
---|---|---|---|---|
0.056 | Q | N/A | Several references are given in the list of Henry's law constants but not assigned to specific species. | |
0.058 | Q | N/A | missing citation give several references for the Henry's law constants but don't assign them to specific species. | |
0.059 | 3500. | X | Leighton and Calo, 1981 | |
0.051 | V | N/A |

Gas phase ion energetics data

Data evaluated as indicated in comments:
L - Sharon G. Lias
Data compiled as indicated in comments:
LL - Sharon G. Lias and Joel F. Liebman
LLK - Sharon G. Lias, Rhoda D. Levin, and Sherif A. Kafafi
RDSH - Henry M. Rosenstock, Keith Draxl, Bruce W. Steiner, and John T. Herron
Quantity | Value | Units | Method | Reference | Comment |
---|---|---|---|---|---|
IE (evaluated) | 10.64 ± 0.19 | eV | N/A | N/A | L |
Ionization energy determinations
IE (eV) | Method | Reference | Comment |
---|---|---|---|
10.63 | EST | Luo and Pacey, 1992 | LL |
10.46 ± 0.05 | EI | Holmes and Lossing, 1991 | LL |
10.94 | PE | Kimura, Katsumata, et al., 1981 | LLK |
10.50 ± 0.07 | EI | Baldwin, Maccoll, et al., 1964 | RDSH |
10.67 ± 0.03 | PI | Watanabe, Nakayama, et al., 1962 | RDSH |
10.84 | PE | Kimura, Katsumata, et al., 1973 | Vertical value; LLK |
Appearance energy determinations
Ion | AE (eV) | Other Products | Method | Reference | Comment |
---|---|---|---|---|---|
C3H7+ | 11.9 ± 0.1 | ? | EI | Harrison and Shannon, 1962 | RDSH |
C4H8+ | 10.3 ± 0.1 | HCl | EI | Maccoll and Mathur, 1980 | LLK |
C4H8+ | 10.95 | HCl | EI | Baldwin, Maccoll, et al., 1966 | RDSH |
C4H9+ | 10.95 ± 0.05 | Cl | EI | Baldwin, Maccoll, et al., 1966 | RDSH |

Kovats' RI, non-polar column, isothermal

Column type | Active phase | Temperature (C) | I | Reference | Comment |
---|---|---|---|---|---|
Capillary | HP-1 | 0. | 646.1 | Wang, Liu, et al., 2005 | 30. m/0.25 mm/0.25 μm |
Capillary | HP-1 | 10. | 641.6 | Wang, Liu, et al., 2005 | 30. m/0.25 mm/0.25 μm |
Capillary | HP-1 | 20. | 647.3 | Wang, Liu, et al., 2005 | 30. m/0.25 mm/0.25 μm |
Capillary | HP-1 | 30. | 642.5 | Wang, Liu, et al., 2005 | 30. m/0.25 mm/0.25 μm |
Capillary | HP-1 | 40. | 639.6 | Wang, Liu, et al., 2005 | 30. m/0.25 mm/0.25 μm |
Capillary | HP-1 | 50. | 639. | Wang, Liu, et al., 2005 | 30. m/0.25 mm/0.25 μm |
Capillary | HP-1 | 60. | 638.3 | Wang, Liu, et al., 2005 | 30. m/0.25 mm/0.25 μm |
Capillary | ZB-5 | 120. | 659.61 | Lebrón-Aguilar, Eduardo Quintanilla-López, et al., 2002 | 60. m/0.25 mm/0.25 μm |
Packed | C78, Branched paraffin | 130. | 639.0 | Dallos, Sisak, et al., 2000 | He; Column length: 3.3 m |
Packed | C78, Branched paraffin | 130. | 639.5 | Reddy, Dutoit, et al., 1992 | Chromosorb G HP; Column length: 3.3 m |
Packed | Apolane | 130. | 640. | Dutoit, 1991 | Column length: 3.7 m |
Packed | Apolane | 70. | 630.4 | Riedo, Fritz, et al., 1976 | He, Chromosorb; Column length: 2.4 m |
Packed | Apiezon L | 130. | 654. | von Kováts, 1958 | Celite (40:60 Gewichtsverhaltnis) |
Packed | Apiezon L | 70. | 641. | von Kováts, 1958 | Celite (40:60 Gewichtsverhaltnis) |

Van Den Dool and Kratz RI, non-polar column, temperature ramp

Column type | Active phase | I | Reference | Comment |
---|---|---|---|---|
Capillary | Petrocol DH | 631. | White, Hackett, et al., 1992 | 100. m/0.25 mm/0.5 μm, He, 1. K/min; Tstart: 30. C; Tend: 220. C |
Capillary | SE-54 | 648. | Weber, 1986 | 25. m/0.31 mm/0.17 μm, H2, 2. K/min; Tstart: 35. C |

Van Den Dool and Kratz RI, polar column, temperature ramp

Column type | Active phase | I | Reference | Comment |
---|---|---|---|---|
Capillary | HP-Wax | 832. | Peng, 2000 | 15. m/0.53 mm/1. μm, He, 40. C @ 3. min, 5. K/min, 220. C @ 30. min |

Normal alkane RI, non-polar column, isothermal

Column type | Active phase | Temperature (C) | I | Reference | Comment |
---|---|---|---|---|---|
Capillary | Polydimethyl siloxane | 105. | 644. | Tello, Lebron-Aguilar, et al., 2009 | |
Capillary | Polydimethyl siloxane | 75. | 641. | Tello, Lebron-Aguilar, et al., 2009 | |
Capillary | Polydimethyl siloxane | 90. | 641. | Tello, Lebron-Aguilar, et al., 2009 | |
Capillary | Apiezon L | 130. | 653. | Arruda, Junkes, et al., 2008 | |
Capillary | Methyl Silicone | 100. | 644. | Lebrón-Aguilar, Quintanilla-López, et al., 2007 | |
Capillary | Methyl Silicone | 120. | 646. | Lebrón-Aguilar, Quintanilla-López, et al., 2007 | |
Capillary | Methyl Silicone | 140. | 648. | Lebrón-Aguilar, Quintanilla-López, et al., 2007 | |
Capillary | Methyl Silicone | 80. | 641. | Lebrón-Aguilar, Quintanilla-López, et al., 2007 | |
Packed | Synachrom | 150. | 607. | Dufka, Malinsky, et al., 1971 | Helium, Synachrom (60-80 mesh); Column length: 1.5 m |
Packed | Synachrom | 150. | 612. | Dufka, Malinsky, et al., 1971 | Helium, Synachrom (60-80 mesh); Column length: 1.5 m |

Normal alkane RI, non-polar column, temperature ramp

Column type | Active phase | I | Reference | Comment |
---|---|---|---|---|
Capillary | OV-101 | 638. | Dimov and Milina, 1989 | H2, 2. K/min; Column length: 50. m; Column diameter: 0.32 mm; Tstart: 40. C; Tend: 280. C |

Normal alkane RI, non-polar column, custom temperature program

Column type | Active phase | I | Reference | Comment |
---|---|---|---|---|
Capillary | Polydimethyl siloxanes | 637. | Zenkevich, 2003 | Program: not specified |
Capillary | Methyl Silicone | 637. | Zenkevich and Marinichev, 2001 | Program: not specified |
Capillary | Methyl Silicone | 637. | Zenkevich, 2001 | Program: not specified |
Capillary | Methyl Silicone | 637. | Zenkevich, 1999 | Program: not specified |
Capillary | SPB-1 | 641. | Flanagan, Streete, et al., 1997 | 60. m/0.53 mm/5. μm, He; Program: 40C(6min) => 5C/min => 80C => 10C/min => 200C |
Capillary | Polydimethyl siloxanes | 637. | Zenkevich and Chupalov, 1996 | Program: not specified |
Capillary | SPB-1 | 641. | Strete, Ruprah, et al., 1992 | 60. m/0.53 mm/5.0 μm, Helium; Program: 40 0C (6 min) 5 0C/min -> 80 0C 10 0C/min -> 200 0C |
Capillary | SPB-1 | 642. | Strete, Ruprah, et al., 1992 | 60. m/0.53 mm/5.0 μm, Helium; Program: not specified |
Capillary | OV-1, SE-30, Methyl silicone, SP-2100, OV-101, DB-1, etc. | 635. | Waggott and Davies, 1984 | Hydrogen; Column length: 50. m; Column diameter: 0.32 mm; Program: not specified |
Capillary | OV-1 | 642. | Ramsey and Flanagan, 1982 | Program: not specified |
Packed | Apiezon L | 648.3 | Keiko, Prokop'ev, et al., 1972 | Program: not specified |
Packed | Squalane | 639.1 | Keiko, Prokop'ev, et al., 1972 | Program: not specified |

Normal alkane RI, polar column, custom temperature program

Column type | Active phase | I | Reference | Comment |
---|---|---|---|---|
Capillary | DB-Wax | 842. | Peng, Yang, et al., 1991 | Program: not specified |
Capillary | Carbowax 20M | 858. | Ramsey and Flanagan, 1982 | Program: not specified |

References

Stridth and Sunner, 1975
Stridth, G.; Sunner, S.,
Enthalpies of formation of some 1-chloroalkanes and the CH2-increment in the 1-chloroalkanes series,
J. Chem. Thermodyn., 1975, 7, 161-168. [all data]
Smith, Bjellerup, et al., 1953
Smith, L.; Bjellerup, L.; Krook, S.; Westermark, H.,
Heats of combustion of organic chloro compounds determined by the "quartz wool" method,
Acta Chem. Scand., 1953, 7, 65. [all data]
Cox and Pilcher, 1970
Cox, J.D.; Pilcher, G.,
Thermochemistry of Organic and Organometallic Compounds, Academic Press, New York, 1970, 1-636. [all data]
Grolier, Roux-Desgranges, et al., 1993
Grolier, J.-P.E.; Roux-Desgranges, G.; Berkane, M.; Jimenez, E.; Wilhelm, E.,
Heat capacities and densities of mixtures of very polar substances 2. Mixtures containing N,N-dimethylformamide,
J. Chem. Thermodynam., 1993, 25(1), 41-50. [all data]
Shehatta, 1993
Shehatta, I.,
Heat capacity at constant pressure of some halogen compounds,
Thermochim. Acta, 1993, 213, 1-10. [all data]
Lainez, Wilhelm, et al., 1985
Lainez, A.; Wilhelm, E.; Roux-Desgranges, G.; Grolier, J.-P.E.,
Excess molar quantities of (a halogenated n-alkane + an n-alkane). A comparative study of mixtures containing either 1-chlorobutane or 1,4-dichlorobutane,
J. Chem. Thermodynam., 1985, 17, 1153-1161. [all data]
Dreisbach and Martin, 1949
Dreisbach, R.R.; Martin, R.A.,
Physical Data on Some Organic Compounds,
Ind. Eng. Chem., 1949, 41, 2875-8. [all data]
Timmermans, 1921
Timmermans, J.,
The Freezing Points of Organic Substances IV. New Exp. Determinations,
Bull. Soc. Chim. Belg., 1921, 30, 62. [all data]
Majer and Svoboda, 1985
Majer, V.; Svoboda, V.,
Enthalpies of Vaporization of Organic Compounds: A Critical Review and Data Compilation, Blackwell Scientific Publications, Oxford, 1985, 300. [all data]
Stephenson and Malanowski, 1987
Stephenson, Richard M.; Malanowski, Stanislaw,
Handbook of the Thermodynamics of Organic Compounds, 1987, https://doi.org/10.1007/978-94-009-3173-2
. [all data]
Li and Rossini, 1961
Li, J.C.M.; Rossini, F.D.,
Vapor Pressures and Boiling Points of the l-Fluoroalkanes, l-Chloroalkanes, l-Bromoalkanes, and l-Iodoalkanes, C 1 to C 20 .,
J. Chem. Eng. Data, 1961, 6, 2, 268-270, https://doi.org/10.1021/je60010a025
. [all data]
Dykyj, 1971
Dykyj, J.,
Petrochemia, 1971, 11, 2, 27. [all data]
Tekac, Majer, et al., 1981
Tekac, V.; Majer, V.; Svoboda, V.; Hynek, V.,
Enthalpies of vaporization and cohesive energies for six monochlorinated alkanes,
J. Chem. Thermodyn., 1981, 13, 659-662. [all data]
Kemme and Kreps, 1969
Kemme, Herbert R.; Kreps, Saul I.,
Vapor pressure of primary n-alkyl chlorides and alcohols,
J. Chem. Eng. Data, 1969, 14, 1, 98-102, https://doi.org/10.1021/je60040a011
. [all data]
Mathews and Fehlandt, 1931
Mathews, J.H.; Fehlandt, P.R.,
The heats of vaporization of some organic compounds,
J. Am. Chem. Soc., 1931, 53, 3212-32. [all data]
Smyth and Engel, 1929
Smyth, C.P.; Engel, E.W.,
MOLECULAR ORIENTATION AND THE PARTIAL VAPOR PRESSURES OF BINARY MIXTURES. I. SYSTEMS COMPOSED OF NORMAL LIQUIDS,
J. Am. Chem. Soc., 1929, 51, 9, 2646-2660, https://doi.org/10.1021/ja01384a006
. [all data]
Boublik, Fried, et al., 1984
Boublik, T.; Fried, V.; Hala, E.,
The Vapour Pressures of Pure Substances: Selected Values of the Temperature Dependence of the Vapour Pressures of Some Pure Substances in the Normal and Low Pressure Region, 2nd ed., Elsevier, New York, 1984, 972. [all data]
Leighton and Calo, 1981
Leighton, D.T.; Calo, J.M.,
Distribution Coefficients of Chlorinated Hydrocarbons in Dilute Air-Water Systems for Groundwater Contamination Applications,
J. Chem. Eng. Data, 1981, 26, 382-385. [all data]
Luo and Pacey, 1992
Luo, Y.-R.; Pacey, P.D.,
Effects of alkyl substitution on ionization energies of alkanes and haloalkanes and on heats of formation of their molecular cations. Part 2. Alkanes and chloro-, bromo- and iodoalkanes,
Int. J. Mass Spectrom. Ion Processes, 1992, 112, 63. [all data]
Holmes and Lossing, 1991
Holmes, J.L.; Lossing, F.P.,
Ionization energies of homologous organic compounds and correlation with molecular size,
Org. Mass Spectrom., 1991, 26, 537. [all data]
Kimura, Katsumata, et al., 1981
Kimura, K.; Katsumata, S.; Achiba, Y.; Yamazaki, T.; Iwata, S.,
Ionization energies, Ab initio assignments, and valence electronic structure for 200 molecules
in Handbook of HeI Photoelectron Spectra of Fundamental Organic Compounds, Japan Scientific Soc. Press, Tokyo, 1981. [all data]
Baldwin, Maccoll, et al., 1964
Baldwin, M.; Maccoll, A.; Miller, S.I.,
Appearance potentials of the lower chloroalkanes,
J. Am. Chem. Soc., 1964, 86, 4498. [all data]
Watanabe, Nakayama, et al., 1962
Watanabe, K.; Nakayama, T.; Mottl, J.,
Ionization potentials of some molecules,
J. Quant. Spectry. Radiative Transfer, 1962, 2, 369. [all data]
Kimura, Katsumata, et al., 1973
Kimura, K.; Katsumata, S.; Achiba, Y.; Matsumoto, H.; Nagakura, S.,
Photoelectron spectra and orbital structures of higher alkyl chlorides, bromides, and iodides.,
Bull. Chem. Soc. Jpn., 1973, 46, 373. [all data]
Harrison and Shannon, 1962
Harrison, A.G.; Shannon, T.W.,
An electron impact study of chloromethyl and dichloromethyl derivatives,
Can. J. Chem., 1962, 40, 1730. [all data]
Maccoll and Mathur, 1980
Maccoll, A.; Mathur, D.,
Hydrogen chloride elimination from the molecular ions of alkyl chlorides,
Org. Mass Spectrom., 1980, 15, 483. [all data]
Baldwin, Maccoll, et al., 1966
Baldwin, M.; Maccoll, A.; Miller, S.I.,
Ionization and appearance potentials from a study of alkyl chlorides,
Advan. Mass Spectrom., 1966, 3, 259. [all data]
Wang, Liu, et al., 2005
Wang, Y.; Liu, J.; Li, N.; Shi, G.; Jiang, G.; Ma, W.,
Preliminary study of the retention behavior for different compounds using cryogenic chromatography at different initial temperatures,
Microchem. J., 2005, 81, 2, 184-190, https://doi.org/10.1016/j.microc.2005.02.003
. [all data]
Lebrón-Aguilar, Eduardo Quintanilla-López, et al., 2002
Lebrón-Aguilar, R.; Eduardo Quintanilla-López, J.; Antonio García-Domínguez, J.,
Improving the accuracy of Kováts' retention indices in isothermal gas chromatography,
J. Chromatogr. A, 2002, 945, 1-2, 185-194, https://doi.org/10.1016/S0021-9673(01)01463-7
. [all data]
Dallos, Sisak, et al., 2000
Dallos, A.; Sisak, A.; Kulcsár, Z.; Kováts, E.,
Pair-wise interactions by gas chromatography VII. Interaction free enthalpies of solutes with secondary alcohol groups,
J. Chromatogr. A, 2000, 904, 2, 211-242, https://doi.org/10.1016/S0021-9673(00)00908-0
. [all data]
Reddy, Dutoit, et al., 1992
Reddy, K.S.; Dutoit, J.-Cl.; Kovats, E. sz.,
Pair-wise interactions by gas chromatography. I. Interaction free enthalpies of solutes with non-associated primary alcohol groups,
J. Chromatogr., 1992, 609, 1-2, 229-259, https://doi.org/10.1016/0021-9673(92)80167-S
. [all data]
Dutoit, 1991
Dutoit, J.,
Gas chromatographic retention behaviour of some solutes on structurally similar polar and non-polar stationary phases,
J. Chromatogr., 1991, 555, 1-2, 191-204, https://doi.org/10.1016/S0021-9673(01)87179-X
. [all data]
Riedo, Fritz, et al., 1976
Riedo, F.; Fritz, D.; Tarján, G.; Kováts, E.Sz.,
A tailor-made C87 hydrocarbon as a possible non-polar standard stationary phase for gas chromatography,
J. Chromatogr., 1976, 126, 63-83, https://doi.org/10.1016/S0021-9673(01)84063-2
. [all data]
von Kováts, 1958
von Kováts, E.,
206. Gas-chromatographische Charakterisierung organischer Verbindungen. Teil 1: Retentionsindices aliphatischer Halogenide, Alkohole, Aldehyde und Ketone,
Helv. Chim. Acta, 1958, 41, 7, 1915-1932, https://doi.org/10.1002/hlca.19580410703
. [all data]
White, Hackett, et al., 1992
White, C.M.; Hackett, J.; Anderson, R.R.; Kail, S.; Spock, P.S.,
Linear temperature programmed retention indices of gasoline range hydrocarbons and chlorinated hydrocarbons on cross-linked polydimethylsiloxane,
J. Hi. Res. Chromatogr., 1992, 15, 2, 105-120, https://doi.org/10.1002/jhrc.1240150211
. [all data]
Weber, 1986
Weber, L.,
Utilization of the Sadtler standard RI system in micropollution analyses,
J. Hi. Res. Chromatogr. Chromatogr. Comm., 1986, 9, 8, 446-451, https://doi.org/10.1002/jhrc.1240090806
. [all data]
Peng, 2000
Peng, C.T.,
Prediction of retention indices. V. Influence of electronic effects and column polarity on retention index,
J. Chromatogr. A, 2000, 903, 1-2, 117-143, https://doi.org/10.1016/S0021-9673(00)00901-8
. [all data]
Tello, Lebron-Aguilar, et al., 2009
Tello, A.M.; Lebron-Aguilar, R.; Quintanilla-Lopez, J.E.; Santiuste, J.M.,
Isothermal retention indices on poly93-cyanopropylmethyl)siloxane stationary phases,
J. Chromatogr. A, 2009, 1216, 10, 1630-1639, https://doi.org/10.1016/j.chroma.2008.10.025
. [all data]
Arruda, Junkes, et al., 2008
Arruda, A.C.S.; Junkes, B. da.S.; Souza, E.S.; Yunes, R.A.; Heizen, V.E.F.,
Semi-Emlirical Topological Index to Predict Properties of Halogenated Aliphatic Compounds,
J. Chemometrics, 2008, 22, 3-4, 186-194, https://doi.org/10.1002/cem.1121
. [all data]
Lebrón-Aguilar, Quintanilla-López, et al., 2007
Lebrón-Aguilar, R.; Quintanilla-López, J.E.; Tello, A.M.; Santiuste, J.M.,
Isothermal retention indices on poly (3,3,3-trifluoropropylmethylsiloxane) stationary phases,
J. Chromatogr. A, 2007, 1160, 1-2, 276-288, https://doi.org/10.1016/j.chroma.2007.05.025
. [all data]
Dufka, Malinsky, et al., 1971
Dufka, O.; Malinsky, J.; Vladyka, J.,
Sorpcni materialy pro plynovou chromatographii - III,
Chemicky promysl., 1971, 21/46, 9, 459-463. [all data]
Dimov and Milina, 1989
Dimov, N.; Milina, R.,
Precalculation of gas chromatographic retention indices of linear 1-halogenoalkanes,
J. Chromatogr., 1989, 463, 159-164, https://doi.org/10.1016/S0021-9673(01)84464-2
. [all data]
Zenkevich, 2003
Zenkevich, I.G.,
Criteria for Evaluation of Elution Order of Isomeric Organic Compounds,
Zh. Phys. Khim. (Rus.), 2003, 77, 1, 92-98. [all data]
Zenkevich and Marinichev, 2001
Zenkevich, I.G.; Marinichev, A.N.,
Comparison of Topological and Dynamics Molecular Characteristics for Precalculation of Chromatographic Retention Parameters of Organic Compounds (in Russian),
Zh. Struct. Khim., 2001, 42, 5, 893-902. [all data]
Zenkevich, 2001
Zenkevich, I.G.,
Interpretation of Gas Chromatographic Retention Indices in estimation of Structures of Isomeric Products of Radical Chlorinating of Alkyl Arenes,
Zh. Org. Khim., 2001, 37, 2, 283-293. [all data]
Zenkevich, 1999
Zenkevich, I.G.,
Mutual Correlation between Gas-Chromatographic Retention Indices of Organic Compounds from Different Series,
Zh. Anal. Khim., 1999, 54, 12, 1272-1279. [all data]
Flanagan, Streete, et al., 1997
Flanagan, R.J.; Streete, P.J.; Ramsey, J.D.,
Volatile Substance Abuse, UNODC Technical Series, No 5, United Nations, Office on Drugs and Crime, Vienna International Centre, PO Box 500, A-1400 Vienna, Austria, 1997, 56, retrieved from http://www.odccp.org/pdf/technicalseries1997-01-011.pdf. [all data]
Zenkevich and Chupalov, 1996
Zenkevich, I.G.; Chupalov, A.A.,
New Possibilities of Chromato Mass Pectrometric Identification of Organic Compounds Using Increments of Gas Chromatographic Retention Indices of Molecular Structural Fragments,
Zh. Org. Khim. (Rus.), 1996, 32, 5, 656-666. [all data]
Strete, Ruprah, et al., 1992
Strete, P.J.; Ruprah, M.; Ramsey, J.D.; Flanagan, R.J.,
Detection and identification of volatile substances by headspace capillary gas chromatography to aid the diagnosis of acute poisoning,
Analyst, 1992, 117, 7, 1111-1127, https://doi.org/10.1039/an9921701111
. [all data]
Waggott and Davies, 1984
Waggott, A.; Davies, I.W.,
Identification of organic pollutants using linear temperature programmed retention indices (LTPRIs) - Part II, 1984, retrieved from http://dwi.defra.gov.uk/research/completed-research/reports/dwi0383.pdf. [all data]
Ramsey and Flanagan, 1982
Ramsey, J.D.; Flanagan, R.J.,
Detection and Identification of Volatile Organic Compounds in Blood by Headspace Gas Chromatography as an Aid to the Diagnosis of Solvent Abuse,
J. Chromatogr., 1982, 240, 2, 423-444, https://doi.org/10.1016/S0021-9673(00)99622-5
. [all data]
Keiko, Prokop'ev, et al., 1972
Keiko, V.V.; Prokop'ev, B.V.; Kuz'menko, L.P.; Kalinina, N.A.; Modonov, V.B.,
The use of an additive scheme of calculation of the indices of retention in gas-liquid chromatography communication. 3. Some regularities in the manifestation of the inductive effect,
Izv. Akad. Nauk Kaz. SSR Ser. Khim., 1972, 12, 2629-2633. [all data]
Peng, Yang, et al., 1991
Peng, C.T.; Yang, Z.C.; Ding, S.F.,
Prediction of rentention idexes. II. Structure-retention index relationship on polar columns,
J. Chromatogr., 1991, 586, 1, 85-112, https://doi.org/10.1016/0021-9673(91)80028-F
. [all data]