Pentane
- Formula: C5H12
- Molecular weight: 72.1488
- IUPAC Standard InChIKey: OFBQJSOFQDEBGM-UHFFFAOYSA-N
- CAS Registry Number: 109-66-0
- Chemical structure:
View 3d structure (requires JavaScript / HTML 5) - Other names: n-Pentane; Skellysolve A; n-C5H12; Pentan; Pentanen; Pentani; Amyl hydride; NSC 72415

Gas phase thermochemistry data

Data compiled as indicated in comments:
ALS - Hussein Y. Afeefy, Joel F. Liebman, and Stephen E. Stein
GT - Glushko Thermocenter, Russian Academy of Sciences, Moscow
Quantity | Value | Units | Method | Reference | Comment |
---|---|---|---|---|---|
ΔfH°gas | -146.8 ± 0.59 | kJ/mol | Ccb | Good, 1970 | ALS |
ΔfH°gas | -147.1 ± 1.0 | kJ/mol | Cm | Pilcher and Chadwick, 1967 | ALS |
ΔfH°gas | -146.4 ± 0.67 | kJ/mol | Ccb | Prosen and Rossini, 1945 | ALS |
Quantity | Value | Units | Method | Reference | Comment |
ΔcH°gas | -3535.4 ± 0.96 | kJ/mol | Cm | Pilcher and Chadwick, 1967 | Corresponding ΔfHºgas = -147.1 kJ/mol (simple calculation by NIST; no Washburn corrections); ALS |
ΔcH°gas | -3536.6 ± 0.88 | kJ/mol | Ccb | Rossini, 1934 | Corresponding ΔfHºgas = -145.9 kJ/mol (simple calculation by NIST; no Washburn corrections); ALS |
Quantity | Value | Units | Method | Reference | Comment |
S°gas | 347.82 ± 0.84 | J/mol*K | N/A | Messerly G.H., 1940 | Scott [ Scott D.W., 1974] has calculated the value of S(298.15 K)=349.49(0.71) J/mol*K on the basis of data [ Messerly G.H., 1940].; GT |
Constant pressure heat capacity of gas
Cp,gas (J/mol*K) | Temperature (K) | Reference | Comment |
---|---|---|---|
120.07 ± 0.24 | 298.15 | Kharin V.E., 1985 | Experimental data [ Sage B.H., 1937] are less accurate than selected ones. Please also see Hossenlopp I.A., 1981.; GT |
127.84 ± 0.26 | 323.15 | ||
135.90 ± 0.27 | 348.15 | ||
143.95 ± 0.29 | 373.15 | ||
151.92 ± 0.30 | 398.15 | ||
159.67 ± 0.32 | 423.15 | ||
167.37 ± 0.33 | 448.15 | ||
168.11 | 450. | ||
174.75 ± 0.35 | 473.15 | ||
181.98 ± 0.36 | 498.15 | ||
182.39 | 500. | ||
189.08 ± 0.38 | 523.15 | ||
195.96 | 550. | ||
209.23 | 600. | ||
221.93 | 650. | ||
232.90 | 700. |
Constant pressure heat capacity of gas
Cp,gas (J/mol*K) | Temperature (K) | Reference | Comment |
---|---|---|---|
93.55 | 200. | Scott D.W., 1974, 2 | Recommended values were obtained from the consistent correlation scheme for alkanes [ Scott D.W., 1974, Scott D.W., 1974, 2]. This approach gives a better agreement with experimental data than the statistical thermodynamics calculation [ Pitzer K.S., 1944, Pitzer K.S., 1946].; GT |
112.55 | 273.15 | ||
120.0 ± 0.1 | 298.15 | ||
120.62 | 300. | ||
152.55 | 400. | ||
182.59 | 500. | ||
208.78 | 600. | ||
231.38 | 700. | ||
250.62 | 800. | ||
266.94 | 900. | ||
281.58 | 1000. | ||
293.72 | 1100. | ||
304.60 | 1200. | ||
313.80 | 1300. | ||
322.17 | 1400. | ||
330.54 | 1500. |

Condensed phase thermochemistry data

Data compiled as indicated in comments:
ALS - Hussein Y. Afeefy, Joel F. Liebman, and Stephen E. Stein
DH - Eugene S. Domalski and Elizabeth D. Hearing
Quantity | Value | Units | Method | Reference | Comment |
---|---|---|---|---|---|
ΔfH°liquid | -173.5 ± 0.59 | kJ/mol | Ccb | Good, 1970 | ALS |
ΔfH°liquid | -173.1 ± 0.67 | kJ/mol | Ccb | Prosen and Rossini, 1945 | ALS |
Quantity | Value | Units | Method | Reference | Comment |
ΔcH°liquid | -3509.0 ± 0.46 | kJ/mol | Ccb | Good, 1970 | Corresponding ΔfHºliquid = -173.5 kJ/mol (simple calculation by NIST; no Washburn corrections); ALS |
ΔcH°liquid | -3509.5 ± 0.59 | kJ/mol | Ccb | Prosen and Rossini, 1945 | Corresponding ΔfHºliquid = -173.0 kJ/mol (simple calculation by NIST; no Washburn corrections); ALS |
ΔcH°liquid | -3509.2 ± 0.75 | kJ/mol | Ccb | Prosen and Rossini, 1944 | Corresponding ΔfHºliquid = -173.4 kJ/mol (simple calculation by NIST; no Washburn corrections); ALS |
Quantity | Value | Units | Method | Reference | Comment |
S°liquid | 263.47 | J/mol*K | N/A | Messerly, Guthrie, et al., 1967 | DH |
S°liquid | 262.67 | J/mol*K | N/A | Messerly and Kennedy, 1940 | DH |
S°liquid | 259.4 | J/mol*K | N/A | Parks and Huffman, 1930 | Extrapolation below 90 K, 56.61 J/mol*K.; DH |
Constant pressure heat capacity of liquid
Cp,liquid (J/mol*K) | Temperature (K) | Reference | Comment |
---|---|---|---|
168.6 | 298. | Grigor'ev, Rastorguev, et al., 1975 | T = 300 to 463 K.; DH |
167.19 | 298.15 | Messerly, Guthrie, et al., 1967 | T = 12 to 300 K.; DH |
167.99 | 290. | Messerly and Kennedy, 1940 | T = 12 to 290 K.; DH |
163.2 | 290.0 | Parks and Huffman, 1930 | T = 93 to 290 K. Value is unsmoothed experimental datum.; DH |

Phase change data

Data compiled as indicated in comments:
BS - Robert L. Brown and Stephen E. Stein
TRC - Thermodynamics Research Center, NIST Boulder Laboratories, Chris Muzny director
AC - William E. Acree, Jr., James S. Chickos
ALS - Hussein Y. Afeefy, Joel F. Liebman, and Stephen E. Stein
DH - Eugene S. Domalski and Elizabeth D. Hearing
Quantity | Value | Units | Method | Reference | Comment |
---|---|---|---|---|---|
Tboil | 309.2 ± 0.2 | K | AVG | N/A | Average of 81 out of 94 values; Individual data points |
Quantity | Value | Units | Method | Reference | Comment |
Tfus | 143.4 ± 0.7 | K | AVG | N/A | Average of 30 out of 31 values; Individual data points |
Quantity | Value | Units | Method | Reference | Comment |
Ttriple | 143.46 ± 0.05 | K | AVG | N/A | Average of 6 values; Individual data points |
Quantity | Value | Units | Method | Reference | Comment |
Tc | 469.8 ± 0.5 | K | AVG | N/A | Average of 27 out of 31 values; Individual data points |
Quantity | Value | Units | Method | Reference | Comment |
Pc | 33.6 ± 0.6 | bar | AVG | N/A | Average of 20 values; Individual data points |
Quantity | Value | Units | Method | Reference | Comment |
Vc | 0.311 | l/mol | N/A | Ambrose and Tsonopoulos, 1995 | |
Vc | 0.3098 | l/mol | N/A | Aftienjew and Zawisza, 1977 | Uncertainty assigned by TRC = 0.0003 l/mol; TRC |
Vc | 0.295 | l/mol | N/A | Beattie, Levine, et al., 1951 | Uncertainty assigned by TRC = 0.006 l/mol; TRC |
Vc | 0.31482 | l/mol | N/A | Sage and Lacey, 1942 | Uncertainty assigned by TRC = 0.0031 l/mol; TRC |
Quantity | Value | Units | Method | Reference | Comment |
ρc | 3.22 ± 0.07 | mol/l | AVG | N/A | Average of 14 values; Individual data points |
Quantity | Value | Units | Method | Reference | Comment |
ΔvapH° | 26.5 ± 0.6 | kJ/mol | AVG | N/A | Average of 11 values; Individual data points |
Enthalpy of vaporization
ΔvapH (kJ/mol) | Temperature (K) | Method | Reference | Comment |
---|---|---|---|---|
25.79 | 309.2 | N/A | Majer and Svoboda, 1985 | |
26.200 | 298.15 | N/A | Messerly and Kennedy, 1940 | P = 68.68 kPa; DH |
26.7 | 323. | N/A | Pfohl, Riebesell, et al., 2002 | Based on data from 308. to 423. K.; AC |
29.8 | 238. | A | Stephenson and Malanowski, 1987 | Based on data from 223. to 352. K.; AC |
32.3 | 208. | A | Stephenson and Malanowski, 1987 | Based on data from 143. to 223. K.; AC |
26.1 | 365. | A | Stephenson and Malanowski, 1987 | Based on data from 350. to 422. K.; AC |
26.2 | 433. | A | Stephenson and Malanowski, 1987 | Based on data from 418. to 470. K.; AC |
27.9 | 284. | EB | Stephenson and Malanowski, 1987 | Based on data from 269. to 341. K. See also Osborn and Douslin, 1974.; AC |
25.5 | 310. | N/A | Das, Reed, et al., 1977 | AC |
23. | 350. | N/A | Das, Reed, et al., 1977 | AC |
19.7 | 390. | N/A | Das, Reed, et al., 1977 | AC |
15.1 | 430. | N/A | Das, Reed, et al., 1977 | AC |
8.5 | 460. | N/A | Das, Reed, et al., 1977 | AC |
Enthalpy of vaporization
ΔvapH = A exp(-αTr)
(1 − Tr)β
ΔvapH =
Enthalpy of vaporization (at saturation pressure)
(kJ/mol)
Tr = reduced temperature (T / Tc)
View plot Requires a JavaScript / HTML 5 canvas capable browser.
Temperature (K) | 260. to 428. |
---|---|
A (kJ/mol) | 37.01 |
α | -0.1238 |
β | 0.4121 |
Tc (K) | 469.6 |
Reference | Majer and Svoboda, 1985 |
Entropy of vaporization
ΔvapS (J/mol*K) | Temperature (K) | Reference | Comment |
---|---|---|---|
87.88 | 298.15 | Messerly and Kennedy, 1940 | P; DH |
Antoine Equation Parameters
log10(P) = A − (B / (T + C))
P = vapor pressure (bar)
T = temperature (K)
View plot Requires a JavaScript / HTML 5 canvas capable browser.
Temperature (K) | A | B | C | Reference | Comment |
---|---|---|---|---|---|
268.8 to 341.37 | 3.9892 | 1070.617 | -40.454 | Osborn and Douslin, 1974 | Coefficents calculated by NIST from author's data. |
Enthalpy of sublimation
ΔsubH (kJ/mol) | Temperature (K) | Method | Reference | Comment |
---|---|---|---|---|
42.0 | 143. | B | Bondi, 1963 | AC |
Enthalpy of fusion
ΔfusH (kJ/mol) | Temperature (K) | Reference | Comment |
---|---|---|---|
8.401 | 143.47 | Messerly, Guthrie, et al., 1967 | DH |
8.4149 | 143.46 | Messerly and Kennedy, 1940 | DH |
8.4 | 143.5 | Acree, 1991 | AC |
8.376 | 143.4 | Parks and Huffman, 1930 | DH |
Entropy of fusion
ΔfusS (J/mol*K) | Temperature (K) | Reference | Comment |
---|---|---|---|
58.56 | 143.47 | Messerly, Guthrie, et al., 1967 | DH |
58.66 | 143.46 | Messerly and Kennedy, 1940 | DH |
58.41 | 143.4 | Parks and Huffman, 1930 | DH |

Reaction thermochemistry data

Data compiled as indicated in comments:
ALS - Hussein Y. Afeefy, Joel F. Liebman, and Stephen E. Stein
MS - José A. Martinho Simões
Individual Reactions
By formula: C5H10 + H2 = C5H12
Quantity | Value | Units | Method | Reference | Comment |
---|---|---|---|---|---|
ΔrH° | -126.6 ± 2.4 | kJ/mol | Chyd | Molnar, Rachford, et al., 1984 | liquid phase; solvent: Dioxane; ALS |
ΔrH° | -125.0 ± 1.8 | kJ/mol | Chyd | Molnar, Rachford, et al., 1984 | liquid phase; solvent: Hexane; ALS |
ΔrH° | -122.6 ± 2.4 | kJ/mol | Chyd | Rogers and Skanupong, 1974 | liquid phase; solvent: Hexane; ALS |
ΔrH° | -119. ± 1. | kJ/mol | Chyd | Rogers and McLafferty, 1971 | liquid phase; solvent: Hydrocarbon; ALS |
C10H12CrO5 (solution) = (solution) + C5CrO5 (solution)
By formula: C10H12CrO5 (solution) = C5H12 (solution) + C5CrO5 (solution)
Quantity | Value | Units | Method | Reference | Comment |
---|---|---|---|---|---|
ΔrH° | 37.3 | kJ/mol | N/A | Morse, Parker, et al., 1989 | solvent: Pentane; The reaction enthalpy was derived by using the LPHP value for the enthalpy of cleavage of Cr-CO bond in Cr(CO)6, 154.0 kJ/mol Lewis, Golden, et al., 1984, toghether with a PAC value for the reaction Cr(CO)6(solution) + n-C5H12(solution) = Cr(CO)5(n-C5H12)(solution) + CO(solution), 116.7 kJ/mol Morse, Parker, et al., 1989; MS |
(solution) +
(solution) = C10H12CrO5 (solution) +
(solution)
By formula: C5H12 (solution) + C6CrO6 (solution) = C10H12CrO5 (solution) + CO (solution)
Quantity | Value | Units | Method | Reference | Comment |
---|---|---|---|---|---|
ΔrH° | 117. ± 11. | kJ/mol | PAC | Morse, Parker, et al., 1989 | solvent: Pentane; The reaction enthalpy relies on 0.67 for the quantum yield of CO dissociation; MS |
By formula: 3H2 + C5H6 = C5H12
Quantity | Value | Units | Method | Reference | Comment |
---|---|---|---|---|---|
ΔrH° | -405. ± 0.4 | kJ/mol | Chyd | Roth, Adamczak, et al., 1991 | liquid phase; ALS |
ΔrH° | -400. ± 4.6 | kJ/mol | Chyd | Skinner and Snelson, 1959 | liquid phase; solvent: Acetic acid; ALS |
By formula: 3H2 + C5H6 = C5H12
Quantity | Value | Units | Method | Reference | Comment |
---|---|---|---|---|---|
ΔrH° | -406. ± 1. | kJ/mol | Chyd | Roth, Adamczak, et al., 1991 | liquid phase; ALS |
ΔrH° | -402. ± 2. | kJ/mol | Chyd | Skinner and Snelson, 1959 | liquid phase; solvent: Acetic acid; ALS |
By formula: 2H2 + C5H8 = C5H12
Quantity | Value | Units | Method | Reference | Comment |
---|---|---|---|---|---|
ΔrH° | -252.0 ± 0.63 | kJ/mol | Chyd | Kistiakowsky, Ruhoff, et al., 1936 | gas phase; Reanalyzed by Cox and Pilcher, 1970, Original value = -254.3 ± 0.63 kJ/mol; At 355 °K; ALS |
(solution) + C5H11BrMg (solution) = C6H5BrMgO (solution) +
(solution)
By formula: C6H6O (solution) + C5H11BrMg (solution) = C6H5BrMgO (solution) + C5H12 (solution)
Quantity | Value | Units | Method | Reference | Comment |
---|---|---|---|---|---|
ΔrH° | -202.5 ± 4.2 | kJ/mol | RSC | Holm, 1983 | solvent: Diethyl ether; MS |
C5H11BrMg (solution) + (g) =
(solution) + Br2Mg (solution)
By formula: C5H11BrMg (solution) + HBr (g) = C5H12 (solution) + Br2Mg (solution)
Quantity | Value | Units | Method | Reference | Comment |
---|---|---|---|---|---|
ΔrH° | -306.3 ± 2.2 | kJ/mol | RSC | Holm, 1981 | solvent: Diethyl ether; MS |
(solution) + C5H11BrMg (solution) = C2H5BrMgO (solution) +
(solution)
By formula: C2H6O (solution) + C5H11BrMg (solution) = C2H5BrMgO (solution) + C5H12 (solution)
Quantity | Value | Units | Method | Reference | Comment |
---|---|---|---|---|---|
ΔrH° | -199.6 ± 4.2 | kJ/mol | RSC | Holm, 1983 | solvent: Diethyl ether; MS |
C5H11BrMg (solution) + (solution) = CH4BrMgN (solution) +
(solution)
By formula: C5H11BrMg (solution) + CH5N (solution) = CH4BrMgN (solution) + C5H12 (solution)
Quantity | Value | Units | Method | Reference | Comment |
---|---|---|---|---|---|
ΔrH° | -130.5 ± 2.5 | kJ/mol | RSC | Holm, 1983 | solvent: Diethyl ether; MS |
By formula: 2H2 + C5H8 = C5H12
Quantity | Value | Units | Method | Reference | Comment |
---|---|---|---|---|---|
ΔrH° | -274. ± 0.8 | kJ/mol | Chyd | Roth, Kirmse, et al., 1982 | liquid phase; solvent: Isooctane; ALS |
C5O5W (g) + (g) = C10H12O5W (g)
By formula: C5O5W (g) + C5H12 (g) = C10H12O5W (g)
Quantity | Value | Units | Method | Reference | Comment |
---|---|---|---|---|---|
ΔrH° | -44. ± 13. | kJ/mol | EqG | Brown, Ishikawa, et al., 1990 | Temperature range: ca. 300-350 K; MS |
C5H11BrMg (solution) + (solution) =
(solution) + CH3BrMg (solution)
By formula: C5H11BrMg (solution) + CH4 (solution) = C5H12 (solution) + CH3BrMg (solution)
Quantity | Value | Units | Method | Reference | Comment |
---|---|---|---|---|---|
ΔrH° | -15.1 ± 4.2 | kJ/mol | RSC | Holm, 1983 | solvent: Diethyl ether; MS |
(solution) + C5H11BrMg (solution) = C3HBrMgN2 (solution) +
(solution)
By formula: C3H2N2 (solution) + C5H11BrMg (solution) = C3HBrMgN2 (solution) + C5H12 (solution)
Quantity | Value | Units | Method | Reference | Comment |
---|---|---|---|---|---|
ΔrH° | -203.3 | kJ/mol | RSC | Holm, 1983 | solvent: Diethyl ether; MS |
(solution) + C5H11BrMg (solution) = C12H10BrMgN (solution) +
(solution)
By formula: C12H11N (solution) + C5H11BrMg (solution) = C12H10BrMgN (solution) + C5H12 (solution)
Quantity | Value | Units | Method | Reference | Comment |
---|---|---|---|---|---|
ΔrH° | -118.8 | kJ/mol | RSC | Holm, 1983 | solvent: Diethyl ether; MS |
C5H11BrMg (solution) + (solution) = C2BrF3MgO2 (solution) +
(solution)
By formula: C5H11BrMg (solution) + C2HF3O2 (solution) = C2BrF3MgO2 (solution) + C5H12 (solution)
Quantity | Value | Units | Method | Reference | Comment |
---|---|---|---|---|---|
ΔrH° | -273.6 | kJ/mol | RSC | Holm, 1983 | solvent: Diethyl ether; MS |
C5H11BrMg (solution) + (solution) = C6BrF5MgO (cr) +
(solution)
By formula: C5H11BrMg (solution) + C6HF5O (solution) = C6BrF5MgO (cr) + C5H12 (solution)
Quantity | Value | Units | Method | Reference | Comment |
---|---|---|---|---|---|
ΔrH° | -233.9 | kJ/mol | RSC | Holm, 1983 | solvent: Diethyl ether; MS |
C5H11BrMg (solution) + (solution) = C2H2BrF3MgO (solution) +
(solution)
By formula: C5H11BrMg (solution) + C2H3F3O (solution) = C2H2BrF3MgO (solution) + C5H12 (solution)
Quantity | Value | Units | Method | Reference | Comment |
---|---|---|---|---|---|
ΔrH° | -199.6 | kJ/mol | RSC | Holm, 1983 | solvent: Diethyl ether; MS |
(solution) + C5H11BrMg (solution) = CH3BrMgO (cr) +
(solution)
By formula: CH4O (solution) + C5H11BrMg (solution) = CH3BrMgO (cr) + C5H12 (solution)
Quantity | Value | Units | Method | Reference | Comment |
---|---|---|---|---|---|
ΔrH° | -219.7 | kJ/mol | RSC | Holm, 1983 | solvent: Diethyl ether; MS |
By formula: 2H2 + C5H8 = C5H12
Quantity | Value | Units | Method | Reference | Comment |
---|---|---|---|---|---|
ΔrH° | -226.4 ± 0.63 | kJ/mol | Chyd | Dolliver, Gresham, et al., 1937 | gas phase; At 355 °K; ALS |
By formula: C5H12 = C5H12
Quantity | Value | Units | Method | Reference | Comment |
---|---|---|---|---|---|
ΔrH° | -7.786 | kJ/mol | Eqk | Pines, Kvetinskas, et al., 1945 | gas phase; Heat of isomerization; ALS |
By formula: H2 + C5H10 = C5H12
Quantity | Value | Units | Method | Reference | Comment |
---|---|---|---|---|---|
ΔrH° | -117.7 ± 0.8 | kJ/mol | Chyd | Egger and Benson, 1966 | gas phase; ALS |
By formula: H2 + C5H10 = C5H12
Quantity | Value | Units | Method | Reference | Comment |
---|---|---|---|---|---|
ΔrH° | -113.8 ± 0.8 | kJ/mol | Chyd | Egger and Benson, 1966 | gas phase; ALS |

Gas phase ion energetics data

Data evaluated as indicated in comments:
L - Sharon G. Lias
Data compiled as indicated in comments:
LL - Sharon G. Lias and Joel F. Liebman
LBLHLM - Sharon G. Lias, John E. Bartmess, Joel F. Liebman, John L. Holmes, Rhoda D. Levin, and W. Gary Mallard
LLK - Sharon G. Lias, Rhoda D. Levin, and Sherif A. Kafafi
RDSH - Henry M. Rosenstock, Keith Draxl, Bruce W. Steiner, and John T. Herron
Quantity | Value | Units | Method | Reference | Comment |
---|---|---|---|---|---|
IE (evaluated) | 10.28 ± 0.10 | eV | N/A | N/A | L |
Ionization energy determinations
IE (eV) | Method | Reference | Comment |
---|---|---|---|
10.37 | PI | Traeger, Hudson, et al., 1996 | T = 0K; LL |
10.43 | EST | Luo and Pacey, 1992 | LL |
10.22 ± 0.05 | EI | Holmes and Lossing, 1991 | LL |
10.28 ± 0.10 | EVAL | Lias, 1982 | LBLHLM |
10.18 ± 0.15 | EQ | Mautner(Meot-Ner), Sieck, et al., 1981 | LLK |
10.93 | PE | Kimura, Katsumata, et al., 1981 | LLK |
10.2 ± 0.1 | PE | Bieri, Burger, et al., 1977 | LLK |
10.50 | EQ | Lias, Ausloos, et al., 1976 | LLK |
10.36 | PE | Ikuta, Yoshihara, et al., 1973 | LLK |
10.59 ± 0.05 | EI | Flesch and Svec, 1973 | LLK |
10.37 | PE | Dewar and Worley, 1969 | RDSH |
10.35 | PI | Watanabe, Nakayama, et al., 1962 | RDSH |
10.9 ± 0.1 | PE | Bieri, Burger, et al., 1977 | Vertical value; LLK |
Appearance energy determinations
Ion | AE (eV) | Other Products | Method | Reference | Comment |
---|---|---|---|---|---|
C3H6+ | 11.02 | C2H6 | PI | Traeger, Hudson, et al., 1996 | T = 0K; LL |
C3H6+ | 10.99 ± 0.02 | C2H6 | PI | Steiner, Giese, et al., 1961 | RDSH |
C3H7+ | 11.13 | C2H5 | PI | Traeger, Hudson, et al., 1996 | T = 0K; LL |
C3H7+ | 11.11 ± 0.05 | C2H5 | PI | Steiner, Giese, et al., 1961 | RDSH |
C4H8+ | 11.05 | CH4 | PI | Traeger, Hudson, et al., 1996 | T = 0K; LL |
C4H8+ | 11.00 | CH4 | EI | Wolkoff and Holmes, 1978 | LLK |
C4H8+ | 10.93 ± 0.03 | CH4 | PI | Steiner, Giese, et al., 1961 | RDSH |
C4H9+ | 11.10 | CH3 | PI | Traeger, Hudson, et al., 1996 | T = 0K; LL |
C4H9+ | 11.0 ± 0.1 | CH3 | EI | Burgers and Holmes, 1982 | LBLHLM |
C4H9+ | 10.98 ± 0.05 | CH3 | EI | Lossing and Semeluk, 1970 | RDSH |
C4H9+ | 11.06 ± 0.07 | CH3 | PI | Steiner, Giese, et al., 1961 | RDSH |

Henry's Law data

Data compiled by: Rolf Sander
Henry's Law constant (water solution)
kH(T) = k°H exp(d(ln(kH))/d(1/T) ((1/T) - 1/(298.15 K)))
k°H = Henry's law constant for solubility in water at 298.15 K (mol/(kg*bar))
d(ln(kH))/d(1/T) = Temperature dependence constant (K)
k°H (mol/(kg*bar)) | d(ln(kH))/d(1/T) (K) | Method | Reference | Comment |
---|---|---|---|---|
0.00078 | Q | N/A | missing citation give several references for the Henry's law constants but don't assign them to specific species. | |
0.00081 | L | N/A | ||
0.00080 | V | N/A |

References

Good, 1970
Good, W.D.,
The enthalpies of combustion and formation of the isomeric pentanes,
J. Chem. Thermodyn., 1970, 2, 237-244. [all data]
Pilcher and Chadwick, 1967
Pilcher, G.; Chadwick, J.D.M.,
Measurements of heats of combustion by flame calorimetry. Part 4.-n-Pentane, isopentane, neopentane,
Trans. Faraday Soc., 1967, 63, 2357-2361. [all data]
Prosen and Rossini, 1945
Prosen, E.J.; Rossini, F.D.,
Heats of combustion and formation of the paraffin hydrocarbons at 25° C,
J. Res. NBS, 1945, 263-267. [all data]
Rossini, 1934
Rossini, F.D.,
Calorimetric determination of the heats of combustion of ethane, propane, normal butane, and normal pentane,
J. Res. NBS, 1934, 12, 735-750. [all data]
Messerly G.H., 1940
Messerly G.H.,
The heat capacity and entropy, heats of fusion and vaporization and the vapor pressure of n-pentane,
J. Am. Chem. Soc., 1940, 62, 2988-2991. [all data]
Scott D.W., 1974
Scott D.W.,
Correlation of the chemical thermodynamic properties of alkane hydrocarbons,
J. Chem. Phys., 1974, 60, 3144-3165. [all data]
Kharin V.E., 1985
Kharin V.E.,
Isobaric heat capacity of n-pentane in the vapor phase,
Izv. Vyssh. Ucheb. Zaved., Neft. Gaz, 1985, 28, 63-66. [all data]
Sage B.H., 1937
Sage B.H.,
Phase equilibria in hydrocarbon systems. XX. Isobaric heat capacity of gaseous propane, n-butane, isobutane, and n-pentane,
Ind. Eng. Chem., 1937, 29, 1309-1314. [all data]
Hossenlopp I.A., 1981
Hossenlopp I.A.,
Vapor heat capacities and enthalpies of vaporization of five alkane hydrocarbons,
J. Chem. Thermodyn., 1981, 13, 415-421. [all data]
Scott D.W., 1974, 2
Scott D.W.,
Chemical Thermodynamic Properties of Hydrocarbons and Related Substances. Properties of the Alkane Hydrocarbons, C1 through C10 in the Ideal Gas State from 0 to 1500 K. U.S. Bureau of Mines, Bulletin 666, 1974. [all data]
Pitzer K.S., 1944
Pitzer K.S.,
Thermodynamics of gaseous paraffins. Specific heat and related properties,
Ind. Eng. Chem., 1944, 36, 829-831. [all data]
Pitzer K.S., 1946
Pitzer K.S.,
The entropies and related properties of branched paraffin hydrocarbons,
Chem. Rev., 1946, 39, 435-447. [all data]
Prosen and Rossini, 1944
Prosen, E.J.; Rossini, F.D.,
Heats of combustion of eight normal paraffin hydrocarbons in the liquid state,
J. Res. NBS, 1944, 33, 255-272. [all data]
Messerly, Guthrie, et al., 1967
Messerly, J.F.; Guthrie, G.B.; Todd, S.S.; Finke, H.L.,
Low-temperature thermal data for n-pentane, n-heptadecane, and n-octadecane,
J. Chem. Eng. Data, 1967, 12, 338-346. [all data]
Messerly and Kennedy, 1940
Messerly, G.H.; Kennedy, R.M.,
The heat capacity and entropy, heats of fusion and vaporization and the vapor pressure of n-pentane,
J. Am. Chem. Soc., 1940, 62, 2988-2991. [all data]
Parks and Huffman, 1930
Parks, G.S.; Huffman, H.M.,
Thermal data on organic compounds. IX. A study of the effect of unsaturation on the heat capacities, entropies and free energies of some hydrocarbons and other compounds,
J. Am. Chem. Soc., 1930, 52, 4381-4391. [all data]
Grigor'ev, Rastorguev, et al., 1975
Grigor'ev, B.A.; Rastorguev, Yu.L.; Yanin, G.S.,
Experimental determination of the isobaric specific heat of n-alkanes,
Iz. Vyssh. Uchebn. Zaved. Neft Gaz 18, 1975, No.10, 63-66. [all data]
Ambrose and Tsonopoulos, 1995
Ambrose, D.; Tsonopoulos, C.,
Vapor-Liquid Critical Properties of Elements and Compounds. 2. Normal Alkenes,
J. Chem. Eng. Data, 1995, 40, 531-546. [all data]
Aftienjew and Zawisza, 1977
Aftienjew, J.; Zawisza, A.,
High-Pressure Liquid Vapour-Equilibria, Critical State and p(V,T,x) Up to 501.15 K and 4.560 MPa for n-Pentane + n-Perfluoropentane,
J. Chem. Thermodyn., 1977, 9, 2, 153-165, https://doi.org/10.1016/0021-9614(77)90081-7
. [all data]
Beattie, Levine, et al., 1951
Beattie, J.A.; Levine, S.W.; Douslin, D.R.,
The vapor pressure and critical constants of normal pentane,
J. Am. Chem. Soc., 1951, 73, 4431. [all data]
Sage and Lacey, 1942
Sage, B.H.; Lacey, W.N.,
Phase equilibria in hydrocarbon systems. Thermodynamic properties of n- pentane.,
Ind. Eng. Chem., 1942, 34, 730-737. [all data]
Majer and Svoboda, 1985
Majer, V.; Svoboda, V.,
Enthalpies of Vaporization of Organic Compounds: A Critical Review and Data Compilation, Blackwell Scientific Publications, Oxford, 1985, 300. [all data]
Pfohl, Riebesell, et al., 2002
Pfohl, Oliver; Riebesell, Christine; Dohrn, Ralf,
Measurement and calculation of phase equilibria in the system n-pentane + poly(dimethylsiloxane) at 308.15--423.15 K,
Fluid Phase Equilibria, 2002, 202, 2, 289-306, https://doi.org/10.1016/S0378-3812(02)00123-1
. [all data]
Stephenson and Malanowski, 1987
Stephenson, Richard M.; Malanowski, Stanislaw,
Handbook of the Thermodynamics of Organic Compounds, 1987, https://doi.org/10.1007/978-94-009-3173-2
. [all data]
Osborn and Douslin, 1974
Osborn, Ann G.; Douslin, Donald R.,
Vapor-pressure relations for 15 hydrocarbons,
J. Chem. Eng. Data, 1974, 19, 2, 114-117, https://doi.org/10.1021/je60061a022
. [all data]
Das, Reed, et al., 1977
Das, Tarun R.; Reed, Charles O.; Eubank, Philip T.,
PVT surface and thermodynamic properties of n-pentane,
J. Chem. Eng. Data, 1977, 22, 1, 3-9, https://doi.org/10.1021/je60072a014
. [all data]
Bondi, 1963
Bondi, A.,
Heat of Siblimation of Molecular Crystals: A Catalog of Molecular Structure Increments.,
J. Chem. Eng. Data, 1963, 8, 3, 371-381, https://doi.org/10.1021/je60018a027
. [all data]
Acree, 1991
Acree, William E.,
Thermodynamic properties of organic compounds: enthalpy of fusion and melting point temperature compilation,
Thermochimica Acta, 1991, 189, 1, 37-56, https://doi.org/10.1016/0040-6031(91)87098-H
. [all data]
Molnar, Rachford, et al., 1984
Molnar, A.; Rachford, R.; Smith, G.V.; Liu, R.,
Heats of hydrogenation by a simple and rapid flow calorimetric method,
Appl. Catal., 1984, 9, 219-223. [all data]
Rogers and Skanupong, 1974
Rogers, D.W.; Skanupong, S.,
Heats of hydrogenation of sixteen terminal monoolefins. The alternating effect,
J. Phys. Chem., 1974, 78, 2569-2572. [all data]
Rogers and McLafferty, 1971
Rogers, D.W.; McLafferty, F.J.,
A new hydrogen calorimeter. Heats of hydrogenation of allyl and vinyl unsaturation adjacent to a ring,
Tetrahedron, 1971, 27, 3765-3775. [all data]
Morse, Parker, et al., 1989
Morse, J.M., Jr.; Parker, G.H.; Burkey, T.J.,
Organometallics, 1989, 8, 2471. [all data]
Lewis, Golden, et al., 1984
Lewis, K.E.; Golden, D.M.; Smith, G.P.,
Organometallic bond dissociation energies: Laser pyrolysis of Fe(CO)5, Cr(CO)6, Mo(CO)6, and W(CO)6,
J. Am. Chem. Soc., 1984, 106, 3905. [all data]
Roth, Adamczak, et al., 1991
Roth, W.R.; Adamczak, O.; Breuckmann, R.; Lennartz, H.-W.; Boese, R.,
Die Berechnung von Resonanzenergien; das MM2ERW-Kraftfeld,
Chem. Ber., 1991, 124, 2499-2521. [all data]
Skinner and Snelson, 1959
Skinner, H.A.; Snelson, A.,
Heats of hydrogenation Part 3.,
Trans. Faraday Soc., 1959, 55, 405-407. [all data]
Kistiakowsky, Ruhoff, et al., 1936
Kistiakowsky, G.B.; Ruhoff, J.R.; Smith, H.A.; Vaughan, W.E.,
Heats of organic reactions. IV. Hydrogenation of some dienes and of benzene,
J. Am. Chem. Soc., 1936, 58, 146-153. [all data]
Cox and Pilcher, 1970
Cox, J.D.; Pilcher, G.,
Thermochemistry of Organic and Organometallic Compounds, Academic Press, New York, 1970, 1-636. [all data]
Holm, 1983
Holm, T.,
Acta Chem. Scand. B, 1983, 37, 797. [all data]
Holm, 1981
Holm, T.,
J. Chem. Soc., Perkin Trans. II, 1981, 464.. [all data]
Roth, Kirmse, et al., 1982
Roth, W.R.; Kirmse, W.; Hoffmann, W.; Lennartz, H.W.,
Heats of hydrogenation. III. Effect of fluoro substituents on the thermal rearrangement of cyclopropane systems,
Chem. Ber., 1982, 115, 2508-2515. [all data]
Brown, Ishikawa, et al., 1990
Brown, C.E.; Ishikawa, Y.; Hackett, P.A.; Rayner, D.M.,
J. Am. Chem. Soc., 1990, 112, 2530. [all data]
Dolliver, Gresham, et al., 1937
Dolliver, M.a.; Gresham, T.L.; Kistiakowsky, G.B.; Vaughan, W.E.,
Heats of organic reactions. V. Heats of hydrogenation of various hydrocarbons,
J. Am. Chem. Soc., 1937, 59, 831-841. [all data]
Pines, Kvetinskas, et al., 1945
Pines, H.; Kvetinskas, B.; Kassel, L.S.; Ipatieff, V.N.,
Determination of equilibrium constants for butanes and pentanes,
J. Am. Chem. Soc., 1945, 67, 631-637. [all data]
Egger and Benson, 1966
Egger, K.W.; Benson, S.W.,
Nitric oxide and iodine catalyzed isomerization of olefins. VI. Thermodynamic data from equilibrium studies of the geometrical and positional isomerization of n-pentenes,
J. Am. Chem. Soc., 1966, 88, 236-240. [all data]
Traeger, Hudson, et al., 1996
Traeger, J.C.; Hudson, C.E.; McAdoo, D.J.,
A photoionization study of the ion-neutral complexes [CH3CH+CH3CH2CH3] and [CH3CH2CH+CH3CH3] in the gas phase: Formation, H-transfer and C-C bond formation between partners, and channeling of energy into dissociation,
J. Am. Soc. Mass Spectrom., 1996, 7, 73. [all data]
Luo and Pacey, 1992
Luo, Y.-R.; Pacey, P.D.,
Effects of alkyl substitution on ionization energies of alkanes and haloalkanes and on heats of formation of their molecular cations. Part 2. Alkanes and chloro-, bromo- and iodoalkanes,
Int. J. Mass Spectrom. Ion Processes, 1992, 112, 63. [all data]
Holmes and Lossing, 1991
Holmes, J.L.; Lossing, F.P.,
Ionization energies of homologous organic compounds and correlation with molecular size,
Org. Mass Spectrom., 1991, 26, 537. [all data]
Lias, 1982
Lias, S.G.,
Thermochemical information from ion-molecule rate constants,
Ion Cyclotron Reson. Spectrom. 1982, 1982, 409. [all data]
Mautner(Meot-Ner), Sieck, et al., 1981
Mautner(Meot-Ner), M.; Sieck, L.W.; Ausloos, P.,
Ionization of normal alkanes: Enthalpy, entropy, structural, and isotope effects,
J. Am. Chem. Soc., 1981, 103, 5342. [all data]
Kimura, Katsumata, et al., 1981
Kimura, K.; Katsumata, S.; Achiba, Y.; Yamazaki, T.; Iwata, S.,
Ionization energies, Ab initio assignments, and valence electronic structure for 200 molecules
in Handbook of HeI Photoelectron Spectra of Fundamental Organic Compounds, Japan Scientific Soc. Press, Tokyo, 1981. [all data]
Bieri, Burger, et al., 1977
Bieri, G.; Burger, F.; Heilbronner, E.; Maier, J.P.,
Valence ionization enrgies of hydrocarbons,
Helv. Chim. Acta, 1977, 60, 2213. [all data]
Lias, Ausloos, et al., 1976
Lias, S.G.; Ausloos, P.; Horvath, Z.,
Charge transfer reactions in alkane and cycloalkane systems. Estimated ionization potentials,
Int. J. Chem. Kinet., 1976, 8, 725. [all data]
Ikuta, Yoshihara, et al., 1973
Ikuta, S.; Yoshihara, K.; Shiokawa, T.; Jinno, M.; Yokoyama, Y.; Ikeda, S.,
Photoelectron spectroscopy of cyclohexane, cyclopentane, and some related compounds,
Chem. Lett., 1973, 1237. [all data]
Flesch and Svec, 1973
Flesch, G.D.; Svec, H.J.,
Fragmentation reactions in the mass spectrometer for C2-C5 alkanes,
J. Chem. Soc. Faraday Trans. 2, 1973, 69, 1187. [all data]
Dewar and Worley, 1969
Dewar, M.J.S.; Worley, S.D.,
Photoelectron spectra of molecules. I. Ionization potentials of some organic molecules and their interpretation,
J. Chem. Phys., 1969, 50, 654. [all data]
Watanabe, Nakayama, et al., 1962
Watanabe, K.; Nakayama, T.; Mottl, J.,
Ionization potentials of some molecules,
J. Quant. Spectry. Radiative Transfer, 1962, 2, 369. [all data]
Steiner, Giese, et al., 1961
Steiner, B.; Giese, C.F.; Inghram, M.G.,
Photoionization of alkanes. Dissociation of excited molecular ions,
J. Chem. Phys., 1961, 34, 189. [all data]
Wolkoff and Holmes, 1978
Wolkoff, P.; Holmes, J.L.,
Fragmentations of alkane molecular ions,
J. Am. Chem. Soc., 1978, 100, 7346. [all data]
Burgers and Holmes, 1982
Burgers, P.C.; Holmes, J.L.,
Metastable ion studies. XIII. The measurement of appearance energies of metastable peaks,
Org. Mass Spectrom., 1982, 17, 123. [all data]
Lossing and Semeluk, 1970
Lossing, F.P.; Semeluk, G.P.,
Free radicals by mass spectrometry. XLII.Ionization potentials and ionic heats of formation for C1-C4 alkyl radicals,
Can. J. Chem., 1970, 48, 955. [all data]