Butane, 1-bromo-
- Formula: C4H9Br
- Molecular weight: 137.018
- IUPAC Standard InChIKey: MPPPKRYCTPRNTB-UHFFFAOYSA-N
- CAS Registry Number: 109-65-9
- Chemical structure:
View 3d structure (requires JavaScript / HTML 5) - Other names: n-Butyl bromide; Butyl bromide; 1-Bromobutane; n-C4H9Br; UN 1126

Gas phase thermochemistry data

Data compiled by: Hussein Y. Afeefy, Joel F. Liebman, and Stephen E. Stein
Quantity | Value | Units | Method | Reference | Comment |
---|---|---|---|---|---|
ΔfH°gas | -25.7 ± 0.4 | kcal/mol | Ccr | Bjellerup, 1961 |

Condensed phase thermochemistry data

Data compiled as indicated in comments:
ALS - Hussein Y. Afeefy, Joel F. Liebman, and Stephen E. Stein
DH - Eugene S. Domalski and Elizabeth D. Hearing
Quantity | Value | Units | Method | Reference | Comment |
---|---|---|---|---|---|
ΔfH°liquid | -35.4 | kcal/mol | Cm | Holm, 1973 | Grignard Rx; ALS |
ΔfH°liquid | -34.36 ± 0.31 | kcal/mol | Ccr | Bjellerup, 1961 | Reanalyzed by Cox and Pilcher, 1970, Original value = -34.47 ± 0.31 kcal/mol; ALS |
Quantity | Value | Units | Method | Reference | Comment |
ΔcH°liquid | -649.26 ± 0.30 | kcal/mol | Ccr | Bjellerup, 1961 | Reanalyzed by Cox and Pilcher, 1970, Original value = -649.17 ± 0.30 kcal/mol; ALS |
Quantity | Value | Units | Method | Reference | Comment |
S°liquid | 78.160 | cal/mol*K | N/A | Deese, 1931 | Extrapolation below 100 K, 42.84 J/mol*K.; DH |
Constant pressure heat capacity of liquid
Cp,liquid (cal/mol*K) | Temperature (K) | Reference | Comment |
---|---|---|---|
38.77 | 298.15 | Shehatta, 1993 | DH |
36.09 | 298. | Kurbatov, 1948 | T = 13 to 100°C, mean Cp, two temperatures.; DH |
36.379 | 292.3 | Deese, 1931 | T = 94 to 293 K. Value is unsmoothed experimental datum.; DH |

Phase change data

Data compiled as indicated in comments:
BS - Robert L. Brown and Stephen E. Stein
TRC - Thermodynamics Research Center, NIST Boulder Laboratories, Chris Muzny director
AC - William E. Acree, Jr., James S. Chickos
ALS - Hussein Y. Afeefy, Joel F. Liebman, and Stephen E. Stein
DH - Eugene S. Domalski and Elizabeth D. Hearing
CAL - James S. Chickos, William E. Acree, Jr., Joel F. Liebman, Students of Chem 202 (Introduction to the Literature of Chemistry), University of Missouri -- St. Louis
Quantity | Value | Units | Method | Reference | Comment |
---|---|---|---|---|---|
Tboil | 374. ± 2. | K | AVG | N/A | Average of 15 out of 16 values; Individual data points |
Quantity | Value | Units | Method | Reference | Comment |
Tfus | 385.4 | K | N/A | Buckingham and Donaghy, 1982 | BS |
Tfus | 160.7 | K | N/A | Timmermans, 1935 | Uncertainty assigned by TRC = 1.5 K; TRC |
Tfus | 160.8 | K | N/A | Timmermans, 1934 | Uncertainty assigned by TRC = 0.4 K; TRC |
Tfus | 160.4 | K | N/A | Deese, 1931, 2 | Uncertainty assigned by TRC = 0.2 K; TRC |
Tfus | 160.75 | K | N/A | Timmermans, 1921 | Uncertainty assigned by TRC = 0.3 K; TRC |
Quantity | Value | Units | Method | Reference | Comment |
Tc | 577.5 | K | N/A | Majer and Svoboda, 1985 | |
Quantity | Value | Units | Method | Reference | Comment |
ΔvapH° | 8.74 ± 0.06 | kcal/mol | AVG | N/A | Average of 7 values; Individual data points |
Enthalpy of vaporization
ΔvapH (kcal/mol) | Temperature (K) | Method | Reference | Comment |
---|---|---|---|---|
7.770 | 374.7 | N/A | Majer and Svoboda, 1985 | |
8.27 | 353. | A,EB | Stephenson and Malanowski, 1987 | Based on data from 338. to 373. K. See also Svoboda, Majer, et al., 1977.; AC |
8.96 | 288. | A,EST | Stephenson and Malanowski, 1987 | Based on data from 273. to 400. K. See also Li and Rossini, 1961 and Dykyj, 1971.; AC |
8.51 ± 0.02 | 322. | C | Svoboda, Majer, et al., 1977 | AC |
8.34 ± 0.02 | 332. | C | Svoboda, Majer, et al., 1977 | AC |
8.25 ± 0.02 | 339. | C | Svoboda, Majer, et al., 1977 | AC |
8.05 ± 0.02 | 352. | C | Svoboda, Majer, et al., 1977 | AC |
7.89 ± 0.02 | 366. | C | Svoboda, Majer, et al., 1977 | AC |
7.78 | 372.4 | V | Mathews and Fehlandt, 1931 | ALS |
8.01 | 308. | N/A | Smyth and Engel, 1929 | Based on data from 293. to 343. K. See also Boublik, Fried, et al., 1984.; AC |
Enthalpy of vaporization
ΔvapH =
A exp(-βTr) (1 − Tr)β
ΔvapH =
Enthalpy of vaporization (at saturation pressure)
(kcal/mol)
Tr = reduced temperature (T / Tc)
View plot Requires a JavaScript / HTML 5 canvas capable browser.
Temperature (K) | A (kcal/mol) | β | Tc (K) | Reference | Comment |
---|---|---|---|---|---|
298. to 366. | 12.16 | 0.2641 | 577.5 | Majer and Svoboda, 1985 |
Antoine Equation Parameters
log10(P) = A − (B / (T + C))
P = vapor pressure (atm)
T = temperature (K)
View plot Requires a JavaScript / HTML 5 canvas capable browser.
Temperature (K) | A | B | C | Reference | Comment |
---|---|---|---|---|---|
195.18 to 295.82 | 3.45456 | 1105.883 | -65.203 | Milazzo, 1956 | Coefficents calculated by NIST from author's data. |
293. to 343. | 3.79436 | 1084.887 | -65.244 | Smyth and Engel, 1929 | Coefficents calculated by NIST from author's data. |
Enthalpy of fusion
ΔfusH (kcal/mol) | Temperature (K) | Reference | Comment |
---|---|---|---|
2.21 | 160.4 | Domalski and Hearing, 1996 | AC |
2.207 | 160.4 | Deese, 1931 | DH |
Entropy of fusion
ΔfusS (cal/mol*K) | Temperature (K) | Reference | Comment |
---|---|---|---|
13.76 | 160.4 | Domalski and Hearing, 1996 | CAL |
13.76 | 160.4 | Deese, 1931 | DH |

Reaction thermochemistry data

Data compiled as indicated in comments:
RCD - Robert C. Dunbar
ALS - Hussein Y. Afeefy, Joel F. Liebman, and Stephen E. Stein
Individual Reactions
By formula: Na+ + C4H9Br = (Na+ • C4H9Br)
Free energy of reaction
ΔrG° (kcal/mol) | T (K) | Method | Reference | Comment |
---|---|---|---|---|
12.2 | 298. | IMRE | McMahon and Ohanessian, 2000 | Anchor alanine=39.89; RCD |
By formula: C4H9Br = C4H9Br
Quantity | Value | Units | Method | Reference | Comment |
---|---|---|---|---|---|
ΔrH° | -2.4 | kcal/mol | Eqk | Alenin, Rozhnov, et al., 1974 | liquid phase; Heat of isomerization; ALS |

Henry's Law data

Data compiled by: Rolf Sander
Henry's Law constant (water solution)
kH(T) = k°H exp(d(ln(kH))/d(1/T) ((1/T) - 1/(298.15 K)))
k°H = Henry's law constant for solubility in water at 298.15 K (mol/(kg*bar))
d(ln(kH))/d(1/T) = Temperature dependence constant (K)
k°H (mol/(kg*bar)) | d(ln(kH))/d(1/T) (K) | Method | Reference | Comment |
---|---|---|---|---|
0.047 | M | N/A | ||
0.082 | Q | N/A | missing citation give several references for the Henry's law constants but don't assign them to specific species. | |
0.082 | V | N/A |

Gas phase ion energetics data

Data evaluated as indicated in comments:
L - Sharon G. Lias
Data compiled as indicated in comments:
LL - Sharon G. Lias and Joel F. Liebman
LLK - Sharon G. Lias, Rhoda D. Levin, and Sherif A. Kafafi
RDSH - Henry M. Rosenstock, Keith Draxl, Bruce W. Steiner, and John T. Herron
Quantity | Value | Units | Method | Reference | Comment |
---|---|---|---|---|---|
IE (evaluated) | 10.13 ± 0.02 | eV | N/A | N/A | L |
Ionization energy determinations
IE (eV) | Method | Reference | Comment |
---|---|---|---|
10.11 | EST | Luo and Pacey, 1992 | LL |
10.12 | PE | Kimura, Katsumata, et al., 1981 | LLK |
10.15 | PE | Kimura, Katsumata, et al., 1973 | LLK |
10.13 ± 0.015 | PE | Hashmall and Heilbronner, 1970 | RDSH |
10.13 ± 0.01 | PI | Watanabe, 1957 | RDSH |

Ion clustering data

Data compiled by: Robert C. Dunbar
Clustering reactions
By formula: Na+ + C4H9Br = (Na+ • C4H9Br)
Free energy of reaction
ΔrG° (kcal/mol) | T (K) | Method | Reference | Comment |
---|---|---|---|---|
12.2 | 298. | IMRE | McMahon and Ohanessian, 2000 | Anchor alanine=39.89 |

Kovats' RI, non-polar column, isothermal

View large format table.

Column type Active phase Temperature (C) I Reference Comment
CapillaryHP-10.701.9Wang, Liu, et al., 200530. m/0.25 mm/0.25 μm
CapillaryHP-110.703.6Wang, Liu, et al., 200530. m/0.25 mm/0.25 μm
CapillaryHP-120.712.2Wang, Liu, et al., 200530. m/0.25 mm/0.25 μm
CapillaryHP-130.710.Wang, Liu, et al., 200530. m/0.25 mm/0.25 μm
CapillaryHP-140.706.9Wang, Liu, et al., 200530. m/0.25 mm/0.25 μm
CapillaryHP-150.705.4Wang, Liu, et al., 200530. m/0.25 mm/0.25 μm
CapillaryHP-160.703.5Wang, Liu, et al., 200530. m/0.25 mm/0.25 μm
PackedC78, Branched paraffin130.731.4Dallos, Sisak, et al., 2000He; Column length: 3.3 m
PackedC78, Branched paraffin130.730.4Reddy, Dutoit, et al., 1992Chromosorb G HP; Column length: 3.3 m
PackedApolane130.732.Dutoit, 1991Column length: 3.7 m
PackedApolane70.716.8Riedo, Fritz, et al., 1976He, Chromosorb; Column length: 2.4 m
CapillarySqualane60.704.Ryba, 1976Column length: 50. m; Column diameter: 0.25 mm
CapillarySqualane60.706.Ryba, 1976Column length: 50. m; Column diameter: 0.25 mm
CapillarySqualane115.715.Lafosse and Thuaud-Chourrout, 1975Column length: 100. m; Column diameter: 0.25 mm
PackedApiezon L100.738.Brown, Chapman, et al., 1968N2, DCMS-treated Chromosorb W; Column length: 2.3 m
PackedApiezon L150.753.Brown, Chapman, et al., 1968N2, DCMS-treated Chromosorb W; Column length: 2.3 m
PackedSE-30175.711.Casteignau and Villessot, 1968Column length: 3. m
PackedSqualane27.698.Hively and Hinton, 1968He, Chromosorb P; Column length: 15. m; Column diameter: 0.25 mm
PackedSqualane49.704.Hively and Hinton, 1968He, Chromosorb P; Column length: 15. m; Column diameter: 0.25 mm
PackedSqualane67.708.Hively and Hinton, 1968He, Chromosorb P; Column length: 15. m; Column diameter: 0.25 mm
PackedSqualane86.711.Hively and Hinton, 1968He, Chromosorb P; Column length: 15. m; Column diameter: 0.25 mm
PackedApiezon L130.743.von Kováts, 1958Celite (40:60 Gewichtsverhaltnis)
PackedApiezon L70.732.von Kováts, 1958Celite (40:60 Gewichtsverhaltnis)

Kovats' RI, polar column, isothermal

View large format table.

Column type Active phase Temperature (C) I Reference Comment
PackedCarbowax 20M100.975.Castello and D'Amato, 1985He, Chromosorb W AW DMCS; Column length: 3. m
PackedCarbowax 20M125.960.Castello and D'Amato, 1985He, Chromosorb W AW DMCS; Column length: 3. m
PackedCarbowax 20M75.948.Castello and D'Amato, 1985He, Chromosorb W AW DMCS; Column length: 3. m

Van Den Dool and Kratz RI, non-polar column, temperature ramp

View large format table.

Column type Active phase I Reference Comment
CapillarySPB-5729.Engel and Ratel, 200760. m/0.32 mm/1. μm, 40. C @ 2. min, 3. K/min, 230. C @ 10. min
CapillarySPB-5729.Deport, Ratel, et al., 200660. m/0.32 mm/1. μm, He, 40. C @ 5. min, 3. K/min, 230. C @ 5. min
CapillarySE-54729.Weber, 198625. m/0.31 mm/0.17 μm, H2, 2. K/min; Tstart: 35. C

Van Den Dool and Kratz RI, non-polar column, custom temperature program

View large format table.

Column type Active phase I Reference Comment
CapillaryDB-1719.Peng, 200015. m/0.53 mm/1. μm, He; Program: 40C(3min) => 8C/min => 200(1min) => 5C/min => 300C(25min)

Van Den Dool and Kratz RI, polar column, temperature ramp

View large format table.

Column type Active phase I Reference Comment
CapillaryDB-Wax948.Peng, 200015. m/0.53 mm/1. μm, He, 40. C @ 3. min, 5. K/min, 220. C @ 30. min
CapillaryHP-Wax944.Peng, 200015. m/0.53 mm/1. μm, He, 40. C @ 3. min, 5. K/min, 220. C @ 30. min

Normal alkane RI, non-polar column, isothermal

View large format table.

Column type Active phase Temperature (C) I Reference Comment
CapillaryApiezon L130.734.Arruda, Junkes, et al., 2008

Normal alkane RI, non-polar column, temperature ramp

View large format table.

Column type Active phase I Reference Comment
CapillaryOV-101719.Dimov and Milina, 1989H2, 2. K/min; Column length: 50. m; Column diameter: 0.32 mm; Tstart: 40. C; Tend: 280. C

Normal alkane RI, non-polar column, custom temperature program

View large format table.

Column type Active phase I Reference Comment
CapillaryMethyl Silicone717.Zenkevich and Marinichev, 2001Program: not specified
PackedApiezon L740.5Keiko, Prokop'ev, et al., 1972Program: not specified
PackedSqualane727.5Keiko, Prokop'ev, et al., 1972Program: not specified

Normal alkane RI, polar column, custom temperature program

View large format table.

Column type Active phase I Reference Comment
CapillaryDB-Wax955.Peng, Yang, et al., 1991Program: not specified

References

Bjellerup, 1961
Bjellerup, L.,
Heats of combustion and formation of the 1-bromoalkanes from C4 through C8,
Acta Chem. Scand., 1961, 15, 231-241. [all data]
Holm, 1973
Holm, T.,
Thermochemistry of Grignard reagents. Enthalpies of formation of alkylmagnesium bromides and of alkyl bromides,
J. Organomet. Chem., 1973, 56, 87-93. [all data]
Cox and Pilcher, 1970
Cox, J.D.; Pilcher, G.,
Thermochemistry of Organic and Organometallic Compounds, Academic Press, New York, 1970, 1-636. [all data]
Deese, 1931
Deese, R.F., Jr.,
Thermal energy studies. IV. Comparison of continuous and discontinuous methods of measuring heat capacities. Heat capacities of some alphatic bromides,
J. Am. Chem. Soc., 1931, 53, 3673-3683. [all data]
Shehatta, 1993
Shehatta, I.,
Heat capacity at constant pressure of some halogen compounds,
Thermochim. Acta, 1993, 213, 1-10. [all data]
Kurbatov, 1948
Kurbatov, V.Ya.,
Heat capacity of liquids. 2. Heat capacity and the temperature dependence of heat capacity from halogen derivatives of acylic hydrocarbons,
Zh. Obshch. Kim., 1948, 18, 372-389. [all data]
Buckingham and Donaghy, 1982
Buckingham, J.; Donaghy, S.M.,
Dictionary of Organic Compounds: Fifth Edition, Chapman and Hall, New York, 1982, 1. [all data]
Timmermans, 1935
Timmermans, J.,
Researches in Stoichiometry. I. The Heat of Fusion of Organic Compounds.,
Bull. Soc. Chim. Belg., 1935, 44, 17-40. [all data]
Timmermans, 1934
Timmermans, J.,
Theory of Concentrated Solutions XII.,
Bull. Soc. Chim. Belg., 1934, 43, 626. [all data]
Deese, 1931, 2
Deese, R.F.,
Thermal energy studies: IV comparison of continuous and discontinuous methods of measuring heat capacities heat capacities of some aliphatic bromides,
J. Am. Chem. Soc., 1931, 53, 3673. [all data]
Timmermans, 1921
Timmermans, J.,
The Freezing Points of Organic Substances IV. New Exp. Determinations,
Bull. Soc. Chim. Belg., 1921, 30, 62. [all data]
Majer and Svoboda, 1985
Majer, V.; Svoboda, V.,
Enthalpies of Vaporization of Organic Compounds: A Critical Review and Data Compilation, Blackwell Scientific Publications, Oxford, 1985, 300. [all data]
Stephenson and Malanowski, 1987
Stephenson, Richard M.; Malanowski, Stanislaw,
Handbook of the Thermodynamics of Organic Compounds, 1987, https://doi.org/10.1007/978-94-009-3173-2
. [all data]
Svoboda, Majer, et al., 1977
Svoboda, V.; Majer, V.; Veselý, F.; Pick, J.,
Heats of vaporization of alkyl bromides,
Collect. Czech. Chem. Commun., 1977, 42, 6, 1755-1760, https://doi.org/10.1135/cccc19771755
. [all data]
Li and Rossini, 1961
Li, J.C.M.; Rossini, F.D.,
Vapor Pressures and Boiling Points of the l-Fluoroalkanes, l-Chloroalkanes, l-Bromoalkanes, and l-Iodoalkanes, C 1 to C 20 .,
J. Chem. Eng. Data, 1961, 6, 2, 268-270, https://doi.org/10.1021/je60010a025
. [all data]
Dykyj, 1971
Dykyj, J.,
Petrochemia, 1971, 11, 2, 27. [all data]
Mathews and Fehlandt, 1931
Mathews, J.H.; Fehlandt, P.R.,
The heats of vaporization of some organic compounds,
J. Am. Chem. Soc., 1931, 53, 3212-32. [all data]
Smyth and Engel, 1929
Smyth, C.P.; Engel, E.W.,
MOLECULAR ORIENTATION AND THE PARTIAL VAPOR PRESSURES OF BINARY MIXTURES. I. SYSTEMS COMPOSED OF NORMAL LIQUIDS,
J. Am. Chem. Soc., 1929, 51, 9, 2646-2660, https://doi.org/10.1021/ja01384a006
. [all data]
Boublik, Fried, et al., 1984
Boublik, T.; Fried, V.; Hala, E.,
The Vapour Pressures of Pure Substances: Selected Values of the Temperature Dependence of the Vapour Pressures of Some Pure Substances in the Normal and Low Pressure Region, 2nd ed., Elsevier, New York, 1984, 972. [all data]
Milazzo, 1956
Milazzo, G.,
Tensioni di Vapore di Alcune Sostanze Organiche a Bassa Temperatura,
Ann. Chim. (Rome), 1956, 46, 1105-1111. [all data]
Domalski and Hearing, 1996
Domalski, Eugene S.; Hearing, Elizabeth D.,
Heat Capacities and Entropies of Organic Compounds in the Condensed Phase. Volume III,
J. Phys. Chem. Ref. Data, 1996, 25, 1, 1, https://doi.org/10.1063/1.555985
. [all data]
McMahon and Ohanessian, 2000
McMahon, T.B.; Ohanessian, G.,
An Experimental and Ab Initio Study of the Nature of the Binding in Gas-Phase Complexes of Sodium Ions,
Chem. Eur. J., 2000, 6, 16, 2931, https://doi.org/10.1002/1521-3765(20000818)6:16<2931::AID-CHEM2931>3.0.CO;2-7
. [all data]
Alenin, Rozhnov, et al., 1974
Alenin, V.I.; Rozhnov, A.M.; Nesterova, T.N.; Strizhkov, V.N.,
Equilibrium in the isomerisation of liquid C3-C4 monobromoalkanes,
Russ. J. Phys. Chem. (Engl. Transl.), 1974, 48, 1702. [all data]
Luo and Pacey, 1992
Luo, Y.-R.; Pacey, P.D.,
Effects of alkyl substitution on ionization energies of alkanes and haloalkanes and on heats of formation of their molecular cations. Part 2. Alkanes and chloro-, bromo- and iodoalkanes,
Int. J. Mass Spectrom. Ion Processes, 1992, 112, 63. [all data]
Kimura, Katsumata, et al., 1981
Kimura, K.; Katsumata, S.; Achiba, Y.; Yamazaki, T.; Iwata, S.,
Ionization energies, Ab initio assignments, and valence electronic structure for 200 molecules
in Handbook of HeI Photoelectron Spectra of Fundamental Organic Compounds, Japan Scientific Soc. Press, Tokyo, 1981. [all data]
Kimura, Katsumata, et al., 1973
Kimura, K.; Katsumata, S.; Achiba, Y.; Matsumoto, H.; Nagakura, S.,
Photoelectron spectra and orbital structures of higher alkyl chlorides, bromides, and iodides.,
Bull. Chem. Soc. Jpn., 1973, 46, 373. [all data]
Hashmall and Heilbronner, 1970
Hashmall, J.A.; Heilbronner, E.,
n-Ionization potentials of alkyl bromides,
Angew. Chem. Intern. Ed., 1970, 9, 305. [all data]
Watanabe, 1957
Watanabe, K.,
Ionization potentials of some molecules,
J. Chem. Phys., 1957, 26, 542. [all data]