Butanoic acid, butyl ester
- Formula: C8H16O2
- Molecular weight: 144.2114
- IUPAC Standard InChIKey: XUPYJHCZDLZNFP-UHFFFAOYSA-N
- CAS Registry Number: 109-21-7
- Chemical structure:
View 3d structure (requires JavaScript / HTML 5) - Isotopologues:
- Other names: Butyric acid, butyl ester; n-Butyl butanoate; n-Butyl butyrate; n-Butyl n-butyrate; Butyl butanoate; Butyl butylate; Butyl butyrate; 1-Butyl butyrate; Butyl n-butyrate; n-Butyl n-butanoate; n-Butyric acid n-butyl ester; Butyl ester of butanoic acid; NSC 8458

Condensed phase thermochemistry data

Data compiled as indicated in comments:
ALS - Hussein Y. Afeefy, Joel F. Liebman, and Stephen E. Stein
DH - Eugene S. Domalski and Elizabeth D. Hearing
Quantity | Value | Units | Method | Reference | Comment |
---|---|---|---|---|---|
ΔcH°liquid | -4844.2 | kJ/mol | Ccb | Schjanberg, 1935 | Corresponding ΔfHºliquid = -590.4 kJ/mol (simple calculation by NIST; no Washburn corrections); ALS |

Phase change data

Data compiled as indicated in comments:
BS - Robert L. Brown and Stephen E. Stein
TRC - Thermodynamics Research Center, NIST Boulder Laboratories, Chris Muzny director
DH - Eugene S. Domalski and Elizabeth D. Hearing
AC - William E. Acree, Jr., James S. Chickos
Quantity | Value | Units | Method | Reference | Comment |
---|---|---|---|---|---|
Tboil | 439. ± 2. | K | AVG | N/A | Average of 15 values; Individual data points |
Quantity | Value | Units | Method | Reference | Comment |
Ttriple | 181.58 | K | N/A | Balakina, Petrova, et al., 1979 | Uncertainty assigned by TRC = 0.1 K; TRC |
Ttriple | 181.68 | K | N/A | Balakina, Petrova, et al., 1979 | Uncertainty assigned by TRC = 0.04 K; TRC |
Quantity | Value | Units | Method | Reference | Comment |
Tc | 612.1 | K | N/A | Young, 1994 | Uncertainty assigned by TRC = 0.6 K; TRC |
Enthalpy of fusion
ΔfusH (kJ/mol) | Temperature (K) | Reference | Comment |
---|---|---|---|
14.93 | 181.7 | Domalski and Hearing, 1996 | AC |

Normal alkane RI, polar column, custom temperature program

Data compiled by: NIST Mass Spectrometry Data Center, William E. Wallace, director

Column type CapillaryCapillaryCapillaryCapillaryCapillary
Active phase DB-WaxDB-WaxFFAPDB-WaxDB-Wax
Column length (m) 30.30.50.20.20.
Carrier gas HeliumHeliumHeliumHeliumHelium
Substrate
Column diameter (mm) 0.250.250.200.180.18
Phase thickness (μm) 0.250.250.330.180.18
Program not specifiednot specified70 0C (1 min) 3 0C/min -> 142 0C 5 0C/min -> 225 0C (10 min)35 0C (1 min) 2.9 0C/min -> 100 0C 8 0C/min -> 200 0C (5 min)35 0C (1 min) 2/9 0C/min -> 100 0C 8 0C/min -> 200 0C (5 min)
I 1208.1221.1218.1206.1206.
ReferenceWelke, Manfroi, et al., 2012Welke, Manfroi, et al., 2012Ortiz, Echeverra, et al., 2009Rowan, Hunt, et al., 2009Rowan, Hunt, et al., 2009, 2
Comment MSDC-RI MSDC-RI MSDC-RI MSDC-RI MSDC-RI
Column type CapillaryCapillaryCapillaryCapillaryCapillary
Active phase DB-WaxFFAPFFAPDB-WaxFFAP
Column length (m) 30.50.50.60.50.
Carrier gas HeliumHeHeHeHe
Substrate
Column diameter (mm) 0.320.20.20.250.2
Phase thickness (μm) 0.500.330.330.250.33
Program 40 0C 7 0C/min -> 110 0C 15 0C/min -> 250 0C (3 min)70C(1min) => 3C/min => 142C => 5C/min => 225C (10min)70C(1min) => 3C/min => 142C => 5C/min => 225C(10min)35C(5min) => 2C/min => 50C => 5C/min => 200C (5min)70C(1min) => 3C/min => 142C => 5C/min => 225C(10min)
I 1225.1228.1228.1220.1228.
ReferenceValappil, Fan, et al., 2009Lara, Echeverría, et al., 2007Lopez, Villatoro, et al., 2007Mattheis, Fan, et al., 2005Echeverría, Correa, et al., 2004
Comment MSDC-RI MSDC-RI MSDC-RI MSDC-RI MSDC-RI
Column type CapillaryCapillaryCapillaryCapillaryCapillary
Active phase HP-FFAPFFAPCross-linked FFAPFFAPDB-Wax
Column length (m) 50.50.50.50.60.
Carrier gas HeN2N2N2He
Substrate
Column diameter (mm) 0.20.20.20.20.25
Phase thickness (μm) 0.330.330.330.330.25
Program 70C(1min) => 3C/min => 142C => 5C/min => 225C (10min)70C(1min) => 3C/min => 142C(2min) => 25C/min => 230C(5min)70C(1min) => 3C/min => 142C (2min) => 25C/min => 230C(5min)70C (1min) => 3C/min => 142C (2min) => 25C/min => 230C (5min)35C (5min) => 2C/min => 50C => 5C/min => 200C(5min)
I 1228.1229.1229.1229.1216.
ReferenceEcheverria, Fuentes, et al., 2003Lopez, Lavilla, et al., 2000Lavilla, Puy, et al., 1999López, Lavilla, et al., 1998Mattheis, Buchanan, et al., 1992
Comment MSDC-RI MSDC-RI MSDC-RI MSDC-RI MSDC-RI
Column type Capillary
Active phase DB-Wax
Column length (m)
Carrier gas
Substrate
Column diameter (mm)
Phase thickness (μm)
Program not specified
I 1227.
ReferencePeng, Yang, et al., 1991
Comment MSDC-RI

Van Den Dool and Kratz RI, non-polar column, custom temperature program

Data compiled by: NIST Mass Spectrometry Data Center, William E. Wallace, director

Column type CapillaryCapillaryCapillaryCapillaryCapillary
Active phase BPX-5VF-5MSDB-5DB-5MSBPX-5
Column length (m) 30.30.30.30.50.
Carrier gas HeHeHeHeHe
Substrate
Column diameter (mm) 0.250.250.250.250.32
Phase thickness (μm) 0.250.250.250.250.50
Program 35C => 4C/min => 200C => 30C/min => 300C (3min)40C(2min) => 5C/min => 200C (2min) => 30C/min => 260C50C (1min) => 5C/min => 100C => 10C/min => 250C (9min)60 0C (3 min) 2 K/min -> 220 0C 5 K/min -> 250 0C (15 min)0 0C (8 min) -> (1 min) -> 50 0C (2 min) 2.5 0C/min -> 100 0C 6 0C/min -> 250 0C
I 998.990.994.994.996.
ReferenceDharmawan, Kasapis, et al., 2007Carasek and Pawliszyn, 2006Beaulieu and Grimm, 2001Boulanger and Crouzet, 2000Bauchot, Mottram, et al., 1998
Comment MSDC-RI MSDC-RI MSDC-RI MSDC-RI MSDC-RI

Kovats' RI, non-polar column, temperature ramp

Data compiled by: NIST Mass Spectrometry Data Center, William E. Wallace, director

Column type CapillaryCapillaryCapillaryCapillaryCapillary
Active phase DB-1DB-1DB-1DB-1DB-1
Column length (m) 60.60.60.60.60.
Carrier gas HeHeHeHeHe
Substrate
Column diameter (mm) 0.320.320.320.320.32
Phase thickness (μm) 0.250.250.250.250.25
Tstart (C) 30.30.30.30.30.
Tend (C) 210.210.210.210.210.
Heat rate (K/min) 2.2.2.2.2.
Initial hold (min) 4.4.4.4.4.
Final hold (min)
I 983.977.982.990.982.
ReferenceTakeoka, Buttery, et al., 1992Takeoka, Buttery, et al., 1992Takeoka, Flath, et al., 1990Takeoka, Flath, et al., 1990Takeoka, Flath, et al., 1990
Comment MSDC-RI MSDC-RI MSDC-RI MSDC-RI MSDC-RI
Column type CapillaryCapillaryCapillaryCapillary
Active phase DB-1BP-1BP-1OV-101
Column length (m) 60.50.50.25.
Carrier gas HeHeHeHe
Substrate
Column diameter (mm) 0.320.23 0.31
Phase thickness (μm) 0.25
Tstart (C) 30.30.-100.60.
Tend (C) 210.200.200.200.
Heat rate (K/min) 2.2.2.2.
Initial hold (min) 4.2.
Final hold (min)
I 982.978.983.985.
ReferenceTakeoka, Flath, et al., 1990Bartley and Schwede, 1989Bartley, 1988Morales and Duque, 1987
Comment MSDC-RI MSDC-RI MSDC-RI MSDC-RI

Normal alkane RI, non-polar column, isothermal

Data compiled by: NIST Mass Spectrometry Data Center, William E. Wallace, director

Column type Packed
Active phase SE-30
Column length (m)
Carrier gas
Substrate
Column diameter (mm)
Phase thickness (μm)
Temperature (C) 70.
I 985.
ReferenceYabumoto, Jennings, et al., 1977
Comment MSDC-RI

Kovats' RI, non-polar column, isothermal

Data compiled by: NIST Mass Spectrometry Data Center, William E. Wallace, director

Column type CapillaryCapillaryCapillaryCapillaryCapillary
Active phase OV-1SE-30SE-30SE-30OV-101
Column length (m)  25.25.25.15.
Carrier gas  N2N2N2
Substrate
Column diameter (mm)  0.330.330.330.22
Phase thickness (μm)
Temperature (C) 333.100.120.80.80.
I 979.4991.982.985.978.
ReferenceHu, Lu, et al., 2006Haken and Korhonen, 1985Haken and Korhonen, 1985Haken and Korhonen, 1985Komárek, Hornová, et al., 1983
Comment MSDC-RI MSDC-RI MSDC-RI MSDC-RI MSDC-RI
Column type CapillaryPackedPackedPackedPacked
Active phase OV-101Apiezon LSE-30SE-30OV-1
Column length (m) 15. 3.73.
Carrier gas    N2
Substrate   Celaton (62-72 mesh)Chromosorb W AW (60-80 mesh)
Column diameter (mm) 0.22
Phase thickness (μm)
Temperature (C) 80.130.150.100.150.
I 978.940.969.977.980.
ReferenceKomárek, Hornová, et al., 1983, 2Bogoslovsky, Anvaer, et al., 1978Ashes and Haken, 1974Chastrette, Heintz, et al., 1974Ashes and Haken, 1971
Comment MSDC-RI MSDC-RI MSDC-RI MSDC-RI MSDC-RI
Column type PackedPacked
Active phase SE-30SE-30
Column length (m) 2.3.7
Carrier gas
Substrate Chromosorb WCelite 560
Column diameter (mm)
Phase thickness (μm)
Temperature (C) 100.150.
I 985.980.
ReferenceZarazir, Chovin, et al., 1970Germaine and Haken, 1969
Comment MSDC-RI MSDC-RI

References

Schjanberg, 1935
Schjanberg, E.,
Die Verbrennungswarmen und die Refraktionsdaten einiger chlorsubstituierter Fettsauren und Ester.,
Z. Phys. Chem. Abt. A, 1935, 172, 197-233. [all data]
Balakina, Petrova, et al., 1979
Balakina, M.M.; Petrova, G.V.; Vasil'ev, I.A.,
Heat capacity of butyl acetate and butyl Butyrate in a liquid state.,
Termodin. Org. Soedin., 1979, No. 8, 37. [all data]
Young, 1994
Young, C.L.,
Personal Commun. 1994 1994, 1994. [all data]
Domalski and Hearing, 1996
Domalski, Eugene S.; Hearing, Elizabeth D.,
Heat Capacities and Entropies of Organic Compounds in the Condensed Phase. Volume III,
J. Phys. Chem. Ref. Data, 1996, 25, 1, 1, https://doi.org/10.1063/1.555985
. [all data]