Pyridine, 2-bromo-
- Formula: C5H4BrN
- Molecular weight: 157.996
- IUPAC Standard InChIKey: IMRWILPUOVGIMU-UHFFFAOYSA-N
- CAS Registry Number: 109-04-6
- Chemical structure:
View 3d structure (requires JavaScript / HTML 5) - Other names: α-Bromopyridine; o-Bromopyridine; 2-Bromopyridine

Phase change data

Data compiled as indicated in comments:
BS - Robert L. Brown and Stephen E. Stein
AC - William E. Acree, Jr., James S. Chickos
Quantity | Value | Units | Method | Reference | Comment |
---|---|---|---|---|---|
Tboil | 466.2 | K | N/A | Aldrich Chemical Company Inc., 1990 | BS |
Quantity | Value | Units | Method | Reference | Comment |
ΔvapH° | 54.4 ± 1.3 | kJ/mol | C | Ribeiro da Silva, 1997 | AC |
Reduced pressure boiling point
Tboil (K) | Pressure (bar) | Reference | Comment |
---|---|---|---|
347.7 | 0.017 | Weast and Grasselli, 1989 | BS |

Gas phase ion energetics data

Data evaluated as indicated in comments:
HL - Edward P. Hunter and Sharon G. Lias
L - Sharon G. Lias
Data compiled as indicated in comments:
LLK - Sharon G. Lias, Rhoda D. Levin, and Sherif A. Kafafi
RDSH - Henry M. Rosenstock, Keith Draxl, Bruce W. Steiner, and John T. Herron
Quantity | Value | Units | Method | Reference | Comment |
---|---|---|---|---|---|
IE (evaluated) | 9.7 | eV | N/A | N/A | L |
Quantity | Value | Units | Method | Reference | Comment |
Proton affinity (review) | 904.8 | kJ/mol | N/A | Hunter and Lias, 1998 | HL |
Quantity | Value | Units | Method | Reference | Comment |
Gas basicity | 873.0 | kJ/mol | N/A | Hunter and Lias, 1998 | HL |
Ionization energy determinations
IE (eV) | Method | Reference | Comment |
---|---|---|---|
9.7 ± 0.1 | EI | Stefanovic and Grutzmacher, 1974 | LLK |
9.65 ± 0.05 | EI | Basila and Clancy, 1963 | RDSH |

Van Den Dool and Kratz RI, non-polar column, temperature ramp

Column type | Active phase | I | Reference | Comment |
---|---|---|---|---|
Capillary | OV-1 | 988.0 | Gautzsch and Zinn, 1996 | 8. K/min; Tstart: 35. C; Tend: 300. C |

References

Aldrich Chemical Company Inc., 1990
Aldrich Chemical Company Inc.,
Catalog Handbook of Fine Chemicals, Aldrich Chemical Company, Inc., Milwaukee WI, 1990, 1. [all data]
Ribeiro da Silva, 1997
Ribeiro da Silva, M.,
Standard molar enthalpies of formation of 2- and 3-bromopyridine and of 2,5- and 2,6-dibromopyridine,
The Journal of Chemical Thermodynamics, 1997, 29, 12, 1545-1551, https://doi.org/10.1006/jcht.1997.0268
. [all data]
Weast and Grasselli, 1989
CRC Handbook of Data on Organic Compounds, 2nd Editon, Weast,R.C and Grasselli, J.G., ed(s)., CRC Press, Inc., Boca Raton, FL, 1989, 1. [all data]
Hunter and Lias, 1998
Hunter, E.P.; Lias, S.G.,
Evaluated Gas Phase Basicities and Proton Affinities of Molecules: An Update,
J. Phys. Chem. Ref. Data, 1998, 27, 3, 413-656, https://doi.org/10.1063/1.556018
. [all data]
Stefanovic and Grutzmacher, 1974
Stefanovic, D.; Grutzmacher, H.F.,
The ionisation potential of some substituted pyridines,
Org. Mass Spectrom., 1974, 9, 1052. [all data]
Basila and Clancy, 1963
Basila, M.R.; Clancy, D.J.,
The ionization potentials of monosubstituted pyridines by electron impact,
J. Phys. Chem., 1963, 67, 1551. [all data]
Stephenson, 1954
Stephenson, H.P.,
Solution spectra and oscillator strengths of electronic transitions of pyridine and some monosubstituted derivatives,
J. Chem. Phys., 1954, 22, 6, 1077-1082. [all data]
Gautzsch and Zinn, 1996
Gautzsch, R.; Zinn, P.,
Use of incremental models to estimate the retention indexes of aromatic compounds,
Chromatographia, 1996, 43, 3/4, 163-176, https://doi.org/10.1007/BF02292946
. [all data]