3-Pyridinol
- Formula: C5H5NO
- Molecular weight: 95.0993
- IUPAC Standard InChIKey: GRFNBEZIAWKNCO-UHFFFAOYSA-N
- CAS Registry Number: 109-00-2
- Chemical structure:
View 3d structure (requires JavaScript / HTML 5) - Other names: 3-Hydroxypyridine; β-Hydroxypyridine; 3-Oxopyridine; 3-Pyridol; 3-Pyridone; pyridin-3-ol

Gas phase thermochemistry data

Data compiled by: Hussein Y. Afeefy, Joel F. Liebman, and Stephen E. Stein
Quantity | Value | Units | Method | Reference | Comment |
---|---|---|---|---|---|
ΔfH°gas | -43.7 ± 1.7 | kJ/mol | Ccb | Suradi, El Saiad, et al., 1982 |

Condensed phase thermochemistry data

Data compiled by: Hussein Y. Afeefy, Joel F. Liebman, and Stephen E. Stein
Quantity | Value | Units | Method | Reference | Comment |
---|---|---|---|---|---|
ΔfH°solid | -132.0 ± 1.1 | kJ/mol | Ccb | Suradi, El Saiad, et al., 1982 | |
Quantity | Value | Units | Method | Reference | Comment |
ΔcH°solid | -2550.1 ± 0.9 | kJ/mol | Ccb | Suradi, El Saiad, et al., 1982 |

Phase change data

Data compiled as indicated in comments:
ALS - Hussein Y. Afeefy, Joel F. Liebman, and Stephen E. Stein
AC - William E. Acree, Jr., James S. Chickos
Quantity | Value | Units | Method | Reference | Comment |
---|---|---|---|---|---|
ΔsubH° | 88.3 ± 1.3 | kJ/mol | C | Suradi, El Saiad, et al., 1982 | ALS |
ΔsubH° | 88.3 ± 1.3 | kJ/mol | C | Suradi, El Saiad, et al., 1982 | See also Pedley, Naylor, et al., 1986.; AC |

Gas phase ion energetics data

Data evaluated as indicated in comments:
HL - Edward P. Hunter and Sharon G. Lias
Data compiled as indicated in comments:
LLK - Sharon G. Lias, Rhoda D. Levin, and Sherif A. Kafafi
Quantity | Value | Units | Method | Reference | Comment |
---|---|---|---|---|---|
Proton affinity (review) | 929.5 | kJ/mol | N/A | Hunter and Lias, 1998 | HL |
Quantity | Value | Units | Method | Reference | Comment |
Gas basicity | 897.7 | kJ/mol | N/A | Hunter and Lias, 1998 | HL |
Ionization energy determinations
IE (eV) | Method | Reference | Comment |
---|---|---|---|
9.5 ± 0.1 | EI | Stefanovic and Grutzmacher, 1974 | LLK |
9.55 ± 0.02 | EI | Gronneberg and Undheim, 1972 | LLK |
9.55 ± 0.05 | EI | Gronneberg and Undheim, 1972, 2 | LLK |
9.15 ± 0.03 | PE | Cook, El-Abbady, et al., 1977 | Vertical value; LLK |

References

Suradi, El Saiad, et al., 1982
Suradi, S.; El Saiad, N.; Pilcher, G.; Skinner, H.A.,
Enthalpies of combustion of the three hydroxy-pyridines and the four hydroxy-2-methylpyridines,
J. Chem. Thermodyn., 1982, 14, 45-50. [all data]
Pedley, Naylor, et al., 1986
Pedley, J.B.; Naylor, R.D.; Kirby, S.P.,
Thermochemical Data of Organic Compounds, 1986, https://doi.org/10.1007/978-94-009-4099-4
. [all data]
Hunter and Lias, 1998
Hunter, E.P.; Lias, S.G.,
Evaluated Gas Phase Basicities and Proton Affinities of Molecules: An Update,
J. Phys. Chem. Ref. Data, 1998, 27, 3, 413-656, https://doi.org/10.1063/1.556018
. [all data]
Stefanovic and Grutzmacher, 1974
Stefanovic, D.; Grutzmacher, H.F.,
The ionisation potential of some substituted pyridines,
Org. Mass Spectrom., 1974, 9, 1052. [all data]
Gronneberg and Undheim, 1972
Gronneberg, T.; Undheim, K.,
Mass spectrometry of onium compounds. XI: ionization potentials of hydroxy and mercapto pyridines,
Org. Mass Spectrom., 1972, 6, 823. [all data]
Gronneberg and Undheim, 1972, 2
Gronneberg, T.; Undheim, K.,
Mass spectrometry of onium compounds. X: on the evaporation of pyridinium-3-oxides-ionization potential measurements,
Org. Mass Spectrom., 1972, 6, 225. [all data]
Cook, El-Abbady, et al., 1977
Cook, M.J.; El-Abbady, S.; Katritzky, A.R.; Guimon, C.; Pfister-Guillouzo, G.,
Photoelectron spectra of hydroxy- and mercapto-pyridines and models of fixed structure,
J. Chem. Soc. Perkin Trans. 2, 1977, 1652. [all data]
Leffler, 1949
Leffler, J.E.,
J. Am. Chem. Soc., 1949, 71, 67. [all data]