Benzenethiol
- Formula: C6H6S
- Molecular weight: 110.177
- IUPAC Standard InChIKey: RMVRSNDYEFQCLF-UHFFFAOYSA-N
- CAS Registry Number: 108-98-5
- Chemical structure:
View 3d structure (requires JavaScript / HTML 5) - Isotopologues:
- Other names: Mercaptobenzene; Phenol, thio-; Phenyl mercaptan; Phenylthiol; Thiophenol; Rcra waste number P014; Thiofenol; UN 2337; USAF XR-19; NSC 6953; 930-69-8

Gas phase thermochemistry data

Data compiled by: Hussein Y. Afeefy, Joel F. Liebman, and Stephen E. Stein
Quantity | Value | Units | Method | Reference | Comment |
---|---|---|---|---|---|
ΔfH°gas | 112.4 ± 0.88 | kJ/mol | Ccr | Scott, McCullough, et al., 1956 | Reanalyzed by Cox and Pilcher, 1970, Original value = 111.5 ± 1.2 kJ/mol |

Condensed phase thermochemistry data

Data compiled as indicated in comments:
ALS - Hussein Y. Afeefy, Joel F. Liebman, and Stephen E. Stein
DH - Eugene S. Domalski and Elizabeth D. Hearing
Quantity | Value | Units | Method | Reference | Comment |
---|---|---|---|---|---|
ΔfH°liquid | 63.68 ± 0.84 | kJ/mol | Ccr | Scott, McCullough, et al., 1956 | Reanalyzed by Cox and Pilcher, 1970, Original value = 62.8 ± 1.1 kJ/mol; ALS |
Quantity | Value | Units | Method | Reference | Comment |
ΔcH°liquid | -3884.6 ± 0.63 | kJ/mol | Ccr | Scott, McCullough, et al., 1956 | Reanalyzed by Cox and Pilcher, 1970, Original value = -3883.9 ± 0.63 kJ/mol; ALS |
Quantity | Value | Units | Method | Reference | Comment |
S°liquid | 222.80 | J/mol*K | N/A | Scott, McCullough, et al., 1956 | DH |
S°liquid | 220.1 | J/mol*K | N/A | Parks, Todd, et al., 1936 | Extrapolation below 90 K, 54.68 J/mol*K.; DH |
Constant pressure heat capacity of liquid
Cp,liquid (J/mol*K) | Temperature (K) | Reference | Comment |
---|---|---|---|
173.22 | 298.15 | Scott, McCullough, et al., 1956 | T = 10 to 380 K.; DH |
176.56 | 298.1 | Parks, Todd, et al., 1936 | T = 90 to 300 K.; DH |

Phase change data

Data compiled as indicated in comments:
BS - Robert L. Brown and Stephen E. Stein
TRC - Thermodynamics Research Center, NIST Boulder Laboratories, Chris Muzny director
DRB - Donald R. Burgess, Jr.
AC - William E. Acree, Jr., James S. Chickos
ALS - Hussein Y. Afeefy, Joel F. Liebman, and Stephen E. Stein
DH - Eugene S. Domalski and Elizabeth D. Hearing
Quantity | Value | Units | Method | Reference | Comment |
---|---|---|---|---|---|
Tboil | 441.9 | K | N/A | Weast and Grasselli, 1989 | BS |
Tboil | 442.3 | K | N/A | Majer and Svoboda, 1985 | |
Tboil | 442.6 | K | N/A | Buckingham and Donaghy, 1982 | BS |
Tboil | 442.25 | K | N/A | Morris, Lanum, et al., 1960 | Uncertainty assigned by TRC = 0.2 K; TRC |
Tboil | 442.7 | K | N/A | Lecat, 1947 | Uncertainty assigned by TRC = 0.5 K; TRC |
Quantity | Value | Units | Method | Reference | Comment |
Tfus | 258.21 | K | N/A | Morris, Lanum, et al., 1960 | Uncertainty assigned by TRC = 0.02 K; TRC |
Tfus | 258.3 | K | N/A | Parks, Todd, et al., 1936, 2 | Uncertainty assigned by TRC = 0.2 K; TRC |
Tfus | 258.25 | K | N/A | Parks, Todd, et al., 1936, 3 | Uncertainty assigned by TRC = 0.15 K; TRC |
Quantity | Value | Units | Method | Reference | Comment |
Ttriple | 258.27 | K | N/A | Scott, McCullough, et al., 1956, 2 | Uncertainty assigned by TRC = 0.05 K; TRC |
Ttriple | 258.2 | K | N/A | Parks, Todd, et al., 1936, 3 | Uncertainty assigned by TRC = 0.2 K; TRC |
Quantity | Value | Units | Method | Reference | Comment |
Tc | 689.5 | K | N/A | Majer and Svoboda, 1985 | |
Quantity | Value | Units | Method | Reference | Comment |
ΔvapH° | 47.56 | kJ/mol | N/A | Majer and Svoboda, 1985 | |
ΔvapH° | 48.7 | kJ/mol | N/A | Scott, McCullough, et al., 1956 | DRB |
Reduced pressure boiling point
Tboil (K) | Pressure (bar) | Reference | Comment |
---|---|---|---|
350. | 0.040 | Buckingham and Donaghy, 1982 | BS |
Enthalpy of vaporization
ΔvapH (kJ/mol) | Temperature (K) | Method | Reference | Comment |
---|---|---|---|---|
39.93 | 442.3 | N/A | Majer and Svoboda, 1985 | |
45.9 | 348. | N/A | Dykyj, Svoboda, et al., 1999 | Based on data from 333. to 471. K.; AC |
43.1 | 400. | A,EB | Stephenson and Malanowski, 1987 | Based on data from 385. to 486. K. See also Osborn and Douslin, 1966 and Scott, McCullough, et al., 1956.; AC |
48.7 ± 0.2 | 375. | C | Scott, McCullough, et al., 1956 | ALS |
43.8 ± 0.1 | 375. | C | Scott, McCullough, et al., 1956 | AC |
42.6 ± 0.1 | 395. | C | Scott, McCullough, et al., 1956 | AC |
41.8 ± 0.1 | 407. | C | Scott, McCullough, et al., 1956 | AC |
41.3 ± 0.1 | 417. | C | Scott, McCullough, et al., 1956 | AC |
44.3 | 339. | N/A | von Terres, Gebert, et al., 1955 | Based on data from 324. to 440. K. See also Boublik, Fried, et al., 1984.; AC |
Enthalpy of vaporization
ΔvapH =
A exp(-βTr) (1 − Tr)β
ΔvapH =
Enthalpy of vaporization (at saturation pressure)
(kJ/mol)
Tr = reduced temperature (T / Tc)
View plot Requires a JavaScript / HTML 5 canvas capable browser.
Temperature (K) | A (kJ/mol) | β | Tc (K) | Reference | Comment |
---|---|---|---|---|---|
298. to 417. | 61.79 | 0.262 | 689.5 | Majer and Svoboda, 1985 |
Antoine Equation Parameters
log10(P) = A − (B / (T + C))
P = vapor pressure (bar)
T = temperature (K)
View plot Requires a JavaScript / HTML 5 canvas capable browser.
Temperature (K) | A | B | C | Reference |
---|---|---|---|---|
387.69 to 485.31 | 4.11509 | 1529.454 | -70.102 | Osborn and Douslin, 1966 |
Enthalpy of fusion
ΔfusH (kJ/mol) | Temperature (K) | Reference | Comment |
---|---|---|---|
11.447 | 258.27 | Scott, McCullough, et al., 1956 | DH |
11.48 | 258.2 | Domalski and Hearing, 1996 | AC |
11.478 | 258.2 | Parks, Todd, et al., 1936 | DH |
Entropy of fusion
ΔfusS (J/mol*K) | Temperature (K) | Reference | Comment |
---|---|---|---|
44.32 | 258.27 | Scott, McCullough, et al., 1956 | DH |
44.45 | 258.2 | Parks, Todd, et al., 1936 | DH |

Reaction thermochemistry data

Data compiled as indicated in comments:
B - John E. Bartmess
ALS - Hussein Y. Afeefy, Joel F. Liebman, and Stephen E. Stein
Individual Reactions
By formula: C6H5S- + H+ = C6H6S
Quantity | Value | Units | Method | Reference | Comment |
---|---|---|---|---|---|
ΔrH° | 1424. ± 8.8 | kJ/mol | G+TS | Taft and Bordwell, 1988 | gas phase; B |
ΔrH° | >1423. ± 7.5 | kJ/mol | D-EA | Richardson, Stephenson, et al., 1975 | gas phase; B |
Quantity | Value | Units | Method | Reference | Comment |
ΔrG° | 1395. ± 8.8 | kJ/mol | IMRE | Guillemin, Riague, et al., 2005 | gas phase; B |
ΔrG° | 1397. ± 8.4 | kJ/mol | IMRE | Taft and Bordwell, 1988 | gas phase; B |
ΔrG° | >1395. ± 7.9 | kJ/mol | H-TS | Richardson, Stephenson, et al., 1975 | gas phase; B |
By formula: H2O + C8H8OS = C6H6S + C2H4O2
Quantity | Value | Units | Method | Reference | Comment |
---|---|---|---|---|---|
ΔrH° | -12.4 ± 0.3 | kJ/mol | Cm | Wadso, 1960 | liquid phase; Heat of hydrolysis; ALS |

Gas phase ion energetics data

Data evaluated as indicated in comments:
L - Sharon G. Lias
Data compiled as indicated in comments:
B - John E. Bartmess
LL - Sharon G. Lias and Joel F. Liebman
LBLHLM - Sharon G. Lias, John E. Bartmess, Joel F. Liebman, John L. Holmes, Rhoda D. Levin, and W. Gary Mallard
LLK - Sharon G. Lias, Rhoda D. Levin, and Sherif A. Kafafi
RDSH - Henry M. Rosenstock, Keith Draxl, Bruce W. Steiner, and John T. Herron
Quantity | Value | Units | Method | Reference | Comment |
---|---|---|---|---|---|
IE (evaluated) | 8.30 ± 0.01 | eV | N/A | N/A | L |
Ionization energy determinations
IE (eV) | Method | Reference | Comment |
---|---|---|---|
8.3 ± 0.05 | TRPI | Faulk, Dunbar, et al., 1990 | LL |
8.3 | PE | Ashby, Enemark, et al., 1988 | LL |
8.3 | PE | Carnovale, Kibel, et al., 1982 | LBLHLM |
8.36 | CTS | Aloisi, Santini, et al., 1974 | LLK |
9.0 ± 0.1 | EI | Henion and Kingston, 1973 | LLK |
8.28 | PE | Frost, Herring, et al., 1972 | LLK |
8.32 ± 0.01 | PI | Matsunaga, 1961 | RDSH |
8.5 | PE | Ashby, Enemark, et al., 1988 | Vertical value; LL |
8.49 | PE | Carnovale, Kibel, et al., 1982 | Vertical value; LBLHLM |
8.47 | PE | Dewar, Ernstbrunner, et al., 1974 | Vertical value; LLK |
Appearance energy determinations
De-protonation reactions
By formula: C6H5S- + H+ = C6H6S
Quantity | Value | Units | Method | Reference | Comment |
---|---|---|---|---|---|
ΔrH° | 1424. ± 8.8 | kJ/mol | G+TS | Taft and Bordwell, 1988 | gas phase; B |
ΔrH° | >1423. ± 7.5 | kJ/mol | D-EA | Richardson, Stephenson, et al., 1975 | gas phase; B |
Quantity | Value | Units | Method | Reference | Comment |
ΔrG° | 1395. ± 8.8 | kJ/mol | IMRE | Guillemin, Riague, et al., 2005 | gas phase; B |
ΔrG° | 1397. ± 8.4 | kJ/mol | IMRE | Taft and Bordwell, 1988 | gas phase; B |
ΔrG° | >1395. ± 7.9 | kJ/mol | H-TS | Richardson, Stephenson, et al., 1975 | gas phase; B |

Kovats' RI, non-polar column, isothermal

Column type | Active phase | Temperature (C) | I | Reference | Comment |
---|---|---|---|---|---|
Packed | Apiezon M | 130. | 999. | Garbuzov, Misharina, et al., 1985 | He or N2, Chromosorb W, AW-DMCS; Column length: 2.1 m |
Packed | Apiezon M | 130. | 999. | Golovnya, Garbuzov, et al., 1978 | Chromosorb W, AW/DMS; Column length: 2.1 m |
Capillary | Squalane | 120. | 942. | Agrawal, Tesarík, et al., 1972 | N2, Celite 545; Column length: 50. m; Column diameter: 0.3 mm |
Capillary | Squalane | 86. | 933. | Agrawal, Tesarík, et al., 1972 | N2, Celite 545; Column length: 50. m; Column diameter: 0.3 mm |
Capillary | Apiezon L | 120. | 966. | Agrawal, Tesarík, et al., 1972 | N2; Column length: 100. m; Column diameter: 0.3 mm |

Normal alkane RI, polar column, custom temperature program

Column type | Active phase | I | Reference | Comment |
---|---|---|---|---|
Capillary | DB-Wax | 1491. | Peng, Yang, et al., 1991 | Program: not specified |

Henry's Law data

Data compiled by: Rolf Sander
Henry's Law constant (water solution)
kH(T) = k°H exp(d(ln(kH))/d(1/T) ((1/T) - 1/(298.15 K)))
k°H = Henry's law constant for solubility in water at 298.15 K (mol/(kg*bar))
d(ln(kH))/d(1/T) = Temperature dependence constant (K)
k°H (mol/(kg*bar)) | d(ln(kH))/d(1/T) (K) | Method | Reference |
---|---|---|---|
3.0 | V | N/A | |
3.0 | V | N/A |

References

Scott, McCullough, et al., 1956
Scott, D.W.; McCullough, J.P.; Hubbard, W.N.; Messerly, J.F.; Hossenlopp, I.A.; Frow, F.R.; Waddington, G.,
Benzenethiol: Thermodynamic properties in the solid, liquid and vapor states; internal rotation of the thiol group,
J. Am. Chem. Soc., 1956, 78, 5463-5468. [all data]
Cox and Pilcher, 1970
Cox, J.D.; Pilcher, G.,
Thermochemistry of Organic and Organometallic Compounds, Academic Press, New York, 1970, 1-636. [all data]
Parks, Todd, et al., 1936
Parks, G.S.; Todd, S.S.; Moore, W.A.,
Thermal data on organic compounds. XVI. Some heat capacity, entropy and free energy data for typical benzene derivatives and heterocyclic compounds,
J. Am. Chem. Soc., 1936, 58, 398-401. [all data]
Weast and Grasselli, 1989
CRC Handbook of Data on Organic Compounds, 2nd Editon, Weast,R.C and Grasselli, J.G., ed(s)., CRC Press, Inc., Boca Raton, FL, 1989, 1. [all data]
Majer and Svoboda, 1985
Majer, V.; Svoboda, V.,
Enthalpies of Vaporization of Organic Compounds: A Critical Review and Data Compilation, Blackwell Scientific Publications, Oxford, 1985, 300. [all data]
Buckingham and Donaghy, 1982
Buckingham, J.; Donaghy, S.M.,
Dictionary of Organic Compounds: Fifth Edition, Chapman and Hall, New York, 1982, 1. [all data]
Morris, Lanum, et al., 1960
Morris, J.C.; Lanum, W.J.; Helm, R.V.; Haines, W.E.; Cook, G.L.; Ball, J.S.,
Purification and Properties of Ten Organic Sulfur Compounds,
J. Chem. Eng. Data, 1960, 5, 112-6. [all data]
Lecat, 1947
Lecat, M.,
Orthobaric Azeotropes of Sulfides,
Bull. Cl. Sci., Acad. R. Belg., 1947, 33, 160-82. [all data]
Parks, Todd, et al., 1936, 2
Parks, G.S.; Todd, S.S.; Shomate, C.H.,
Thermal data on organic compounds. XVII. Some heat capacity, entropy and free energy data for five higher olefins,
J. Am. Chem. Soc., 1936, 58, 2505. [all data]
Parks, Todd, et al., 1936, 3
Parks, G.S.; Todd, S.S.; Moore, W.A.,
Thermal Data on Organic Compounds. XVI. Some Heat Capacity, Entropy and Free Energy Data for Typical Benzene Derivatives and Heterocyclic Compounds,
J. Am. Chem. Soc., 1936, 58, 398. [all data]
Scott, McCullough, et al., 1956, 2
Scott, D.W.; McCullough, J.P.; Hubbard, W.N.; Messerly, J.F.; Hossenlopp, I.A.; Frow, F.R.; Waddington, G.,
Benzenethiol: Thermodynamic Properties in the Solid, Liquid and Vapor States; Internal Rotation of the Thiol Group,
J. Am. Chem. Soc., 1956, 78, 5463-8. [all data]
Dykyj, Svoboda, et al., 1999
Dykyj, J.; Svoboda, J.; Wilhoit, R.C.; Frenkel, M.L.; Hall, K.R.,
Vapor Pressure of Chemicals: Part A. Vapor Pressure and Antoine Constants for Hydrocarbons and Sulfur, Selenium, Tellurium and Hydrogen Containing Organic Compounds, Springer, Berlin, 1999, 373. [all data]
Stephenson and Malanowski, 1987
Stephenson, Richard M.; Malanowski, Stanislaw,
Handbook of the Thermodynamics of Organic Compounds, 1987, https://doi.org/10.1007/978-94-009-3173-2
. [all data]
Osborn and Douslin, 1966
Osborn, A.G.; Douslin, D.R.,
Vapor Pressure Relations of 36 Sulfur Compounds Present in Petroleum.,
J. Chem. Eng. Data, 1966, 11, 4, 502-509, https://doi.org/10.1021/je60031a014
. [all data]
von Terres, Gebert, et al., 1955
von Terres, E.; Gebert, F.; Hulsemann, H.; Petereit, H.; Toepsch, H.; Ruppert, W.,
Brennst.-Chem., 1955, 36, 272. [all data]
Boublik, Fried, et al., 1984
Boublik, T.; Fried, V.; Hala, E.,
The Vapour Pressures of Pure Substances: Selected Values of the Temperature Dependence of the Vapour Pressures of Some Pure Substances in the Normal and Low Pressure Region, 2nd ed., Elsevier, New York, 1984, 972. [all data]
Domalski and Hearing, 1996
Domalski, Eugene S.; Hearing, Elizabeth D.,
Heat Capacities and Entropies of Organic Compounds in the Condensed Phase. Volume III,
J. Phys. Chem. Ref. Data, 1996, 25, 1, 1, https://doi.org/10.1063/1.555985
. [all data]
Taft and Bordwell, 1988
Taft, R.W.; Bordwell, F.G.,
Structural and Solvent Effects Evaluated from Acidities Measured in Dimethyl Sulfoxide and in the Gas Phase,
Acc. Chem. Res., 1988, 21, 12, 463, https://doi.org/10.1021/ar00156a005
. [all data]
Richardson, Stephenson, et al., 1975
Richardson, J.H.; Stephenson, L.M.; Brauman, J.I.,
Photodetachment of electrons from phenoxides and thiophenoxide,
J. Am. Chem. Soc., 1975, 97, 2967. [all data]
Guillemin, Riague, et al., 2005
Guillemin, J.C.; Riague, E.H.; Gal, J.F.; Maria, P.C.; Mo, O.; Yanez, M.,
Acidity trends in alpha,beta-unsaturated sulfur, selenium, and tellurium derivatives: Comparison with C-, Si-, Ge-, Sn-, N-, P-, As-, and Sb-containing analogues,
Chem. Eur. J., 2005, 11, 7, 2145-2153, https://doi.org/10.1002/chem.200400989
. [all data]
Wadso, 1960
Wadso, I.,
Heats of hydrolysis of phenyl acetate and phenyl thiolacetate,
Acta Chem. Scand., 1960, 14, 561-565. [all data]
Faulk, Dunbar, et al., 1990
Faulk, J.D.; Dunbar, R.C.; Lifshitz, C.,
Slow Dissociations of thiophenol molecular ion. Study by TRPD and TPIMS,
J. Am. Chem. Soc., 1990, 112, 7893. [all data]
Ashby, Enemark, et al., 1988
Ashby, M.T.; Enemark, J.H.; Lichtenberger, D.L.,
Destabilizing d -p orbital interactions and the alkylation reactions of iron(II)-thiolate complexes,
Inorg. Chem., 1988, 27, 191. [all data]
Carnovale, Kibel, et al., 1982
Carnovale, F.; Kibel, M.H.; Nyberg, G.L.; Peel, J.B.,
Photoelectron spectroscopic assignment of the p-states of benzenethiol,
J. Electron Spectrosc. Relat. Phenom., 1982, 25, 171. [all data]
Aloisi, Santini, et al., 1974
Aloisi, G.G.; Santini, S.; Sorriso, S.,
Molecular complexes of substituted diphenyl sulphides with π acceptors. Charge transfer spectra and ionization potentials of the donors,
J. Chem. Soc. Faraday Trans. 1, 1974, 70, 1908. [all data]
Henion and Kingston, 1973
Henion, J.D.; Kingston, D.G.I.,
Mass spectrometry of organic compounds. VII. Energetics of substituent isomerization in diphenyl sulfide and diphenyl ether,
J. Am. Chem. Soc., 1973, 95, 8358. [all data]
Frost, Herring, et al., 1972
Frost, D.C.; Herring, F.G.; Katrib, A.; McDowell, C.A.; McLean, R.A.N.,
Photoelectron spectra of CH3SH, (CH3)2S, C6H5SH, and C6H5CH2SH; the bonding between sulfur and carbon,
J. Phys. Chem., 1972, 76, 1030. [all data]
Matsunaga, 1961
Matsunaga, F.M.,
Photoionization yield of several molecules in the Schumann region,
Contribution No. 27, Hawaii Institute of, 1961, Geophysics, Honolulu. [all data]
Dewar, Ernstbrunner, et al., 1974
Dewar, P.S.; Ernstbrunner, E.; Gilmore, J.R.; Godfrey, M.; Mellor, J.M.,
Conformational analysis of alkyl aryl ethers and alkyl aryl sulphides by photoelectron spectroscopy,
Tetrahedron, 1974, 30, 2455. [all data]
Gal'perin, Bogolyubov, et al., 1969
Gal'perin, Ya.V.; Bogolyubov, G.M.; Grishin, N.N.; Petrov, A.A.,
Organic derivatives of elements of groups V and VI. VI. Mass spectra of compounds with S-S bonds,
Zh. Obshch. Khim., 1969, 39, 1599, In original 1567. [all data]
Bogolyubov, Plotnikov, et al., 1969
Bogolyubov, G.M.; Plotnikov, V.F.; Boiko, Yu.A.; Petrov, A.A.,
Organic derivatives of elements of groups V and VI. IX. Mass spectra of vinylacetylene sulfides,
Zh. Obshch. Khim., 1969, 39, 2467, In original 2407. [all data]
Garbuzov, Misharina, et al., 1985
Garbuzov, V.G.; Misharina, T.A.; Aerov, A.F.; Golovnya, R.V.,
Gas chromatographic retention indices for sulphur(II)-containing organic substances,
J. Anal. Chem. USSR (Engl. Transl.), 1985, 40, 4, 576-586. [all data]
Golovnya, Garbuzov, et al., 1978
Golovnya, R.V.; Garbuzov, V.G.; Aerov, A.F.,
Gas chromatographic characterization of sulfur-containing compounds. 5. Thiophene, furan, and benzene derivatives,
Izv. Akad. Nauk SSSR Ser. Khim., 1978, 11, 2271-2274. [all data]
Agrawal, Tesarík, et al., 1972
Agrawal, B.B.; Tesarík, K.; Janák, J.,
Gas chromatographic characterization of sulphur compounds in the 93-162° gasoline cut from Romashkino crude oil using Kováts retention indices,
J. Chromatogr., 1972, 65, 1, 207-215, https://doi.org/10.1016/S0021-9673(00)86933-2
. [all data]
Peng, Yang, et al., 1991
Peng, C.T.; Yang, Z.C.; Ding, S.F.,
Prediction of rentention idexes. II. Structure-retention index relationship on polar columns,
J. Chromatogr., 1991, 586, 1, 85-112, https://doi.org/10.1016/0021-9673(91)80028-F
. [all data]