4H-Pyran-4-one
- Formula: C5H4O2
- Molecular weight: 96.0841
- IUPAC Standard InChIKey: CVQUWLDCFXOXEN-UHFFFAOYSA-N
- CAS Registry Number: 108-97-4
- Chemical structure:
View 3d structure (requires JavaScript / HTML 5) - Other names: γ-Pyrone; Pyran-4-one; 4-Pyrone; 4H-Pyran, 4-oxo-

Phase change data

Data compiled by: Robert L. Brown and Stephen E. Stein
Quantity | Value | Units | Method | Reference | Comment |
---|---|---|---|---|---|
Tboil | 485.7 | K | N/A | Weast and Grasselli, 1989 |

Gas phase ion energetics data

Data compiled by: Sharon G. Lias, Rhoda D. Levin, and Sherif A. Kafafi
Ionization energy determinations
IE (eV) | Method | Reference | Comment |
---|---|---|---|
9.35 ± 0.05 | PE | Colonna, Distefano, et al., 1980 | Vertical value |
Appearance energy determinations
Ion | AE (eV) | Other Products | Method | Reference | Comment |
---|---|---|---|---|---|
C4H4O+ | 10.64 ± 0.05 | CO | EI | Holmes and Terlouw, 1979 |

References

Weast and Grasselli, 1989
CRC Handbook of Data on Organic Compounds, 2nd Editon, Weast,R.C and Grasselli, J.G., ed(s)., CRC Press, Inc., Boca Raton, FL, 1989, 1. [all data]
Colonna, Distefano, et al., 1980
Colonna, F.P.; Distefano, G.; Guerra, M.; Jones, D.,
Photoelectron (He(I), He(II) and X-ray) spectroscopy of γ-pyrone and its related sulphur derivatives: valence and core ionization energies shake-up satellites,
J. Electron Spectrosc. Relat. Phenom., 1980, 18, 309. [all data]
Holmes and Terlouw, 1979
Holmes, J.L.; Terlouw, J.K.,
Structures of [C4H4O]+ ions produced from 2- and 4-pyrone,
J. Am. Chem. Soc., 1979, 101, 4973. [all data]