Cyclohexanone
- Formula: C6H10O
- Molecular weight: 98.1430
- IUPAC Standard InChIKey: JHIVVAPYMSGYDF-UHFFFAOYSA-N
- CAS Registry Number: 108-94-1
- Chemical structure:
View 3d structure (requires JavaScript / HTML 5) - Other names: Anon; Anone; Hexanon; Hytrol O; Nadone; Pimelic ketone; Pimelin ketone; Sextone; Ketohexamethylene; Cicloesanone; Cyclohexanon; Cykloheksanon; NCI-C55005; Rcra waste number U057; UN 1915; Cyclohexyl ketone; NSC 5711

Reaction thermochemistry data

Data compiled as indicated in comments:
B - John E. Bartmess
ALS - Hussein Y. Afeefy, Joel F. Liebman, and Stephen E. Stein
Individual Reactions
C6H9O- + =
By formula: C6H9O- + H+ = C6H10O
Quantity | Value | Units | Method | Reference | Comment |
---|---|---|---|---|---|
ΔrH° | 1533. ± 8.4 | kJ/mol | D-EA | Brinkman, Berger, et al., 1993 | gas phase; B |
ΔrH° | 1531. ± 9.6 | kJ/mol | D-EA | Zimmerman, Jackson, et al., 1978 | gas phase; B |
ΔrH° | 1544. ± 18. | kJ/mol | G+TS | Brickhouse and Squires, 1988 | gas phase; Between acetone, Me2C=NOH; B |
Quantity | Value | Units | Method | Reference | Comment |
ΔrG° | 1501. ± 9.6 | kJ/mol | H-TS | Brinkman, Berger, et al., 1993 | gas phase; B |
ΔrG° | 1498. ± 11. | kJ/mol | H-TS | Zimmerman, Jackson, et al., 1978 | gas phase; B |
ΔrG° | 1511. ± 17. | kJ/mol | IMRB | Brickhouse and Squires, 1988 | gas phase; Between acetone, Me2C=NOH; B |
By formula: C6H10O + H2 = C6H12O
Quantity | Value | Units | Method | Reference | Comment |
---|---|---|---|---|---|
ΔrH° | -75.86 ± 0.50 | kJ/mol | Cm | Wiberg, Crocker, et al., 1991 | liquid phase; ALS |
ΔrH° | -63.51 ± 0.63 | kJ/mol | Chyd | Conn, Kistiakowsky, et al., 1939 | gas phase; Reanalyzed by Cox and Pilcher, 1970, Original value = -64.5 ± 0.3 kJ/mol; At 355 K; ALS |
By formula: C6H12O = C6H10O + H2
Quantity | Value | Units | Method | Reference | Comment |
---|---|---|---|---|---|
ΔrH° | 63.4 ± 2.3 | kJ/mol | Eqk | Kabo, Yursha, et al., 1988 | gas phase; Dehydrogenation; ALS |
By formula: H2O + C7H12O = C6H10O + CH4O
Quantity | Value | Units | Method | Reference | Comment |
---|---|---|---|---|---|
ΔrH° | -13.63 ± 0.69 | kJ/mol | Eqk | Hine and Arata, 1976 | liquid phase; ALS |
By formula: H2O + C8H16O2 = C6H10O + 2CH4O
Quantity | Value | Units | Method | Reference | Comment |
---|---|---|---|---|---|
ΔrH° | 28.9 ± 0.1 | kJ/mol | Cm | Wiberg, Morgan, et al., 1994 | liquid phase; ALS |
By formula: C6H12O + C3H6O = C6H10O + C3H8O
Quantity | Value | Units | Method | Reference | Comment |
---|---|---|---|---|---|
ΔrH° | 9.9 ± 1.9 | kJ/mol | Eqk | Fedoseenko, Yursha, et al., 1983 | gas phase; At 503 K; ALS |
By formula: C6H10O + 2CH4O = H2O + C8H16O2
Quantity | Value | Units | Method | Reference | Comment |
---|---|---|---|---|---|
ΔrH° | -54. ± 1. | kJ/mol | Cm | Wiberg, Morgan, et al., 1994 | gas phase; ALS |
By formula: C6H10O + C5H10O = C6H12O + C5H8O
Quantity | Value | Units | Method | Reference | Comment |
---|---|---|---|---|---|
ΔrH° | -11.6 ± 1.7 | kJ/mol | Eqk | Fedoseenko, Yursha, et al., 1984 | gas phase; ALS |
By formula: C6H10O + C3H8O = C6H12O + C3H6O
Quantity | Value | Units | Method | Reference | Comment |
---|---|---|---|---|---|
ΔrH° | -9.9 ± 1.9 | kJ/mol | Eqk | Kabo, Yursha, et al., 1988 | gas phase; ALS |

Gas phase ion energetics data

Data evaluated as indicated in comments:
HL - Edward P. Hunter and Sharon G. Lias
L - Sharon G. Lias
Data compiled as indicated in comments:
B - John E. Bartmess
LBLHLM - Sharon G. Lias, John E. Bartmess, Joel F. Liebman, John L. Holmes, Rhoda D. Levin, and W. Gary Mallard
LLK - Sharon G. Lias, Rhoda D. Levin, and Sherif A. Kafafi
RDSH - Henry M. Rosenstock, Keith Draxl, Bruce W. Steiner, and John T. Herron
Quantity | Value | Units | Method | Reference | Comment |
---|---|---|---|---|---|
IE (evaluated) | 9.16 ± 0.02 | eV | N/A | N/A | L |
Quantity | Value | Units | Method | Reference | Comment |
Proton affinity (review) | 841.0 | kJ/mol | N/A | Hunter and Lias, 1998 | HL |
Quantity | Value | Units | Method | Reference | Comment |
Gas basicity | 811.2 | kJ/mol | N/A | Hunter and Lias, 1998 | HL |
Electron affinity determinations
EA (eV) | Method | Reference | Comment |
---|---|---|---|
0.0033 | EFD | Desfrancois, Abdoul-Carime, et al., 1994 | EA: 3.3 meV. Dipole-bound state.; B |
Ionization energy determinations
IE (eV) | Method | Reference | Comment |
---|---|---|---|
9.18 | PE | Loudet, Grimaud, et al., 1976 | LLK |
9.5 ± 0.2 | EI | Fortin, Forest, et al., 1973 | LLK |
9.16 ± 0.01 | PE | Cocksey, Eland, et al., 1971 | LLK |
9.14 ± 0.01 | PI | Watanabe, Nakayama, et al., 1962 | RDSH |
9.14 ± 0.03 | PI | Vilesov, 1960 | RDSH |
9.29 | PE | Spanka and Rademacher, 1986 | Vertical value; LBLHLM |
9.18 | PE | Kovac and Klasinc, 1978 | Vertical value; LLK |
9.28 | PE | Hentrich, Gunkel, et al., 1974 | Vertical value; LLK |
9.14 ± 0.02 | PE | Chadwick, Frost, et al., 1971 | Vertical value; LLK |
De-protonation reactions
C6H9O- + =
By formula: C6H9O- + H+ = C6H10O
Quantity | Value | Units | Method | Reference | Comment |
---|---|---|---|---|---|
ΔrH° | 1533. ± 8.4 | kJ/mol | D-EA | Brinkman, Berger, et al., 1993 | gas phase; B |
ΔrH° | 1531. ± 9.6 | kJ/mol | D-EA | Zimmerman, Jackson, et al., 1978 | gas phase; B |
ΔrH° | 1544. ± 18. | kJ/mol | G+TS | Brickhouse and Squires, 1988 | gas phase; Between acetone, Me2C=NOH; B |
Quantity | Value | Units | Method | Reference | Comment |
ΔrG° | 1501. ± 9.6 | kJ/mol | H-TS | Brinkman, Berger, et al., 1993 | gas phase; B |
ΔrG° | 1498. ± 11. | kJ/mol | H-TS | Zimmerman, Jackson, et al., 1978 | gas phase; B |
ΔrG° | 1511. ± 17. | kJ/mol | IMRB | Brickhouse and Squires, 1988 | gas phase; Between acetone, Me2C=NOH; B |

Gas phase thermochemistry data

Data compiled as indicated in comments:
ALS - Hussein Y. Afeefy, Joel F. Liebman, and Stephen E. Stein
GT - Glushko Thermocenter, Russian Academy of Sciences, Moscow
Quantity | Value | Units | Method | Reference | Comment |
---|---|---|---|---|---|
ΔfH°gas | -55.23 ± 0.21 | kcal/mol | Cm | Wiberg, Crocker, et al., 1991 | ALS |
ΔfH°gas | -53.94 | kcal/mol | Eqk | Kabo, Yursha, et al., 1988 | ALS |
ΔfH°gas | -54.43 ± 0.45 | kcal/mol | Ccb | Wolf, 1972 | ALS |
ΔfH°gas | -54.09 | kcal/mol | Ccb | Sellers and Sunner, 1962 | ALS |
Quantity | Value | Units | Method | Reference | Comment |
S°gas | 80.194 | cal/mol*K | N/A | Kabo G.J., 1988 | GT |
Constant pressure heat capacity of gas
Cp,gas (cal/mol*K) | Temperature (K) | Reference | Comment |
---|---|---|---|
28.934 | 298.15 | Kabo G.J., 1988 | Selected thermodynamic functions are in better agreement with experimental values of S(298.15 K) and Cp(T) than statistical values calculated by [ Thermodynamics Research Center, 1997, Andreevskii D.N., 1976]. Maximum discrepancies with functions given in [ Thermodynamics Research Center, 1997] amount to 2.5 and 5.0 J/mol*K for S(T) and Cp(T), respectively. Discrepancies with data [ Andreevskii D.N., 1976] reach 11 and 8 J/mol*K for S(T) and Cp(T), respectively.; GT |
29.132 | 300. | ||
38.690 | 400. | ||
46.938 | 500. | ||
53.834 | 600. | ||
59.577 | 700. | ||
64.405 | 800. | ||
68.478 | 900. | ||
71.955 | 1000. |
Constant pressure heat capacity of gas
Cp,gas (cal/mol*K) | Temperature (K) | Reference | Comment |
---|---|---|---|
37.094 | 385. | Shvaro O.V., 1987 | The experimental values of Cp(T) obtained by [ Vilcu R., 1975] seem to be not enough reliable in view of the comparison of experimental heat capacities of some alcohols and ketones measured by these authors (see [ Kabo G.J., 1995]).; GT |
38.497 | 400. | ||
40.387 | 420. | ||
42.020 | 440. | ||
43.893 | 460. | ||
45.454 | 480. |

Condensed phase thermochemistry data

Data compiled as indicated in comments:
ALS - Hussein Y. Afeefy, Joel F. Liebman, and Stephen E. Stein
DH - Eugene S. Domalski and Elizabeth D. Hearing
Quantity | Value | Units | Method | Reference | Comment |
---|---|---|---|---|---|
ΔfH°liquid | -66.00 ± 0.20 | kcal/mol | Cm | Wiberg, Crocker, et al., 1991 | ALS |
ΔfH°liquid | -65.16 ± 0.42 | kcal/mol | Ccb | Wolf, 1972 | ALS |
ΔfH°liquid | -60.7 ± 0.5 | kcal/mol | Ccb | Rabinovoch, Tel'noy, et al., 1962 | ALS |
ΔfH°liquid | -64.86 | kcal/mol | Ccb | Sellers and Sunner, 1962 | ALS |
Quantity | Value | Units | Method | Reference | Comment |
ΔcH°liquid | -840.74 ± 0.41 | kcal/mol | Ccb | Wolf, 1972 | Corresponding ΔfHºliquid = -65.147 kcal/mol (simple calculation by NIST; no Washburn corrections); ALS |
ΔcH°liquid | -845.2 ± 0.5 | kcal/mol | Ccb | Rabinovoch, Tel'noy, et al., 1962 | Corresponding ΔfHºliquid = -60.7 kcal/mol (simple calculation by NIST; no Washburn corrections); ALS |
ΔcH°liquid | -841.04 ± 0.25 | kcal/mol | Ccb | Sellers and Sunner, 1962 | Corresponding ΔfHºliquid = -64.84 kcal/mol (simple calculation by NIST; no Washburn corrections); ALS |
ΔcH°liquid | -836.4 ± 0.2 | kcal/mol | Ccb | Skuratov, Kozina, et al., 1957 | At 20C; Corresponding ΔfHºliquid = -69.5 kcal/mol (simple calculation by NIST; no Washburn corrections); ALS |
Quantity | Value | Units | Method | Reference | Comment |
S°liquid | 54.739 | cal/mol*K | N/A | Nakamura, Suga, et al., 1980 | DH |
Constant pressure heat capacity of liquid
Cp,liquid (cal/mol*K) | Temperature (K) | Reference | Comment |
---|---|---|---|
42.352 | 300. | Nakamura, Suga, et al., 1980 | T = 13 to 300 K. Unsmoothed experimental datum for Cp at 296.40 K is 175.96 J/mol*K.; DH |
47.90 | 304.2 | Phillip, 1939 | DH |
42.50 | 290. | Herz and Bloch, 1924 | DH |

Phase change data

Data compiled as indicated in comments:
TRC - Thermodynamics Research Center, NIST Boulder Laboratories, Chris Muzny director
BS - Robert L. Brown and Stephen E. Stein
AC - William E. Acree, Jr., James S. Chickos
ALS - Hussein Y. Afeefy, Joel F. Liebman, and Stephen E. Stein
DH - Eugene S. Domalski and Elizabeth D. Hearing
CAL - James S. Chickos, William E. Acree, Jr., Joel F. Liebman, Students of Chem 202 (Introduction to the Literature of Chemistry), University of Missouri -- St. Louis
Quantity | Value | Units | Method | Reference | Comment |
---|---|---|---|---|---|
Tboil | 428. ± 2. | K | AVG | N/A | Average of 21 out of 23 values; Individual data points |
Quantity | Value | Units | Method | Reference | Comment |
Tfus | 243. ± 10. | K | AVG | N/A | Average of 8 values; Individual data points |
Quantity | Value | Units | Method | Reference | Comment |
Ttriple | 245.21 | K | N/A | Nakamura, Suga, et al., 1980, 2 | Crystal phase 1 phase; Uncertainty assigned by TRC = 0.01 K; TRC |
Ttriple | 242.4 | K | N/A | Wuerflinger and Kreutzenbeck, 1978 | Crystal phase 1 phase; Uncertainty assigned by TRC = 0.5 K; TRC |
Quantity | Value | Units | Method | Reference | Comment |
Tc | 664.3 | K | N/A | Quadri and Kudchadker, 1991 | Uncertainty assigned by TRC = 3. K; TRC |
Tc | 653. | K | N/A | Ambrose and Ghiassee, 1987 | Uncertainty assigned by TRC = 3. K; TRC |
Tc | 629.15 | K | N/A | Glaser and Ruland, 1957 | Uncertainty assigned by TRC = 1.5 K; TRC |
Quantity | Value | Units | Method | Reference | Comment |
Pc | 45.40 | atm | N/A | Quadri and Kudchadker, 1991 | Uncertainty assigned by TRC = 0.987 atm; TRC |
Pc | 39.48 | atm | N/A | Ambrose and Ghiassee, 1987 | Uncertainty assigned by TRC = 0.49 atm; TRC |
Pc | 38.0000 | atm | N/A | Glaser and Ruland, 1957 | Uncertainty assigned by TRC = 2.0000 atm; TRC |
Quantity | Value | Units | Method | Reference | Comment |
ΔvapH° | 10.6 ± 0.9 | kcal/mol | AVG | N/A | Average of 7 values; Individual data points |
Reduced pressure boiling point
Tboil (K) | Pressure (atm) | Reference | Comment |
---|---|---|---|
320.2 | 0.020 | Weast and Grasselli, 1989 | BS |
Enthalpy of vaporization
ΔvapH (kcal/mol) | Temperature (K) | Method | Reference | Comment |
---|---|---|---|---|
10.786 | 428.8 | N/A | Svoboda, Kubes, et al., 1992 | Value corrected to 298.15 K.; DH |
10.3 | 358. | EB | Teodorescu, Barhala, et al., 2006 | Based on data from 343. to 427. K.; AC |
10.5 | 333. | N/A | Aucejo, Monton, et al., 1993 | Based on data from 318. to 428. K.; AC |
10.6 ± 0.02 | 308. | C | Svoboda, Kubes, et al., 1992 | AC |
10.5 ± 0.02 | 313. | C | Svoboda, Kubes, et al., 1992 | AC |
10.4 ± 0.02 | 323. | C | Svoboda, Kubes, et al., 1992 | AC |
10.3 ± 0.02 | 328. | C | Svoboda, Kubes, et al., 1992 | AC |
10.1 ± 0.02 | 338. | C | Svoboda, Kubes, et al., 1992 | AC |
9.99 ± 0.02 | 343. | C | Svoboda, Kubes, et al., 1992 | AC |
9.89 ± 0.02 | 348. | C | Svoboda, Kubes, et al., 1992 | AC |
10.1 | 360. | EB | Ambrose and Ghiassee, 1987, 2 | Based on data from 345. to 458. K.; AC |
9.92 | 377. | A,EB | Stephenson and Malanowski, 1987 | Based on data from 362. to 439. K. See also Meyer and Hotz, 1973.; AC |
9.66 | 410. | N/A | Castellari, Francesconi, et al., 1984 | Based on data from 395. to 426. K.; AC |
9.63 | 286. | N/A | Radulescu and Alexa, 1938 | Based on data from 273. to 298. K.; AC |
Antoine Equation Parameters
log10(P) = A − (B / (T + C))
P = vapor pressure (atm)
T = temperature (K)
View plot Requires a JavaScript / HTML 5 canvas capable browser.
Temperature (K) | A | B | C | Reference |
---|---|---|---|---|
362.78 to 438.92 | 4.0976 ± 0.00099 | 1495.51 ± 0.67 | -63.598 ± 0.075 | Meyer and Hotz, 1973 |
Enthalpy of sublimation
ΔsubH (kcal/mol) | Temperature (K) | Reference | Comment |
---|---|---|---|
11.8 | 254. | Nitta and Seki, 1948 | Based on data from 243. to 265. K.; AC |
Enthalpy of fusion
ΔfusH (kcal/mol) | Temperature (K) | Reference | Comment |
---|---|---|---|
0.318 | 245.2 | Nakamura, Suga, et al., 1980 | AC |
Entropy of fusion
ΔfusS (cal/mol*K) | Temperature (K) | Reference | Comment |
---|---|---|---|
9.20 | 221. | Gonthier-Vassal and Szwarc, 1998 | CAL |
1.2 | 242.6 |
Entropy of fusion
ΔfusS (cal/mol*K) | Temperature (K) | Reference | Comment |
---|---|---|---|
9.374 | 220.8 | Nakamura, Suga, et al., 1980, 2 | CAL |
1.30 | 245.2 |
Enthalpy of phase transition
ΔHtrs (kcal/mol) | Temperature (K) | Initial Phase | Final Phase | Reference | Comment |
---|---|---|---|---|---|
2.0697 | 220.83 | crystaline, II | crystaline, I | Nakamura, Suga, et al., 1980 | DH |
0.31730 | 245.21 | crystaline, I | liquid | Nakamura, Suga, et al., 1980 | DH |
Entropy of phase transition
ΔStrs (cal/mol*K) | Temperature (K) | Initial Phase | Final Phase | Reference | Comment |
---|---|---|---|---|---|
9.374 | 220.83 | crystaline, II | crystaline, I | Nakamura, Suga, et al., 1980 | DH |
1.294 | 245.21 | crystaline, I | liquid | Nakamura, Suga, et al., 1980 | DH |

Kovats' RI, non-polar column, isothermal

View large format table.

Column type Active phase Temperature (C) I Reference Comment
PackedC78, Branched paraffin130.854.1Dallos, Sisak, et al., 2000He; Column length: 3.3 m
CapillarySE-30100.881.Golovnya, Syomina, et al., 199725. m/0.32 mm/1. μm, He
CapillarySE-30110.883.Golovnya, Syomina, et al., 199725. m/0.32 mm/1. μm, He
CapillarySE-3080.874.Golovnya, Syomina, et al., 199725. m/0.32 mm/1. μm, He
CapillarySE-3090.877.Golovnya, Syomina, et al., 199725. m/0.32 mm/1. μm, He
PackedC78, Branched paraffin130.853.9Reddy, Dutoit, et al., 1992Chromosorb G HP; Column length: 3.3 m
CapillarySPB-160.861.Castello, Vezzani, et al., 1991N2; Column length: 60. m; Column diameter: 0.75 mm
PackedApolane130.857.Dutoit, 1991Column length: 3.7 m
PackedSE-30150.895.Tiess, 1984Ar, Gas Chrom Q (80-100 mesh); Column length: 3. m
PackedOV-1120.883.Valko, Papp, et al., 1984Gas Chrom Q; Column length: 2. m
PackedApiezon L70.851.Jaworski, 1982Column length: 1.8 m
PackedApiezon L120.884.Bogoslovsky, Anvaer, et al., 1978Celite 545
PackedApiezon L130.886.Bogoslovsky, Anvaer, et al., 1978
CapillarySqualane100.855.1Schomburg and Dielmann, 1973Column length: 100. m; Column diameter: 0.25 mm
PackedApiezon L130.888.Paris and Alexandre, 1972Chromosorb W AW
PackedApiezon L100.867.Brown, Chapman, et al., 1968N2, DCMS-treated Chromosorb W; Column length: 2.3 m
PackedApiezon L130.886.Wehrli and Kováts, 1959Celite; Column length: 2.25 m

Kovats' RI, non-polar column, temperature ramp

View large format table.

Column type Active phase I Reference Comment
CapillaryCBP-1869.Shimadzu, 200325. m/0.2 mm/0.25 μm, He, 50. C @ 5. min, 4. K/min; Tend: 200. C
CapillaryOV-101872.Yamaguchi and Shibamoto, 1981N2, 2. K/min; Column length: 70. m; Column diameter: 0.28 mm; Tstart: 80. C; Tend: 200. C
CapillaryOV-101874.Yamaguchi and Shibamoto, 1981N2, 2. K/min; Column length: 70. m; Column diameter: 0.28 mm; Tstart: 80. C; Tend: 200. C

Kovats' RI, non-polar column, custom temperature program

View large format table.

Column type Active phase I Reference Comment
CapillaryBP-1875.Raina, Srivastava, et al., 200325. m/0.32 mm/0.25 μm, N2; Program: 60C => 5C/min => 220C(5min) => 3C/min => 245C(5min)

Kovats' RI, polar column, isothermal

View large format table.

Column type Active phase Temperature (C) I Reference Comment
CapillarySupelcowax-1060.1301.Castello, Vezzani, et al., 1991N2; Column length: 60. m; Column diameter: 0.75 mm
PackedCarbowax 20M75.1310.Goebel, 1982N2, Kieselgur (60-100 mesh); Column length: 2. m

Kovats' RI, polar column, temperature ramp

View large format table.

Column type Active phase I Reference Comment
CapillaryCBP-201287.Shimadzu, 200325. m/0.2 mm/0.25 μm, He, 50. C @ 5. min, 4. K/min; Tend: 200. C
CapillaryDB-Wax1282.Umano and Shibamoto, 1987He, 40. C @ 10. min, 2. K/min; Column length: 60. m; Column diameter: 0.25 mm; Tend: 200. C
CapillaryCarbowax 20M1280.Yamaguchi and Shibamoto, 1981N2, 2. K/min; Column length: 70. m; Column diameter: 0.28 mm; Tstart: 80. C; Tend: 200. C
CapillaryCarbowax 20M1281.Yamaguchi and Shibamoto, 1981N2, 2. K/min; Column length: 70. m; Column diameter: 0.28 mm; Tstart: 80. C; Tend: 200. C

Van Den Dool and Kratz RI, non-polar column, temperature ramp

View large format table.

Column type Active phase I Reference Comment
CapillaryHP-5MS895.Pino, Mesa, et al., 200530. m/0.25 mm/0.25 μm, He, 60. C @ 2. min, 4. K/min, 250. C @ 20. min
CapillaryDB-1851.7Sun and Stremple, 200330. m/0.25 mm/0.25 μm, He, 3. K/min; Tstart: 40. C; Tend: 325. C
CapillaryDB-5896.8Xu, van Stee, et al., 200330. m/0.25 mm/1. μm, He, 2.5 K/min; Tstart: 50. C; Tend: 200. C
CapillaryDB-5894.Dallüge, van Stee, et al., 200230. m/0.25 mm/1. μm, He, 2.5 K/min; Tstart: 50. C; Tend: 200. C
CapillaryDB-5894.Moio L., Rillo L., et al., 199630. m/0.32 mm/1. μm, H2, 3. K/min; Tstart: 40. C; Tend: 220. C
CapillaryDB-5891.Rostad and Pereira, 198630. m/0.26 mm/0.25 μm, He, 50. C @ 4. min, 6. K/min, 300. C @ 20. min
PackedSE-30881.Buchman, Cao, et al., 1984He, Chromosorb AW, 40. C @ 10. min, 10. K/min, 210. C @ 30. min; Column length: 3.05 m

Van Den Dool and Kratz RI, non-polar column, custom temperature program

View large format table.

Column type Active phase I Reference Comment
Capillary5 % Phenyl methyl siloxane896.Yasuhara, Shiraishi, et al., 199725. m/0.31 mm/0.52 μm, He; Program: 50C(2min) => (20C/min) => 120C => (7C/min) => 310C(10min)
PackedSE-30881.Peng, Ding, et al., 1988Supelcoport; Chromosorb; Column length: 3.05 m; Program: 40C(5min) => 10C/min => 200C or 250C (60min)

Van Den Dool and Kratz RI, polar column, temperature ramp

View large format table.

Column type Active phase I Reference Comment
CapillarySupelcowax-101291.Chung, Yung, et al., 200260. m/0.25 mm/0.25 μm, He, 35. C @ 5. min, 2. K/min, 195. C @ 90. min
CapillarySupelcowax-101291.Chung, Yung, et al., 200160. m/0.25 mm/0.25 μm, He, 35. C @ 5. min, 2. K/min, 195. C @ 90. min
CapillaryAT-Wax1275.Pino and Marbot, 200160. m/0.32 mm/0.25 μm, He, 65. C @ 10. min, 2. K/min, 250. C @ 60. min
CapillaryDB-Wax1311.Le Guen, Prost, et al., 200060. m/0.32 mm/0.5 μm, He, 40. C @ 2. min, 4. K/min, 250. C @ 10. min
CapillaryCP-Wax 52CB1280.Chevance and Farmer, 199960. C @ 5. min, 4. K/min, 220. C @ 30. min; Column length: 50. m; Column diameter: 0.32 mm
CapillaryCP-Wax 52CB1280.Chevance and Farmer, 1999, 260. C @ 5. min, 4. K/min, 220. C @ 30. min; Column length: 50. m; Column diameter: 0.32 mm
CapillaryDB-Wax1315.Shimoda, Peralta, et al., 199660. m/0.25 mm/0.25 μm, He, 3. K/min; Tstart: 50. C; Tend: 230. C
CapillaryDB-Wax1314.Shimoda, Shigematsu, et al., 199560. m/0.25 mm/0.25 μm, 2. K/min; Tstart: 50. C; Tend: 230. C
CapillaryDB-Wax1314.Shimoda, Shigematsu, et al., 1995, 260. m/0.25 mm/0.25 μm, He, 2. K/min; Tstart: 50. C; Tend: 230. C
CapillarySupelcowax-101291.Vejaphan, Hsieh, et al., 198860. m/0.25 mm/0.25 μm, 40. C @ 5. min, 2. K/min, 175. C @ 20. min
CapillarySupelcowax-101296.Vejaphan, Hsieh, et al., 198860. m/0.25 mm/0.25 μm, 40. C @ 5. min, 2. K/min, 175. C @ 20. min
PackedCarbowax 20M1333.Buchman, Cao, et al., 1984He, Supelcoport, 40. C @ 10. min, 10. K/min, 210. C @ 30. min; Column length: 3.05 m

Van Den Dool and Kratz RI, polar column, custom temperature program

View large format table.

Column type Active phase I Reference Comment
CapillarySupelcowax-101282.Bianchi, Careri, et al., 200730. m/0.25 mm/0.25 μm, He; Program: 35C(8min) => 4C/min => 60C => 6C/min => 160C => 20C/min => 200C(1min)

Normal alkane RI, non-polar column, isothermal

View large format table.

Column type Active phase Temperature (C) I Reference Comment
CapillaryPolydimethyl siloxane105.876.Tello, Lebron-Aguilar, et al., 2009
CapillaryPolydimethyl siloxane75.866.Tello, Lebron-Aguilar, et al., 2009
CapillaryPolydimethyl siloxane90.871.Tello, Lebron-Aguilar, et al., 2009
CapillaryMethyl Silicone100.874.Lebrón-Aguilar, Quintanilla-López, et al., 2007
CapillaryMethyl Silicone120.882.Lebrón-Aguilar, Quintanilla-López, et al., 2007
CapillaryMethyl Silicone140.890.Lebrón-Aguilar, Quintanilla-López, et al., 2007
CapillaryMethyl Silicone80.867.Lebrón-Aguilar, Quintanilla-López, et al., 2007
CapillaryDB-160.879.Shimadzu, 2003, 260. m/0.32 mm/1. μm, He
CapillaryOV-101102.862.Wang, Deng, et al., 1992Column length: 23. m; Column diameter: 0.50 mm
CapillaryOV-101106.864.Wang, Deng, et al., 1992Column length: 23. m; Column diameter: 0.50 mm
CapillaryOV-101110.865.Wang, Deng, et al., 1992Column length: 23. m; Column diameter: 0.50 mm
CapillaryOV-101114.866.Wang, Deng, et al., 1992Column length: 23. m; Column diameter: 0.50 mm
CapillaryOV-10194.860.Wang, Deng, et al., 1992Column length: 23. m; Column diameter: 0.50 mm
CapillaryOV-10198.862.Wang, Deng, et al., 1992Column length: 23. m; Column diameter: 0.50 mm
CapillaryOV-10198.862.Wang, Deng, et al., 1992Column length: 23. m; Column diameter: 0.50 mm
PackedDC-400150.894.Anderson, 1968Helium, Gas-Pak (60-80 mesh); Column length: 3.0 m

Normal alkane RI, non-polar column, temperature ramp

View large format table.

Column type Active phase I Reference Comment
CapillaryVF-5 MS896.Leffingwell and Alford, 201160. m/0.32 mm/0.25 μm, Helium, 2. K/min, 260. C @ 28. min; Tstart: 30. C
CapillaryVF-5 MS897.Leffingwell and Alford, 201160. m/0.32 mm/0.25 μm, Helium, 2. K/min, 260. C @ 28. min; Tstart: 30. C
CapillaryOV-101864.Zenkevich, Eliseenkov, et al., 201125. m/0.20 mm/0.25 μm, Nitrogen, 6. K/min; Tstart: 40. C; Tend: 240. C
CapillaryHP-5903.Radulovic, Dordevic, et al., 201030. m/0.25 mm/0.25 μm, Hydrogen, 5. K/min; Tstart: 70. C; Tend: 290. C
CapillaryZB-1854.Harvey and Wenzel, 200915. m/0.25 mm/0.10 μm, Helium, 4. K/min, 185. C @ 15. min; Tstart: 35. C
CapillaryZB-1858.Harvey and Wenzel, 200915. m/0.25 mm/0.10 μm, Helium, 4. K/min, 185. C @ 15. min; Tstart: 35. C
CapillaryZB-1867.Harvey and Wenzel, 200915. m/0.25 mm/0.10 μm, Helium, 4. K/min, 185. C @ 15. min; Tstart: 35. C
CapillaryBP-1871.Health Safety Executive, 200050. m/0.22 mm/0.75 μm, He, 5. K/min; Tstart: 50. C; Tend: 200. C
CapillaryDB-1858.Lu, Yu, et al., 199760. m/0.32 mm/1. μm, He, 40. C @ 2. min, 2. K/min, 280. C @ 40. min
CapillaryDB-5894.Moio, Dekimpe, et al., 199330. m/0.32 mm/1. μm, H2, 3. K/min; Tstart: 40. C; Tend: 220. C
CapillaryDB-1854.Habu, Flath, et al., 19853. K/min; Column length: 50. m; Column diameter: 0.32 mm; Tstart: 0. C; Tend: 250. C
CapillaryOV-101858.Stern, Flath, et al., 198550. C @ 0.1 min, 4. K/min, 225. C @ 30. min; Column length: 50. m; Column diameter: 0.32 mm

Normal alkane RI, non-polar column, custom temperature program

View large format table.

Column type Active phase I Reference Comment
CapillaryDB-5 MS875.Zhu, Li, et al., 200830. m/0.25 mm/0.25 μm, Helium; Program: 50 0C (2.8 min) 5.5 0C/min -> 140 0C (1 min) 4.5 oC/min -> 220 0C -> 225 0C (2 min) 3.4 0C/min -> 265 0C (5 min)
CapillaryDB-5 MS894.Zhu, Li, et al., 200830. m/0.25 mm/0.25 μm, Helium; Program: 50 0C (2.8 min) 5.5 0C/min -> 140 0C (1 min) 4.5 oC/min -> 220 0C -> 225 0C (2 min) 3.4 0C/min -> 265 0C (5 min)
CapillaryBP-5895.Helsper, Bücking, et al., 200630. m/0.25 mm/1. μm, He; Program: 40C(2min) => 4C/min => 150C => 8C/min => 250C (15min)
CapillaryMethyl Silicone871.Blunden, Aneja, et al., 200560. m/0.32 mm/1.0 μm, Helium; Program: -50 0C (2 min) 8 0C/min -> 200 0C (7.75 min) 25 0C -> 225 0C (8 min)
CapillarySE-30875.Vinogradov, 2004Program: not specified
CapillaryBPX-5898.Machiels, van Ruth, et al., 200360. m/0.32 mm/1. μm, He; Program: 40C (4min) => 2C/min => 90C => 4C/min => 130C => 8C/min => 250 C (10min)
CapillarySPB-1878.Flanagan, Streete, et al., 199760. m/0.53 mm/5. μm, He; Program: 40C(6min) => 5C/min => 80C => 10C/min => 200C
CapillarySPB-1862.0Chang, Giang, et al., 199330. m/0.53 mm/1.5 μm; Program: 35C (6min) => 3C/min => 100C => 6C/min => 250C => 30C => 260C (2.5min)
CapillarySPB-1878.Strete, Ruprah, et al., 199260. m/0.53 mm/5.0 μm, Helium; Program: 40 0C (6 min) 5 0C/min -> 80 0C 10 0C/min -> 200 0C
CapillarySPB-1875.Strete, Ruprah, et al., 199260. m/0.53 mm/5.0 μm, Helium; Program: not specified
CapillarySE-30857.Ibrahim and Suffet, 1988N2; Column length: 60. m; Column diameter: 0.32 mm; Program: 50C(8min) => 3C/min => 150C => 35C/min => 275C (10min)
CapillaryOV-101875.Shibamoto, 1987Program: not specified
CapillaryOV-1, SE-30, Methyl silicone, SP-2100, OV-101, DB-1, etc.900.Waggott and Davies, 1984Hydrogen; Column length: 50. m; Column diameter: 0.32 mm; Program: not specified
CapillaryOV-1855.Ramsey and Flanagan, 1982Program: not specified

Normal alkane RI, polar column, isothermal

View large format table.

Column type Active phase Temperature (C) I Reference Comment
CapillaryDB-Wax60.1302.Shimadzu, 2003, 250. m/0.32 mm/1. μm, He

Normal alkane RI, polar column, temperature ramp

View large format table.

Column type Active phase I Reference Comment
CapillaryDB-Wax1281.Lin, Cai, et al., 200330. m/0.25 mm/0.25 μm, He, 50. C @ 2. min, 3. K/min, 230. C @ 20. min
CapillaryDB-Wax1281.Hayata, Sakamoto, et al., 200260. m/0.25 mm/0.25 μm, He, 40. C @ 10. min, 3. K/min, 220. C @ 10. min
CapillaryDB-Wax1320.Iwatsuki, Mizota, et al., 19994. K/min; Column length: 30. m; Column diameter: 0.53 mm; Tstart: 60. C; Tend: 210. C
CapillaryDB-Wax1285.Werkhoff, Güntert, et al., 199860. m/0.32 mm/0.25 μm, H2, 3. K/min; Tstart: 60. C; Tend: 220. C
CapillaryTC-Wax1299.Shuichi, Masazumi, et al., 199680. C @ 5. min, 3. K/min; Column length: 60. m; Column diameter: 0.25 mm; Tend: 240. C
CapillaryDB-Wax1273.Chung, Eiserich, et al., 199360. C @ 4. min, 3. K/min; Column length: 60. m; Column diameter: 0.25 mm; Tend: 220. C

Normal alkane RI, polar column, custom temperature program

View large format table.

Column type Active phase I Reference Comment
CapillaryDB-Wax1285.Welke, Manfroi, et al., 201230. m/0.25 mm/0.25 μm, Helium; Program: not specified
CapillaryDB-Wax1311.Welke, Manfroi, et al., 201230. m/0.25 mm/0.25 μm, Helium; Program: not specified
CapillaryDB-Wax1314.Welke, Manfroi, et al., 201230. m/0.25 mm/0.25 μm, Helium; Program: not specified
CapillaryCarbowax 20M1306.Vinogradov, 2004Program: not specified
CapillarySupelcowax-101306.Jung, Kim, et al., 2001Program: not specified
CapillaryDB-Wax1289.Peng, Yang, et al., 1991Program: not specified
CapillaryCarbowax 20M1306.Shibamoto, 1987Program: not specified
CapillaryCarbowax 20M1275.Ramsey and Flanagan, 1982Program: not specified

Lee's RI, non-polar column, temperature ramp

View large format table.

Column type Active phase I Reference Comment
CapillaryDB-5139.80Rostad and Pereira, 198630. m/0.26 mm/0.25 μm, He, 50. C @ 4. min, 6. K/min, 300. C @ 20. min

References

Brinkman, Berger, et al., 1993
Brinkman, E.A.; Berger, S.; Marks, J.; Brauman, J.I.,
Molecular Rotation and the Observation of Dipole-Bound States of Anions,
J. Chem. Phys., 1993, 99, 10, 7586, https://doi.org/10.1063/1.465688
. [all data]
Zimmerman, Jackson, et al., 1978
Zimmerman, A.H.; Jackson, R.L.; Janousek, B.K.; Brauman, J.J.,
Electron photodetachment from cyclic enolate anions in the gas phase: Electron affinities of cyclic enolate radicals,
J. Am. Chem. Soc., 1978, 100, 4674. [all data]
Brickhouse and Squires, 1988
Brickhouse, M.D.; Squires, R.R.,
Gas Phase Bronsted vs. Lewis Acid-Base Reactions of 6,6-Dimethylfulvene. A Sensitive Probe of the Electronic Structures of Organic Anions,
J. Am. Chem. Soc., 1988, 110, 9, 2706, https://doi.org/10.1021/ja00217a002
. [all data]
Wiberg, Crocker, et al., 1991
Wiberg, K.B.; Crocker, L.S.; Morgan, K.M.,
Thermochemical studies of carbonyl compounds. 5. Enthalpies of reduction of carbonyl groups,
J. Am. Chem. Soc., 1991, 113, 3447-3450. [all data]
Conn, Kistiakowsky, et al., 1939
Conn, J.B.; Kistiakowsky, G.B.; Smith, E.A.,
Heats of organic reactions. VIII. Some further hydrogenations, including those of some acetylenes,
J. Am. Chem. Soc., 1939, 61, 1868-1876. [all data]
Cox and Pilcher, 1970
Cox, J.D.; Pilcher, G.,
Thermochemistry of Organic and Organometallic Compounds, Academic Press, New York, 1970, 1-636. [all data]
Kabo, Yursha, et al., 1988
Kabo, G.J.; Yursha, I.A.; Frenkel, M.L.; Poleshchuk, P.A.; Fedoseenko, V.I.; Ladutko, A.I.,
Thermodynamic properties of cyclohexanol and cyclohexanone,
J. Chem. Thermodyn., 1988, 20, 429-437. [all data]
Hine and Arata, 1976
Hine, J.; Arata, K.,
Keto-Enol tautomerism. II. The calorimetrical determination of the equilibrium constants for keto-enol tautomerism for cyclohexanone,
Bull. Chem. Soc. Jpn., 1976, 49, 3089-3092. [all data]
Wiberg, Morgan, et al., 1994
Wiberg, K.B.; Morgan, K.M.; Maltz, H.,
Thermochemistry of carbonyl reactions. 6. A study of hydration equilibria,
J. Am. Chem. Soc., 1994, 116, 11067-11077. [all data]
Fedoseenko, Yursha, et al., 1983
Fedoseenko, V.I.; Yursha, I.A.; Kabo, G.Ya.,
Equilibrium and thermodynamics of cyclohexanol dehydrogenation reactions,
Dokl. Akad. Nauk BSSR, 1983, 27, 926-929. [all data]
Fedoseenko, Yursha, et al., 1984
Fedoseenko, V.I.; Yursha, I.A.; Kabo, G.Ya.,
Equilibrium of cyclopentanol dehydrogenation and hydrogen disproportionation in the cyclopentanol-cyclohexanone system,
Dokl. Akad. Nauk BSSR, 1984, 28, 1109-1112. [all data]
Hunter and Lias, 1998
Hunter, E.P.; Lias, S.G.,
Evaluated Gas Phase Basicities and Proton Affinities of Molecules: An Update,
J. Phys. Chem. Ref. Data, 1998, 27, 3, 413-656, https://doi.org/10.1063/1.556018
. [all data]
Desfrancois, Abdoul-Carime, et al., 1994
Desfrancois, C.; Abdoul-Carime, H.; Khelifa, N.; Schermann, J.P.,
Fork 1/r to 1/r2 Potentials: Electron Exchange between Rydberg Atoms and Polar Molecules,
Phys. Rev. Lett., 1994, 73, 18, 2436, https://doi.org/10.1103/PhysRevLett.73.2436
. [all data]
Loudet, Grimaud, et al., 1976
Loudet, M.; Grimaud, M.; Metras, F.; Pfister-Guillouzo, G.,
Interactions intramoleculaires en serie cyclohexanique partie II. Spectres photoelectroniques de chloro-2-cyclohexanones,
J. Mol. Struct., 1976, 35, 213. [all data]
Fortin, Forest, et al., 1973
Fortin, C.J.; Forest, M.; Vaziri, C.; Gravel, D.; Rousseau, Y.,
Spectrometrie de masse des cyclohexanones gem-diphenylees. I. Localisation de la charge positive,
Can. J. Chem., 1973, 51, 3445. [all data]
Cocksey, Eland, et al., 1971
Cocksey, B.J.; Eland, J.H.D.; Danby, C.J.,
The effect of alkyl substitution on ionisation potential,
J. Chem. Soc., 1971, (B), 790. [all data]
Watanabe, Nakayama, et al., 1962
Watanabe, K.; Nakayama, T.; Mottl, J.,
Ionization potentials of some molecules,
J. Quant. Spectry. Radiative Transfer, 1962, 2, 369. [all data]
Vilesov, 1960
Vilesov, F.I.,
The photoionization of vapors of compounds whose molecules contain carbonyl groups,
Dokl. Phys. Chem., 1960, 132, 521, In original 1332. [all data]
Spanka and Rademacher, 1986
Spanka, G.; Rademacher, P.,
Transannular interactions in difunctional medium rings. 1. n/π Interactions in cyclic amino ketones and aminoalkenes studied by photoelectron spectroscopy,
J. Org. Chem., 1986, 51, 592. [all data]
Kovac and Klasinc, 1978
Kovac, B.; Klasinc, L.,
Photoelectron spectroscopy of adamantane and some adamantanones,
Croat. Chem. Acta, 1978, 51, 55. [all data]
Hentrich, Gunkel, et al., 1974
Hentrich, G.; Gunkel, E.; Klessinger, M.,
Photoelektronenspektren organischer verbindungen. 4. Photoelektronenspektren ungesattigter carbonylverbindungen,
J. Mol. Struct., 1974, 21, 231. [all data]
Chadwick, Frost, et al., 1971
Chadwick, D.; Frost, D.C.; Weiler, L.,
The photoelectron spectra of cyclic ketones,
Tetrahedron Lett., 1971, 47, 4543. [all data]