Benzene, chloro-
- Formula: C6H5Cl
- Molecular weight: 112.557
- IUPAC Standard InChIKey: MVPPADPHJFYWMZ-UHFFFAOYSA-N
- CAS Registry Number: 108-90-7
- Chemical structure:
View 3d structure (requires JavaScript / HTML 5) - Other names: Chlorobenzene; Monochlorobenzene; MCB; Phenyl Chloride; Benzene chloride; Chlorbenzene; Chlorobenzol; Monochlorbenzene; Chloorbenzeen; Chlorbenzol; Chlorobenzen; Chlorobenzene, mono-; Clorobenzene; Monochloorbenzeen; Monochlorbenzol; Monoclorobenzene; NCI-C54886; Chlorobenzenu; UN 1134; Abluton T30; CP 27; IP Carrier T 40; NSC 8433; Tetrosin SP

Gas phase thermochemistry data

Data compiled by: Hussein Y. Afeefy, Joel F. Liebman, and Stephen E. Stein
Quantity | Value | Units | Method | Reference | Comment |
---|---|---|---|---|---|
ΔfH°gas | 54.42 | kJ/mol | Ccr | Platonov and Simulin, 1985 |

Condensed phase thermochemistry data

Data compiled as indicated in comments:
ALS - Hussein Y. Afeefy, Joel F. Liebman, and Stephen E. Stein
DH - Eugene S. Domalski and Elizabeth D. Hearing
Quantity | Value | Units | Method | Reference | Comment |
---|---|---|---|---|---|
ΔfH°liquid | 11.5 ± 1.0 | kJ/mol | Ccr | Kolesov, Tomareva, et al., 1967 | Reanalyzed by Cox and Pilcher, 1970, Original value = 11.8 kJ/mol; ALS |
ΔfH°liquid | 10.7 ± 0.79 | kJ/mol | Ccb | Hubbard, Knowlton, et al., 1954 | ALS |
Quantity | Value | Units | Method | Reference | Comment |
ΔcH°liquid | -3112.7 ± 0.9 | kJ/mol | Ccr | Platonov and Simulin, 1985 | ALS |
ΔcH°liquid | -3110.7 ± 1.0 | kJ/mol | Ccr | Kolesov, Tomareva, et al., 1967 | ALS |
ΔcH°liquid | -3108.9 ± 0.79 | kJ/mol | Ccb | Hubbard, Knowlton, et al., 1954 | ALS |
ΔcH°liquid | -3111.6 ± 8.4 | kJ/mol | Ccb | Smith, Bjellerup, et al., 1953 | Reanalyzed by Cox and Pilcher, 1970, Original value = -3107.2 kJ/mol; ALS |
Quantity | Value | Units | Method | Reference | Comment |
S°liquid | 197.5 | J/mol*K | N/A | Stull, 1937 | Extrapolation below 91 K, 44.02 J/mol*K.; DH |
Constant pressure heat capacity of liquid
Cp,liquid (J/mol*K) | Temperature (K) | Reference | Comment |
---|---|---|---|
152.1 | 298.15 | Shehatta, 1993 | DH |
153.78 | 298.15 | Perez-Casas, Aicart, et al., 1988 | DH |
150.6 | 303.15 | Reddy, 1986 | T = 303.15, 313.15 K.; DH |
150.787 | 298.15 | Fortier and Benson, 1977 | DH |
147.7 | 298. | Deshpande and Bhatagadde, 1971 | T = 298 to 318 K.; DH |
157.3 | 305.6 | Phillip, 1939 | DH |
150.08 | 298.1 | Stull, 1937 | T = 90 to 320 K.; DH |
145.6 | 293.2 | Williams and Daniels, 1925 | T = 20 to 80°C.; DH |
141.0 | 298. | von Reis, 1881 | T = 294 to 425 K.; DH |
Constant pressure heat capacity of solid
Cp,solid (J/mol*K) | Temperature (K) | Reference | Comment |
---|---|---|---|
106.3 | 216.8 | Andrews and Haworth, 1928 | T = 101 to 217 K. Value is unsmoothed experimental datum.; DH |

Phase change data

Data compiled as indicated in comments:
TRC - Thermodynamics Research Center, NIST Boulder Laboratories, Chris Muzny director
BS - Robert L. Brown and Stephen E. Stein
AC - William E. Acree, Jr., James S. Chickos
ALS - Hussein Y. Afeefy, Joel F. Liebman, and Stephen E. Stein
DH - Eugene S. Domalski and Elizabeth D. Hearing
Quantity | Value | Units | Method | Reference | Comment |
---|---|---|---|---|---|
Tboil | 404.9 ± 0.6 | K | AVG | N/A | Average of 53 out of 55 values; Individual data points |
Quantity | Value | Units | Method | Reference | Comment |
Tfus | 228.0 ± 0.4 | K | AVG | N/A | Average of 19 values; Individual data points |
Quantity | Value | Units | Method | Reference | Comment |
Ttriple | 227.9 | K | N/A | Stull, 1937, 2 | Uncertainty assigned by TRC = 0.2 K; TRC |
Quantity | Value | Units | Method | Reference | Comment |
Tc | 632.35 | K | N/A | Young, 1910 | Uncertainty assigned by TRC = 0.3 K; disappearance of meniscus; TRC |
Tc | 632.65 | K | N/A | Livingston, Morgan, et al., 1908 | Uncertainty assigned by TRC = 6. K; calculation based on extrap. of density and surface tension; TRC |
Tc | 635.35 | K | N/A | Altschul, 1893 | Uncertainty assigned by TRC = 2. K; disappearance of meniscus; TRC |
Quantity | Value | Units | Method | Reference | Comment |
Pc | 45.191 | bar | N/A | Young, 1910 | Uncertainty assigned by TRC = 0.3039 bar; TRC |
Quantity | Value | Units | Method | Reference | Comment |
ρc | 3.24 | mol/l | N/A | Young, 1910 | Uncertainty assigned by TRC = 0.04 mol/l; law of rectilinear diam.; TRC |
Quantity | Value | Units | Method | Reference | Comment |
ΔvapH° | 41. ± 4. | kJ/mol | AVG | N/A | Average of 7 values; Individual data points |
Enthalpy of vaporization
ΔvapH (kJ/mol) | Temperature (K) | Method | Reference | Comment |
---|---|---|---|---|
35.19 | 404.9 | N/A | Majer and Svoboda, 1985 | |
48.1 | 258. to 313. | GC | Liu and Dickhut, 1994 | AC |
35.4 | 420. | A | Stephenson and Malanowski, 1987 | Based on data from 405. to 597. K.; AC |
38.8 | 348. | A | Stephenson and Malanowski, 1987 | Based on data from 333. to 405. K. See also Brown, 1952 and Boublik, Fried, et al., 1984.; AC |
37.3 | 278. | ME | Zibberman-Granovskaya, 1940 | Based on data from 253. to 303. K.; AC |
Antoine Equation Parameters
log10(P) = A − (B / (T + C))
P = vapor pressure (bar)
T = temperature (K)
View plot Requires a JavaScript / HTML 5 canvas capable browser.
Temperature (K) | A | B | C | Reference | Comment |
---|---|---|---|---|---|
335.19 to 404.88 | 4.11083 | 1435.675 | -55.124 | Brown, 1952, 2 | Coefficents calculated by NIST from author's data. |
Enthalpy of fusion
ΔfusH (kJ/mol) | Temperature (K) | Reference | Comment |
---|---|---|---|
9.55 | 227.9 | Domalski and Hearing, 1996 | AC |
9.556 | 227.89 | Stull, 1937 | DH |
Entropy of fusion
ΔfusS (J/mol*K) | Temperature (K) | Reference | Comment |
---|---|---|---|
41.93 | 227.89 | Stull, 1937 | DH |

Reaction thermochemistry data

Data compiled as indicated in comments:
B - John E. Bartmess
M - Michael M. Meot-Ner (Mautner) and Sharon G. Lias
ALS - Hussein Y. Afeefy, Joel F. Liebman, and Stephen E. Stein
Individual Reactions
By formula: Cl- + C6H5Cl = (Cl- • C6H5Cl)
Quantity | Value | Units | Method | Reference | Comment |
---|---|---|---|---|---|
ΔrH° | 50.21 ± 0.42 | kJ/mol | TDAs | Sieck, 1985 | gas phase; B,M |
ΔrH° | 56.9 ± 4.2 | kJ/mol | IMRE | Larson and McMahon, 1984 | gas phase; B,B,M |
ΔrH° | 52.7 | kJ/mol | PHPMS | Paul and Kebarle, 1991 | gas phase; from Ph. D. thesis of S. Chowdhury, Entropy change calculated or estimated; M |
Quantity | Value | Units | Method | Reference | Comment |
ΔrS° | 84. | J/mol*K | N/A | Paul and Kebarle, 1991 | gas phase; from Ph. D. thesis of S. Chowdhury, Entropy change calculated or estimated; M |
ΔrS° | 69.0 | J/mol*K | PHPMS | Sieck, 1985 | gas phase; M |
ΔrS° | 93.7 | J/mol*K | N/A | Larson and McMahon, 1984 | gas phase; switching reaction(Cl-)t-C4H9OH, Entropy change calculated or estimated; French, Ikuta, et al., 1982; M |
Quantity | Value | Units | Method | Reference | Comment |
ΔrG° | 29.7 ± 0.84 | kJ/mol | TDAs | Sieck, 1985 | gas phase; B |
ΔrG° | 29. ± 4.2 | kJ/mol | IMRE | Larson and McMahon, 1984 | gas phase; B,B,M |
ΔrG° | 27.2 | kJ/mol | TDEq | French, Ikuta, et al., 1982 | gas phase; B |
Free energy of reaction
ΔrG° (kJ/mol) | T (K) | Method | Reference | Comment |
---|---|---|---|---|
28. | 300. | PHPMS | Paul and Kebarle, 1991 | gas phase; from Ph. D. thesis of S. Chowdhury, Entropy change calculated or estimated; M |
27. | 300. | PHPMS | French, Ikuta, et al., 1982 | gas phase; M |
C6H4Cl- + =
By formula: C6H4Cl- + H+ = C6H5Cl
Quantity | Value | Units | Method | Reference | Comment |
---|---|---|---|---|---|
ΔrH° | 1636. ± 7.9 | kJ/mol | Bran | Wenthold and Squires, 1995 | gas phase; B |
ΔrH° | 1633. ± 8.8 | kJ/mol | G+TS | Wenthold and Squires, 1994 | gas phase; between furan, pyridine; B |
ΔrH° | 1633. ± 8.8 | kJ/mol | G+TS | Wenthold, Paulino, et al., 1991 | gas phase; Between H2O, furan. Wenthold and Squires, 1994 indicates isomerization occuring.; B |
Quantity | Value | Units | Method | Reference | Comment |
ΔrG° | 1602. ± 8.4 | kJ/mol | H-TS | Wenthold and Squires, 1995 | gas phase; B |
ΔrG° | 1598. ± 8.4 | kJ/mol | IMRB | Wenthold and Squires, 1994 | gas phase; between furan, pyridine; B |
ΔrG° | 1598. ± 8.4 | kJ/mol | IMRB | Wenthold, Paulino, et al., 1991 | gas phase; Between H2O, furan. Wenthold and Squires, 1994 indicates isomerization occuring.; B |
C6H4Cl- + =
By formula: C6H4Cl- + H+ = C6H5Cl
Quantity | Value | Units | Method | Reference | Comment |
---|---|---|---|---|---|
ΔrH° | 1650. ± 5.4 | kJ/mol | Bran | Wenthold and Squires, 1995 | gas phase; B |
ΔrH° | 1631. ± 8.8 | kJ/mol | G+TS | Wenthold and Squires, 1994 | gas phase; between furan, pyridine; B |
ΔrH° | 1631. ± 8.8 | kJ/mol | G+TS | Wenthold, Paulino, et al., 1991 | gas phase; Between H2O, furan. Wenthold and Squires, 1994 indicates isomerization occuring.; B |
Quantity | Value | Units | Method | Reference | Comment |
ΔrG° | 1618. ± 5.9 | kJ/mol | H-TS | Wenthold and Squires, 1995 | gas phase; B |
ΔrG° | 1598. ± 8.4 | kJ/mol | IMRB | Wenthold and Squires, 1994 | gas phase; between furan, pyridine; B |
ΔrG° | 1598. ± 8.4 | kJ/mol | IMRB | Wenthold, Paulino, et al., 1991 | gas phase; Between H2O, furan. Wenthold and Squires, 1994 indicates isomerization occuring.; B |
C6H4Cl- + =
By formula: C6H4Cl- + H+ = C6H5Cl
Quantity | Value | Units | Method | Reference | Comment |
---|---|---|---|---|---|
ΔrH° | 1618. ± 8.8 | kJ/mol | G+TS | Andrade and Riveros, 1996 | gas phase; B |
ΔrH° | 1624. ± 8.4 | kJ/mol | Bran | Wenthold and Squires, 1995 | gas phase; B |
ΔrH° | 1622. ± 13. | kJ/mol | G+TS | Wenthold, Paulino, et al., 1991 | gas phase; Between PhF, furan; B |
Quantity | Value | Units | Method | Reference | Comment |
ΔrG° | 1584. ± 8.4 | kJ/mol | IMRE | Andrade and Riveros, 1996 | gas phase; B |
ΔrG° | 1590. ± 8.8 | kJ/mol | H-TS | Wenthold and Squires, 1995 | gas phase; B |
ΔrG° | 1588. ± 13. | kJ/mol | IMRB | Wenthold, Paulino, et al., 1991 | gas phase; Between PhF, furan; B |
ΔrG° | 1586. ± 21. | kJ/mol | IMRB | Bartmess and McIver Jr., 1979 | gas phase; Between H2O, MeOH; B |
By formula: Br- + C6H5Cl = (Br- • C6H5Cl)
Quantity | Value | Units | Method | Reference | Comment |
---|---|---|---|---|---|
ΔrH° | 46.4 ± 7.5 | kJ/mol | IMRE | Paul and Kebarle, 1991 | gas phase; ΔGaff measured at 303 K, corrected to 423 K, ΔSaff taken as that of PhNO2..Br-; B,M |
Quantity | Value | Units | Method | Reference | Comment |
ΔrS° | 84. | J/mol*K | N/A | Paul and Kebarle, 1991 | gas phase; Entropy change calculated or estimated; M |
Quantity | Value | Units | Method | Reference | Comment |
ΔrG° | 11. ± 4.2 | kJ/mol | IMRE | Paul and Kebarle, 1991 | gas phase; ΔGaff measured at 303 K, corrected to 423 K, ΔSaff taken as that of PhNO2..Br-; B |
Free energy of reaction
ΔrG° (kJ/mol) | T (K) | Method | Reference | Comment |
---|---|---|---|---|
11. | 423. | PHPMS | Paul and Kebarle, 1991 | gas phase; Entropy change calculated or estimated; M |
By formula: C6H7N+ + C6H5Cl = (C6H7N+ • C6H5Cl)
Bond type: Charge transfer bond (positive ion)
Quantity | Value | Units | Method | Reference | Comment |
---|---|---|---|---|---|
ΔrH° | 49.0 | kJ/mol | PHPMS | Meot-Ner (Mautner) and El-Shall, 1986 | gas phase; Entropy change calculated or estimated; M |
Quantity | Value | Units | Method | Reference | Comment |
ΔrS° | 110. | J/mol*K | N/A | Meot-Ner (Mautner) and El-Shall, 1986 | gas phase; Entropy change calculated or estimated; M |
Free energy of reaction
ΔrG° (kJ/mol) | T (K) | Method | Reference | Comment |
---|---|---|---|---|
17. | 297. | PHPMS | Meot-Ner (Mautner) and El-Shall, 1986 | gas phase; Entropy change calculated or estimated; M |
By formula: C9H12+ + C6H5Cl = (C9H12+ • C6H5Cl)
Bond type: Charge transfer bond (positive ion)
Quantity | Value | Units | Method | Reference | Comment |
---|---|---|---|---|---|
ΔrH° | 47.7 | kJ/mol | PHPMS | Meot-Ner (Mautner), Hamlet, et al., 1978 | gas phase; Entropy change calculated or estimated; M |
Quantity | Value | Units | Method | Reference | Comment |
ΔrS° | 110. | J/mol*K | N/A | Meot-Ner (Mautner), Hamlet, et al., 1978 | gas phase; Entropy change calculated or estimated; M |
Free energy of reaction
ΔrG° (kJ/mol) | T (K) | Method | Reference | Comment |
---|---|---|---|---|
12. | 300. | PHPMS | Meot-Ner (Mautner), Hamlet, et al., 1978 | gas phase; Entropy change calculated or estimated; M |
By formula: NO- + C6H5Cl = (NO- • C6H5Cl)
Quantity | Value | Units | Method | Reference | Comment |
---|---|---|---|---|---|
ΔrH° | 161. | kJ/mol | ICR | Reents and Freiser, 1981 | gas phase; switching reaction,Thermochemical ladder(NO+)C2H5OH, Entropy change calculated or estimated; Farid and McMahon, 1978; M |
By formula: C6H5Cl + C12H17Cl = C9H11Cl + C9H11Cl
Quantity | Value | Units | Method | Reference | Comment |
---|---|---|---|---|---|
ΔrH° | -0.84 ± 0.42 | kJ/mol | Eqk | Nesterova, Rozhnov, et al., 1985 | liquid phase; ALS |
By formula: C6H5Cl + C14H21Cl = C10H13Cl + C10H13Cl
Quantity | Value | Units | Method | Reference | Comment |
---|---|---|---|---|---|
ΔrH° | -0.25 ± 0.71 | kJ/mol | Eqk | Kovzel, Nesterova, et al., 1981 | liquid phase; ALS |
By formula: C9H11Cl + C6H6 = C6H5Cl + C9H12
Quantity | Value | Units | Method | Reference | Comment |
---|---|---|---|---|---|
ΔrH° | -0.59 ± 0.42 | kJ/mol | Eqk | Nesterova, Rozhnov, et al., 1985 | liquid phase; ALS |
By formula: C6H5Cl + C14H21Cl = 2C10H13Cl
Quantity | Value | Units | Method | Reference | Comment |
---|---|---|---|---|---|
ΔrH° | 0. ± 0.1 | kJ/mol | Eqk | Kovzel, Nesterova, et al., 1981 | liquid phase; ALS |
By formula: C6H6 + Cl2 = C6H5Cl + HCl
Quantity | Value | Units | Method | Reference | Comment |
---|---|---|---|---|---|
ΔrH° | -134. | kJ/mol | Cm | Kirkbride, 1956 | liquid phase; ALS |

Henry's Law data

Data compiled by: Rolf Sander
Henry's Law constant (water solution)
kH(T) = k°H exp(d(ln(kH))/d(1/T) ((1/T) - 1/(298.15 K)))
k°H = Henry's law constant for solubility in water at 298.15 K (mol/(kg*bar))
d(ln(kH))/d(1/T) = Temperature dependence constant (K)
k°H (mol/(kg*bar)) | d(ln(kH))/d(1/T) (K) | Method | Reference | Comment |
---|---|---|---|---|
0.27 | 3800. | L | N/A | |
0.26 | M | N/A | ||
0.32 | 1900. | X | N/A | |
0.22 | Q | N/A | missing citation give several references for the Henry's law constants but don't assign them to specific species. | |
0.24 | 4700. | X | N/A | |
0.26 | 2700. | X | N/A | |
0.25 | 2100. | X | N/A | |
0.30 | 3500. | X | Leighton and Calo, 1981 | |
0.29 | L | N/A | ||
0.32 | M | N/A | ||
0.29 | 4200. | X | N/A | |
0.27 | M | Mackay, Shiu, et al., 1979 | ||
0.27 | T | Mackay, Shiu, et al., 1979 | ||
0.22 | V | N/A | ||
0.29 | 4600. | M | N/A |

Gas phase ion energetics data

Data evaluated as indicated in comments:
HL - Edward P. Hunter and Sharon G. Lias
L - Sharon G. Lias
Data compiled as indicated in comments:
B - John E. Bartmess
LBLHLM - Sharon G. Lias, John E. Bartmess, Joel F. Liebman, John L. Holmes, Rhoda D. Levin, and W. Gary Mallard
LLK - Sharon G. Lias, Rhoda D. Levin, and Sherif A. Kafafi
RDSH - Henry M. Rosenstock, Keith Draxl, Bruce W. Steiner, and John T. Herron
LL - Sharon G. Lias and Joel F. Liebman
Quantity | Value | Units | Method | Reference | Comment |
---|---|---|---|---|---|
IE (evaluated) | 9.07 ± 0.02 | eV | N/A | N/A | L |
Quantity | Value | Units | Method | Reference | Comment |
Proton affinity (review) | 753.1 | kJ/mol | N/A | Hunter and Lias, 1998 | HL |
Quantity | Value | Units | Method | Reference | Comment |
Gas basicity | 724.6 | kJ/mol | N/A | Hunter and Lias, 1998 | HL |
Ionization energy determinations
Appearance energy determinations
Ion | AE (eV) | Other Products | Method | Reference | Comment |
---|---|---|---|---|---|
C4H4+ | 17.6 ± 0.1 | ? | EI | Momigny, 1959 | RDSH |
C6H4+ | 14.9 ± 0.2 | HCl | EI | Momigny, 1959 | RDSH |
C6H5+ | 11.81 | Cl | DER | Ripoche, Dimicoli, et al., 1991 | LL |
C6H5+ | 12.88 ± 0.05 | Cl | EI | Burgers and Holmes, 1984 | LBLHLM |
C6H5+ | 13.1 ± 0.1 | Cl | EI | Burgers and Holmes, 1984 | LBLHLM |
C6H5+ | 12.25 ± 0.04 | Cl | PIPECO | Rosenstock, Stockbauer, et al., 1980 | LLK |
C6H5+ | 12.47 ± 0.06 | Cl | PI | Rosenstock, Stockbauer, et al., 1979 | LLK |
C6H5+ | 13.06 | Cl | PIPECO | Baer, Tsai, et al., 1976 | LLK |
C6H5+ | 12.81 | Cl | EI | Johnstone and Mellon, 1972 | LLK |
C6H5+ | 12.55 ± 0.07 | Cl | PI | Sergeev, Akopyan, et al., 1970 | RDSH |
C6H5+ | 13.2 ± 0.1 | Cl | EI | Majer and Patrick, 1962 | RDSH |
De-protonation reactions
C6H4Cl- + =
By formula: C6H4Cl- + H+ = C6H5Cl
Quantity | Value | Units | Method | Reference | Comment |
---|---|---|---|---|---|
ΔrH° | 1636. ± 7.9 | kJ/mol | Bran | Wenthold and Squires, 1995 | gas phase; B |
ΔrH° | 1633. ± 8.8 | kJ/mol | G+TS | Wenthold and Squires, 1994 | gas phase; between furan, pyridine; B |
ΔrH° | 1633. ± 8.8 | kJ/mol | G+TS | Wenthold, Paulino, et al., 1991 | gas phase; Between H2O, furan. Wenthold and Squires, 1994 indicates isomerization occuring.; B |
Quantity | Value | Units | Method | Reference | Comment |
ΔrG° | 1602. ± 8.4 | kJ/mol | H-TS | Wenthold and Squires, 1995 | gas phase; B |
ΔrG° | 1598. ± 8.4 | kJ/mol | IMRB | Wenthold and Squires, 1994 | gas phase; between furan, pyridine; B |
ΔrG° | 1598. ± 8.4 | kJ/mol | IMRB | Wenthold, Paulino, et al., 1991 | gas phase; Between H2O, furan. Wenthold and Squires, 1994 indicates isomerization occuring.; B |
C6H4Cl- + =
By formula: C6H4Cl- + H+ = C6H5Cl
Quantity | Value | Units | Method | Reference | Comment |
---|---|---|---|---|---|
ΔrH° | 1650. ± 5.4 | kJ/mol | Bran | Wenthold and Squires, 1995 | gas phase; B |
ΔrH° | 1631. ± 8.8 | kJ/mol | G+TS | Wenthold and Squires, 1994 | gas phase; between furan, pyridine; B |
ΔrH° | 1631. ± 8.8 | kJ/mol | G+TS | Wenthold, Paulino, et al., 1991 | gas phase; Between H2O, furan. Wenthold and Squires, 1994 indicates isomerization occuring.; B |
Quantity | Value | Units | Method | Reference | Comment |
ΔrG° | 1618. ± 5.9 | kJ/mol | H-TS | Wenthold and Squires, 1995 | gas phase; B |
ΔrG° | 1598. ± 8.4 | kJ/mol | IMRB | Wenthold and Squires, 1994 | gas phase; between furan, pyridine; B |
ΔrG° | 1598. ± 8.4 | kJ/mol | IMRB | Wenthold, Paulino, et al., 1991 | gas phase; Between H2O, furan. Wenthold and Squires, 1994 indicates isomerization occuring.; B |
C6H4Cl- + =
By formula: C6H4Cl- + H+ = C6H5Cl
Quantity | Value | Units | Method | Reference | Comment |
---|---|---|---|---|---|
ΔrH° | 1618. ± 8.8 | kJ/mol | G+TS | Andrade and Riveros, 1996 | gas phase; B |
ΔrH° | 1624. ± 8.4 | kJ/mol | Bran | Wenthold and Squires, 1995 | gas phase; B |
ΔrH° | 1622. ± 13. | kJ/mol | G+TS | Wenthold, Paulino, et al., 1991 | gas phase; Between PhF, furan; B |
Quantity | Value | Units | Method | Reference | Comment |
ΔrG° | 1584. ± 8.4 | kJ/mol | IMRE | Andrade and Riveros, 1996 | gas phase; B |
ΔrG° | 1590. ± 8.8 | kJ/mol | H-TS | Wenthold and Squires, 1995 | gas phase; B |
ΔrG° | 1588. ± 13. | kJ/mol | IMRB | Wenthold, Paulino, et al., 1991 | gas phase; Between PhF, furan; B |
ΔrG° | 1586. ± 21. | kJ/mol | IMRB | Bartmess and McIver Jr., 1979 | gas phase; Between H2O, MeOH; B |

Ion clustering data

Data compiled as indicated in comments:
B - John E. Bartmess
M - Michael M. Meot-Ner (Mautner) and Sharon G. Lias
Clustering reactions
By formula: Br- + C6H5Cl = (Br- • C6H5Cl)
Quantity | Value | Units | Method | Reference | Comment |
---|---|---|---|---|---|
ΔrH° | 46.4 ± 7.5 | kJ/mol | IMRE | Paul and Kebarle, 1991 | gas phase; ΔGaff measured at 303 K, corrected to 423 K, ΔSaff taken as that of PhNO2..Br-; B,M |
Quantity | Value | Units | Method | Reference | Comment |
ΔrS° | 84. | J/mol*K | N/A | Paul and Kebarle, 1991 | gas phase; Entropy change calculated or estimated; M |
Quantity | Value | Units | Method | Reference | Comment |
ΔrG° | 11. ± 4.2 | kJ/mol | IMRE | Paul and Kebarle, 1991 | gas phase; ΔGaff measured at 303 K, corrected to 423 K, ΔSaff taken as that of PhNO2..Br-; B |
Free energy of reaction
ΔrG° (kJ/mol) | T (K) | Method | Reference | Comment |
---|---|---|---|---|
11. | 423. | PHPMS | Paul and Kebarle, 1991 | gas phase; Entropy change calculated or estimated; M |
By formula: C6H7N+ + C6H5Cl = (C6H7N+ • C6H5Cl)
Bond type: Charge transfer bond (positive ion)
Quantity | Value | Units | Method | Reference | Comment |
---|---|---|---|---|---|
ΔrH° | 49.0 | kJ/mol | PHPMS | Meot-Ner (Mautner) and El-Shall, 1986 | gas phase; Entropy change calculated or estimated; M |
Quantity | Value | Units | Method | Reference | Comment |
ΔrS° | 110. | J/mol*K | N/A | Meot-Ner (Mautner) and El-Shall, 1986 | gas phase; Entropy change calculated or estimated; M |
Free energy of reaction
ΔrG° (kJ/mol) | T (K) | Method | Reference | Comment |
---|---|---|---|---|
17. | 297. | PHPMS | Meot-Ner (Mautner) and El-Shall, 1986 | gas phase; Entropy change calculated or estimated; M |
By formula: C9H12+ + C6H5Cl = (C9H12+ • C6H5Cl)
Bond type: Charge transfer bond (positive ion)
Quantity | Value | Units | Method | Reference | Comment |
---|---|---|---|---|---|
ΔrH° | 47.7 | kJ/mol | PHPMS | Meot-Ner (Mautner), Hamlet, et al., 1978 | gas phase; Entropy change calculated or estimated; M |
Quantity | Value | Units | Method | Reference | Comment |
ΔrS° | 110. | J/mol*K | N/A | Meot-Ner (Mautner), Hamlet, et al., 1978 | gas phase; Entropy change calculated or estimated; M |
Free energy of reaction
ΔrG° (kJ/mol) | T (K) | Method | Reference | Comment |
---|---|---|---|---|
12. | 300. | PHPMS | Meot-Ner (Mautner), Hamlet, et al., 1978 | gas phase; Entropy change calculated or estimated; M |
By formula: Cl- + C6H5Cl = (Cl- • C6H5Cl)
Quantity | Value | Units | Method | Reference | Comment |
---|---|---|---|---|---|
ΔrH° | 50.21 ± 0.42 | kJ/mol | TDAs | Sieck, 1985 | gas phase; B,M |
ΔrH° | 56.9 ± 4.2 | kJ/mol | IMRE | Larson and McMahon, 1984 | gas phase; B,B,M |
ΔrH° | 52.7 | kJ/mol | PHPMS | Paul and Kebarle, 1991 | gas phase; from Ph. D. thesis of S. Chowdhury, Entropy change calculated or estimated; M |
Quantity | Value | Units | Method | Reference | Comment |
ΔrS° | 84. | J/mol*K | N/A | Paul and Kebarle, 1991 | gas phase; from Ph. D. thesis of S. Chowdhury, Entropy change calculated or estimated; M |
ΔrS° | 69.0 | J/mol*K | PHPMS | Sieck, 1985 | gas phase; M |
ΔrS° | 93.7 | J/mol*K | N/A | Larson and McMahon, 1984 | gas phase; switching reaction(Cl-)t-C4H9OH, Entropy change calculated or estimated; French, Ikuta, et al., 1982; M |
Quantity | Value | Units | Method | Reference | Comment |
ΔrG° | 29.7 ± 0.84 | kJ/mol | TDAs | Sieck, 1985 | gas phase; B |
ΔrG° | 29. ± 4.2 | kJ/mol | IMRE | Larson and McMahon, 1984 | gas phase; B,B,M |
ΔrG° | 27.2 | kJ/mol | TDEq | French, Ikuta, et al., 1982 | gas phase; B |
Free energy of reaction
ΔrG° (kJ/mol) | T (K) | Method | Reference | Comment |
---|---|---|---|---|
28. | 300. | PHPMS | Paul and Kebarle, 1991 | gas phase; from Ph. D. thesis of S. Chowdhury, Entropy change calculated or estimated; M |
27. | 300. | PHPMS | French, Ikuta, et al., 1982 | gas phase; M |
By formula: NO- + C6H5Cl = (NO- • C6H5Cl)
Quantity | Value | Units | Method | Reference | Comment |
---|---|---|---|---|---|
ΔrH° | 161. | kJ/mol | ICR | Reents and Freiser, 1981 | gas phase; switching reaction,Thermochemical ladder(NO+)C2H5OH, Entropy change calculated or estimated; Farid and McMahon, 1978; M |

Kovats' RI, non-polar column, isothermal

Column type | Active phase | Temperature (C) | I | Reference | Comment |
---|---|---|---|---|---|
Capillary | SE-30 | 160. | 859.3 | Santiuste, Harangi, et al., 2003 | |
Capillary | HP-5 | 120. | 859.0 | Santiuste, Harangi, et al., 2003 | |
Capillary | HP-5 | 120. | 853.8 | Santiuste J.M. and Takacs J.M., 2003 | 60. m/0.25 mm/0.25 μm, N2 |
Capillary | HP-5 | 140. | 877.5 | Santiuste J.M. and Takacs J.M., 2003 | 60. m/0.25 mm/0.25 μm, N2 |
Packed | C78, Branched paraffin | 130. | 865.0 | Dallos, Sisak, et al., 2000 | He; Column length: 3.3 m |
Capillary | HP-101 | 60. | 830.32 | Garay, 2000 | 50. m/0.2 mm/0.2 μm, H2 |
Capillary | SPB-1 | 140. | 834. | Vezzani, Bertocchi, et al., 1998 | 30. m/0.32 mm/0.25 μm |
Capillary | DB-5 | 110. | 866.47 | Gerbino, Garbarino, et al., 1996 | 30. m/0.53 mm/1.5 μm, N2 |
Capillary | DB-5 | 70. | 850.16 | Gerbino, Garbarino, et al., 1996 | 30. m/0.53 mm/1.5 μm, N2 |
Capillary | DB-5 | 90. | 857.29 | Gerbino, Garbarino, et al., 1996 | 30. m/0.53 mm/1.5 μm, N2 |
Packed | OV-101 | 100. | 842. | Righezza, Hassani, et al., 1996 | N2, Chromosorb G HP; Column length: 5. m |
Packed | OV-101 | 110. | 850. | Righezza, Hassani, et al., 1996 | N2, Chromosorb G HP; Column length: 5. m |
Packed | OV-101 | 80. | 836. | Righezza, Hassani, et al., 1996 | N2, Chromosorb G HP; Column length: 5. m |
Packed | OV-101 | 90. | 838.8 | Righezza, Hassani, et al., 1996 | N2, Chromosorb G HP; Column length: 5. m |
Capillary | OV-1 | 50. | 827. | Villalobos, 1995 | 30. m/0.32 mm/0.96 μm |
Capillary | SE-30 | 0. | 815. | Spieksma, Luijk, et al., 1994 | |
Packed | OV-101 | 120. | 850.3 | Hassani and Meklati, 1992 | N2, Chromosorb G HP; Column length: 5. m |
Packed | C78, Branched paraffin | 130. | 864.5 | Reddy, Dutoit, et al., 1992 | Chromosorb G HP; Column length: 3.3 m |
Packed | Apolane | 130. | 866. | Dutoit, 1991 | Column length: 3.7 m |
Capillary | SE-30 | 160. | 832. | Evans and Haken, 1989 | Column length: 25. m; Column diameter: 0.32 mm |
Capillary | SE-30 | 160. | 840. | Tarjan, Nyiredy, et al., 1989 | |
Packed | Apolane | 150. | 880. | Evans and Haken, 1987 | He, Chromosorb G AW DCMS; Column length: 3.7 m |
Packed | Apolane | 150. | 880. | Haken and Vernon, 1986 | Chromosorb G AW DCMS; Column length: 3.7 m |
Packed | SE-30 | 180. | 875. | Oszczapowicz, Osek, et al., 1985 | N2, Chromosorb A AW; Column length: 3. m |
Packed | SE-30 | 180. | 875. | Oszczapowicz, Osek, et al., 1984 | N2, Chromosorb W AW; Column length: 3. m |
Packed | SE-30 | 150. | 860. | Tiess, 1984 | Ar, Gas Chrom Q (80-100 mesh); Column length: 3. m |
Capillary | OV-3 | 30. | 849.6 | Chien, Furio, et al., 1983 | |
Capillary | OV-3 | 40. | 852.0 | Chien, Furio, et al., 1983 | |
Capillary | OV-3 | 50. | 854.6 | Chien, Furio, et al., 1983 | |
Capillary | OV-3 | 60. | 857.4 | Chien, Furio, et al., 1983 | |
Capillary | OV-3 | 70. | 860.3 | Chien, Furio, et al., 1983 | |
Capillary | OV-3 | 80. | 863.3 | Chien, Furio, et al., 1983 | |
Capillary | SE-30 | 120. | 832. | Haken and Korhonene, 1983 | N2; Column length: 25. m; Column diameter: 0.22 mm |
Capillary | SE-30 | 140. | 836. | Haken and Korhonene, 1983 | N2; Column length: 25. m; Column diameter: 0.22 mm |
Capillary | SE-30 | 160. | 840. | Haken and Korhonene, 1983 | N2; Column length: 25. m; Column diameter: 0.22 mm |
Packed | SE-30 | 100. | 844. | Winskowski, 1983 | Gaschrom Q; Column length: 2. m |
Packed | Apiezon L | 70. | 852. | Jaworski, 1982 | Column length: 1.8 m |
Packed | Squalane | 100. | 869. | Evans and Newton, 1976 | N2, Chromosorb G; Column length: 2. m |
Packed | Squalane | 100. | 870. | Evans and Newton, 1976 | N2, Chromosorb G; Column length: 2. m |
Packed | Squalane | 100. | 870. | Evans and Newton, 1976 | N2, Chromosorb G; Column length: 2. m |
Packed | Apolane | 70. | 838.4 | Riedo, Fritz, et al., 1976 | He, Chromosorb; Column length: 2.4 m |
Capillary | Squalane | 60. | 814. | Ryba, 1976 | Column length: 50. m; Column diameter: 0.25 mm |
Capillary | Squalane | 60. | 818. | Ryba, 1976 | Column length: 50. m; Column diameter: 0.25 mm |
Packed | Apiezon L | 100. | 871. | Brown, Chapman, et al., 1968 | N2, DCMS-treated Chromosorb W; Column length: 2.3 m |
Packed | Squalane | 100. | 826.3 | Evans and Smith, 1967 | H2/N2=3/1, Celite; Column length: 2. m |
Packed | Squalane | 100. | 830. | Adlard, Evans, et al., 1965 | Ar, Celite; Column length: 1.2 m |
Packed | Squalane | 65. | 817. | Adlard, Evans, et al., 1965 | Ar, Celite; Column length: 1.2 m |
Packed | Squalane | 78. | 821. | Adlard, Evans, et al., 1965 | Ar, Celite; Column length: 1.2 m |
Packed | Squalane | 100. | 827. | Adlard, Evans, et al., 1965 | Ar, Celite; Column length: 1.5 m |
Packed | Squalane | 65. | 814. | Adlard, Evans, et al., 1965 | Ar, Celite; Column length: 1.5 m |
Packed | Squalane | 78. | 820. | Adlard, Evans, et al., 1965 | Ar, Celite; Column length: 1.5 m |
Packed | Squalane | 100. | 826. | Adlard, Evans, et al., 1965 | Mixture, Celite; Column length: 1.5 m |
Packed | Squalane | 65. | 815. | Adlard, Evans, et al., 1965 | Mixture, Celite; Column length: 1.5 m |
Packed | Squalane | 78. | 819. | Adlard, Evans, et al., 1965 | Mixture, Celite; Column length: 1.5 m |
Packed | Squalane | 100. | 833. | Adlard, Evans, et al., 1965 | He, Celite; Column length: 0.9 m |
Packed | Squalane | 65. | 822. | Adlard, Evans, et al., 1965 | He, Celite; Column length: 0.9 m |
Packed | Squalane | 78. | 826. | Adlard, Evans, et al., 1965 | He, Celite; Column length: 0.9 m |
Packed | Squalane | 100. | 855. | Adlard, Evans, et al., 1965 | N2, Celite; Column length: 0.9 m |
Packed | Squalane | 65. | 843. | Adlard, Evans, et al., 1965 | N2, Celite; Column length: 0.9 m |
Packed | Squalane | 78. | 849. | Adlard, Evans, et al., 1965 | N2, Celite; Column length: 0.9 m |
Packed | Squalane | 100. | 827. | Adlard, Evans, et al., 1965 | He, Celite; Column length: 1. m |
Packed | Squalane | 65. | 815. | Adlard, Evans, et al., 1965 | He, Celite; Column length: 1. m |
Packed | Squalane | 78. | 819. | Adlard, Evans, et al., 1965 | He, Celite; Column length: 1. m |
Packed | Squalane | 100. | 834. | Adlard, Evans, et al., 1965 | N2, Sterchamol; Column length: 4. m |
Packed | Squalane | 65. | 819. | Adlard, Evans, et al., 1965 | N2, Sterchamol; Column length: 4. m |
Packed | Squalane | 78. | 825. | Adlard, Evans, et al., 1965 | N2, Sterchamol; Column length: 4. m |
Packed | Squalane | 100. | 822. | Adlard, Evans, et al., 1965 | H2, Celite; Column length: 0.9 m |
Packed | Squalane | 65. | 811. | Adlard, Evans, et al., 1965 | H2, Celite; Column length: 0.9 m |
Packed | Squalane | 78. | 815. | Adlard, Evans, et al., 1965 | H2, Celite; Column length: 0.9 m |
Packed | Squalane | 100. | 830. | Adlard, Evans, et al., 1965 | |
Packed | Squalane | 65. | 817. | Adlard, Evans, et al., 1965 | |
Packed | Squalane | 78. | 822. | Adlard, Evans, et al., 1965 | |
Packed | Apiezon L | 130. | 885. | Wehrli and Kováts, 1959 | Celite; Column length: 2.25 m |

Kovats' RI, non-polar column, temperature ramp

Column type | Active phase | I | Reference | Comment |
---|---|---|---|---|
Capillary | CBP-1 | 833. | Shimadzu, 2003 | 25. m/0.2 mm/0.25 μm, He, 50. C @ 5. min, 4. K/min; Tend: 200. C |

Kovats' RI, non-polar column, custom temperature program

Column type | Active phase | I | Reference | Comment |
---|---|---|---|---|
Packed | Apiezon M | 877.9 | Jalali-Heravi and Garkani-Nejad, 1993 | Chromosorb W; Column length: 2. m; Program: not specified |

Kovats' RI, polar column, isothermal

Column type | Active phase | Temperature (C) | I | Reference | Comment |
---|---|---|---|---|---|
Capillary | ZB-Wax | 120. | 1257.1 | Pérez-Parajón, Santiuste, et al., 2004 | 60. m/0.25 mm/0.25 μm |
Capillary | ZB-Wax | 140. | 1279.1 | Pérez-Parajón, Santiuste, et al., 2004 | 60. m/0.25 mm/0.25 μm |
Capillary | Carbowax 20M | 50. | 1224. | Villalobos, 1995 | 30. m/0.32 mm/0.54 μm, He |
Capillary | Carbowax 20M | 160. | 1257. | Evans and Haken, 1989 | Column length: 22. m; Column diameter: 0.3 mm |
Packed | Carbowax 20M | 150. | 1231. | Haken and Vernon, 1986 | Chromosorb G AW DCMS; Column length: 3.7 m; Column diameter: 6.4 mm |
Capillary | Carbowax 20M | 140. | 1257. | Haken and Korhonene, 1983 | N2; Column length: 22. m; Column diameter: 0.3 mm |
Capillary | Carbowax 20M | 160. | 1270. | Haken and Korhonene, 1983 | N2; Column length: 22. m; Column diameter: 0.3 mm |
Packed | Carbowax 20M | 200. | 1270. | Vernon and Suratman, 1983 | He, Silanized white support; Column length: 2. m |
Packed | Carbowax 20M | 75. | 1219. | Goebel, 1982 | N2, Kieselgur (60-100 mesh); Column length: 2. m |

Kovats' RI, polar column, temperature ramp

Column type | Active phase | I | Reference | Comment |
---|---|---|---|---|
Capillary | CBP-20 | 1213. | Shimadzu, 2003 | 25. m/0.2 mm/0.25 μm, He, 50. C @ 5. min, 4. K/min; Tend: 200. C |

Van Den Dool and Kratz RI, non-polar column, temperature ramp

Column type | Active phase | I | Reference | Comment |
---|---|---|---|---|
Capillary | Petrocol DH | 831.2 | Censullo, Jones, et al., 2003 | 50. m/0.25 mm/0.5 μm, He, 35. C @ 10. min, 3. K/min, 200. C @ 10. min |
Capillary | DB-1 | 821.2 | Sun and Stremple, 2003 | 30. m/0.25 mm/0.25 μm, He, 3. K/min; Tstart: 40. C; Tend: 325. C |
Capillary | DB-5 | 852.4 | Xu, van Stee, et al., 2003 | 30. m/0.25 mm/1. μm, He, 2.5 K/min; Tstart: 50. C; Tend: 200. C |
Capillary | OV-1 | 826.5 | Gautzsch and Zinn, 1996 | 8. K/min; Tstart: 35. C; Tend: 300. C |
Capillary | DB-5 | 836.42 | Gerbino, Garbarino, et al., 1996 | 30. m/0.53 mm/1.5 μm, N2, 2. K/min; Tstart: 50. C |
Capillary | DB-5 | 837.68 | Gerbino, Garbarino, et al., 1996 | 30. m/0.53 mm/1.5 μm, N2, 2. K/min; Tstart: 50. C |
Capillary | DB-5 | 840.15 | Gerbino, Garbarino, et al., 1996 | 30. m/0.53 mm/1.5 μm, N2, 2. K/min; Tstart: 50. C |
Capillary | DB-1 | 825.3 | Helmig, Pollock, et al., 1996 | 30. m/0.25 mm/1. μm, 6. K/min; Tstart: -50. C; Tend: 180. C |
Capillary | DB-1 | 833. | Gerbino and Castello, 1995 | 30. m/0.235 mm/0.25 μm, N2, 50. C @ 0. min, 10. K/min |
Capillary | DB-1 | 830. | Gerbino and Castello, 1995 | 30. m/0.235 mm/0.25 μm, N2, 50. C @ 0. min, 5. K/min |
Capillary | Petrocol DH | 825. | White, Hackett, et al., 1992 | 100. m/0.25 mm/0.5 μm, He, 1. K/min; Tstart: 30. C; Tend: 220. C |
Capillary | SE-54 | 852. | Weber, 1986 | 25. m/0.31 mm/0.17 μm, H2, 2. K/min; Tstart: 35. C |
Packed | SE-30 | 839. | Buchman, Cao, et al., 1984 | He, Chromosorb AW, 40. C @ 10. min, 10. K/min, 210. C @ 30. min; Column length: 3.05 m |

Van Den Dool and Kratz RI, non-polar column, custom temperature program

Column type | Active phase | I | Reference | Comment |
---|---|---|---|---|
Packed | SE-30 | 839. | Peng, Ding, et al., 1988 | Supelcoport; Chromosorb; Column length: 3.05 m; Program: 40C(5min) => 10C/min => 200C or 250C (60min) |

Van Den Dool and Kratz RI, polar column, temperature ramp

Column type | Active phase | I | Reference | Comment |
---|---|---|---|---|
Capillary | DB-Wax | 1243.90 | Gerbino and Castello, 1995 | 30. m/0.235 mm/0.5 μm, N2, 10. K/min; Tstart: 100. C |
Capillary | DB-Wax | 1240.38 | Gerbino and Castello, 1995 | 30. m/0.235 mm/0.5 μm, N2, 5. K/min; Tstart: 100. C |
Capillary | DB-Wax | 1226.05 | Gerbino and Castello, 1995 | 30. m/0.235 mm/0.5 μm, N2, 10. K/min; Tstart: 50. C |
Capillary | DB-Wax | 1220.51 | Gerbino and Castello, 1995 | 30. m/0.235 mm/0.5 μm, N2, 5. K/min; Tstart: 50. C |
Packed | Carbowax 20M | 1241. | Buchman, Cao, et al., 1984 | He, Supelcoport, 40. C @ 10. min, 10. K/min, 210. C @ 30. min; Column length: 3.05 m |

Normal alkane RI, non-polar column, isothermal

Column type | Active phase | Temperature (C) | I | Reference | Comment |
---|---|---|---|---|---|
Capillary | Polydimethyl siloxane | 105. | 844. | Tello, Lebron-Aguilar, et al., 2009 | |
Capillary | Polydimethyl siloxane | 75. | 834. | Tello, Lebron-Aguilar, et al., 2009 | |
Capillary | Polydimethyl siloxane | 90. | 839. | Tello, Lebron-Aguilar, et al., 2009 | |
Capillary | Methyl Silicone | 100. | 842. | Lebrón-Aguilar, Quintanilla-López, et al., 2007 | |
Capillary | Methyl Silicone | 120. | 849. | Lebrón-Aguilar, Quintanilla-López, et al., 2007 | |
Capillary | Methyl Silicone | 140. | 856. | Lebrón-Aguilar, Quintanilla-López, et al., 2007 | |
Capillary | Methyl Silicone | 80. | 835. | Lebrón-Aguilar, Quintanilla-López, et al., 2007 | |
Capillary | DB-1 | 60. | 828. | Shimadzu, 2003, 2 | 60. m/0.32 mm/1. μm, He |
Capillary | E-301 | 100. | 850. | Bermejo, Moinelo, et al., 1980 | N2; Column length: 50. m; Column diameter: 0.25 mm |
Capillary | Squalane | 100. | 833. | Bermejo, Moinelo, et al., 1980 | N2; Column length: 50. m; Column diameter: 0.25 mm |
Packed | DC-400 | 150. | 880. | Anderson, 1968 | Helium, Gas-Pak (60-80 mesh); Column length: 3.0 m |

Normal alkane RI, non-polar column, temperature ramp

Column type | Active phase | I | Reference | Comment |
---|---|---|---|---|
Capillary | Ultra-ALLOY-5 | 850. | Tsuge, Ohtan, et al., 2011 | 30. m/0.25 mm/0.25 μm, 40. C @ 2. min, 20. K/min, 320. C @ 13. min |
Capillary | HP-5 | 844. | Zenkevich, Moeder, et al., 2004 | 30. m/0.25 mm/0.25 μm, Helium, 50. C @ 3. min, 3. K/min, 280. C @ 20. min |
Capillary | BP-1 | 837. | Health Safety Executive, 2000 | 50. m/0.22 mm/0.75 μm, He, 5. K/min; Tstart: 50. C; Tend: 200. C |
Capillary | HP-5 | 835. | Jung, Wichmann, et al., 1999 | 25. m/0.20 mm/0.33 μm, 50. C @ 3. min, 5. K/min; Tend: 180. C |
Capillary | SE-54 | 864. | Huang, Liang, et al., 1996 | 36. m/0.25 mm/0.25 μm, 5. K/min; Tstart: 35. C; Tend: 240. C |
Capillary | OV-101 | 841. | Messadi and Ali-Mokhnache, 1993 | 2. K/min; Column length: 25. m; Column diameter: 0.20 mm; Tstart: 80. C |
Capillary | OV-101 | 842. | Messadi and Ali-Mokhnache, 1993 | 2. K/min; Column length: 25. m; Column diameter: 0.20 mm; Tstart: 80. C |
Capillary | OV-101 | 846. | Messadi and Ali-Mokhnache, 1993 | 2. K/min; Column length: 25. m; Column diameter: 0.20 mm; Tstart: 80. C |
Capillary | OV-101 | 850. | Messadi and Ali-Mokhnache, 1993 | 2. K/min; Column length: 25. m; Column diameter: 0.20 mm; Tstart: 80. C |
Capillary | OV-101 | 834. | Zenkevich and Tsibulskaya, 1989 | Helium, 75. C @ 0. min, 6. K/min, 220. C @ 0. min; Column length: 54. m; Column diameter: 0.26 mm |
Capillary | OV-101 | 839. | Zenkevich and Tsibulskaya, 1989 | Helium, 75. C @ 0. min, 6. K/min, 220. C @ 0. min; Column length: 54. m; Column diameter: 0.26 mm |

Normal alkane RI, non-polar column, custom temperature program

Column type | Active phase | I | Reference | Comment |
---|---|---|---|---|
Capillary | Polydimethyl siloxane with 5 % Ph groups | 850. | Robinson, Adams, et al., 2012 | Program: not specified |
Capillary | Polydimethyl siloxane with 5 % Ph groups | 852. | Robinson, Adams, et al., 2012 | Program: not specified |
Capillary | OV-101 | 850. | Ebrahimi and Hadjmohammadi, 2006 | Program: not specified |
Capillary | Polydimethyl siloxanes | 839. | Zenkevich, Eliseenkov, et al., 2006 | Program: not specified |
Capillary | Methyl Silicone | 855. | N/A | Program: not specified |
Capillary | SPB-1 | 844. | Flanagan, Streete, et al., 1997 | 60. m/0.53 mm/5. μm, He; Program: 40C(6min) => 5C/min => 80C => 10C/min => 200C |
Capillary | Polydimethyl siloxanes | 839. | Zenkevich and Chupalov, 1996 | Program: not specified |
Capillary | DB-5 | 880. | Sorimachi, Tanabe, et al., 1995 | He; Column length: 30. m; Program: not specified |
Capillary | DB-1 | 824. | Ciccioli, Cecinato, et al., 1994 | 60. m/0.32 mm/0.25 μm; Program: not specified |
Capillary | SPB-1 | 829. | Vezzani, Moretti, et al., 1994 | Column length: 30. m; Column diameter: 0.32 mm; Program: not specified |
Capillary | SPB-1 | 844. | Strete, Ruprah, et al., 1992 | 60. m/0.53 mm/5.0 μm, Helium; Program: 40 0C (6 min) 5 0C/min -> 80 0C 10 0C/min -> 200 0C |
Capillary | SPB-1 | 860. | Strete, Ruprah, et al., 1992 | 60. m/0.53 mm/5.0 μm, Helium; Program: not specified |
Capillary | CP Sil 8 CB | 852. | Weller and Wolf, 1989 | 40. m/0.25 mm/0.25 μm, He; Program: 30 0C (1 min) 15 0C/min -> 45 0C 3 0C/min -> 120 0C |
Capillary | OV-101 | 836. | Zenkevich and Malamakhov, 1987 | He; Column length: 50. m; Column diameter: 0.24 mm; Program: not specified |
Capillary | OV-1 | 827. | Waggott and Davies, 1984 | Hydrogen; Column length: 50. m; Column diameter: 0.32 mm; Program: not specified |
Capillary | OV-1, SE-30, Methyl silicone, SP-2100, OV-101, DB-1, etc. | 820. | Waggott and Davies, 1984 | Hydrogen; Column length: 50. m; Column diameter: 0.32 mm; Program: not specified |
Capillary | OV-1, SE-30, Methyl silicone, SP-2100, OV-101, DB-1, etc. | 839. | Waggott and Davies, 1984 | Hydrogen; Column length: 50. m; Column diameter: 0.32 mm; Program: not specified |
Capillary | OV-1, SE-30, Methyl silicone, SP-2100, OV-101, DB-1, etc. | 844. | Waggott and Davies, 1984 | Hydrogen; Column length: 50. m; Column diameter: 0.32 mm; Program: not specified |
Capillary | OV-1 | 860. | Ramsey and Flanagan, 1982 | Program: not specified |

Normal alkane RI, polar column, isothermal

Column type | Active phase | Temperature (C) | I | Reference | Comment |
---|---|---|---|---|---|
Capillary | DB-Wax | 60. | 1234. | Shimadzu, 2003, 2 | 50. m/0.32 mm/1. μm, He |
Packed | PEG | 100. | 1202. | Dowling, Evans, et al., 1990 | Phasesep W (10 %) |
Packed | PEG | 100. | 1233. | Dowling, Evans, et al., 1990 | Phasesep W (10 %) |

Normal alkane RI, polar column, temperature ramp

Column type | Active phase | I | Reference | Comment |
---|---|---|---|---|
Capillary | DB-Wax | 1238. | Shimadzu, 2012 | 30. m/0.32 mm/0.50 μm, Helium, 4. K/min; Tstart: 40. C; Tend: 260. C |
Capillary | DB-Wax | 1238. | Shimadzu Corporation, 2003 | 30. m/0.32 mm/0.5 μm, He, 4. K/min; Tstart: 40. C; Tend: 260. C |

Normal alkane RI, polar column, custom temperature program

Column type | Active phase | I | Reference | Comment |
---|---|---|---|---|
Capillary | DB-Wax | 1209. | le Pape, Grua-Priol, et al., 2004 | 30. m/0.32 mm/0.5 μm, He; Program: 40C => 1C/min => 57C => 15C/min => 230C (5min) |
Capillary | Superox 0.6; Carbowax 20M | 1188. | Waggott and Davies, 1984 | Hydrogen; Column length: 50. m; Column diameter: 0.32 mm; Program: not specified |
Capillary | Superox 0.6; Carbowax 20M | 1205. | Waggott and Davies, 1984 | Hydrogen; Column length: 50. m; Column diameter: 0.32 mm; Program: not specified |
Capillary | Carbowax 400, Carbowax 20M, Carbowax 1540, Carbowax 4000, Superox 06, PEG 20M, etc. | 1241. | Waggott and Davies, 1984 | Hydrogen; Column length: 50. m; Column diameter: 0.32 mm; Program: not specified |
Capillary | Carbowax 20M | 1200. | Ramsey and Flanagan, 1982 | Program: not specified |

References

Platonov and Simulin, 1985
Platonov, V.A.; Simulin, Yu.N.,
Determination of the standard enthalpies of formation of polychlorobenzenes. III. The standard enthalpies of formation of mono-1,2,4- and 1,3,5-tri-, and 1,2,3,4- and 1,2,3,5-tetrachlorobenzenes,
Russ. J. Phys. Chem. (Engl. Transl.), 1985, 59, 179-181. [all data]
Kolesov, Tomareva, et al., 1967
Kolesov, V.P.; Tomareva, E.M.; Skuratov, S.M.; Alekhin, S.P.,
Calorimeter having a rotating bomb for determining heats of combustion of chlorinated organic compounds,
Russ. J. Phys. Chem. (Engl. Transl.), 1967, 41, 817-820. [all data]
Cox and Pilcher, 1970
Cox, J.D.; Pilcher, G.,
Thermochemistry of Organic and Organometallic Compounds, Academic Press, New York, 1970, 1-636. [all data]
Hubbard, Knowlton, et al., 1954
Hubbard, W.N.; Knowlton, J.W.; Huffman, H.M.,
Combustion calorimetry of organic chlorine compounds. Heats of combustion of chlorobenzene, the dichlorobenzenes and o- and p-chloroethylbenzene,
J. Phys. Chem., 1954, 58, 396. [all data]
Smith, Bjellerup, et al., 1953
Smith, L.; Bjellerup, L.; Krook, S.; Westermark, H.,
Heats of combustion of organic chloro compounds determined by the "quartz wool" method,
Acta Chem. Scand., 1953, 7, 65. [all data]
Stull, 1937
Stull, D.R.,
A semi-micro calorimeter for measuring heat capacities at low temperatures,
J. Am. Chem. Soc., 1937, 59, 2726-2733. [all data]
Shehatta, 1993
Shehatta, I.,
Heat capacity at constant pressure of some halogen compounds,
Thermochim. Acta, 1993, 213, 1-10. [all data]
Perez-Casas, Aicart, et al., 1988
Perez-Casas, S.; Aicart, E.; Trojo, L.M.; Costas, M.,
Excess heat capacity. Chlorobenzene-2,2,4,4,6,8,8-heptamethylnonane, Int. Data Ser.,
Sel. Data Mixtures, 1988, (2)A, 123. [all data]
Reddy, 1986
Reddy, K.S.,
Isentropic compressibilities of binary liquid mixtures at 303.15 and 313.15 K,
J. Chem. Eng. Data, 1986, 31, 238-240. [all data]
Fortier and Benson, 1977
Fortier, J.-L.; Benson, G.C.,
Excess heat capacities of binary mixtures of tetrachloromethane witlh some aromatic liquids at 298.15 K,
J. Chem. Thermodynam., 1977, 9, 1181-1188. [all data]
Deshpande and Bhatagadde, 1971
Deshpande, D.D.; Bhatagadde, L.G.,
Heat capacities at constant volume, free volumes, and rotational freedom in some liquids,
Aust. J. Chem., 1971, 24, 1817-1822. [all data]
Phillip, 1939
Phillip, N.M.,
Adiabatic and isothermal compressibilities of liquids,
Proc. Indian Acad. Sci., 1939, A9, 109-120. [all data]
Williams and Daniels, 1925
Williams, J.W.; Daniels, F.,
The specific heats of binary mixtures,
J. Am. Chem. Soc., 1925, 47, 1490-1503. [all data]
von Reis, 1881
von Reis, M.A.,
Die specifische Wärme flüssiger organischer Verbindungen und ihre Beziehung zu deren Moleculargewicht,
Ann. Physik [3], 1881, 13, 447-464. [all data]
Andrews and Haworth, 1928
Andrews, D.H.; Haworth, E.,
An application of the rule of Dulong and Petit to molecules,
J. Am. Chem. Soc., 1928, 50, 2998-3002. [all data]
Stull, 1937, 2
Stull, D.R.,
A Semi-micro Calorimeter for Measuring Heat Capacities at Low Temp.,
J. Am. Chem. Soc., 1937, 59, 2726. [all data]
Young, 1910
Young, S.,
The Internal Heat of Vaporization constants of thirty pure substances,
Sci. Proc. R. Dublin Soc., 1910, 12, 374. [all data]
Livingston, Morgan, et al., 1908
Livingston, J.; Morgan, R.; Higgins, E.,
The Weight of Falling Drops and Tate's Laws. Determination of Molecular Weights and Critical Temp. of Liquids Using Drop Weights: II.,
Z. Phys. Chem., Stoechiom. Verwandtschaftsl., 1908, 64, 170. [all data]
Altschul, 1893
Altschul, M.,
The critical values of some organic compounds,
Z. Phys. Chem., Stoechiom. Verwandtschaftsl., 1893, 11, 577. [all data]
Majer and Svoboda, 1985
Majer, V.; Svoboda, V.,
Enthalpies of Vaporization of Organic Compounds: A Critical Review and Data Compilation, Blackwell Scientific Publications, Oxford, 1985, 300. [all data]
Liu and Dickhut, 1994
Liu, Kewen; Dickhut, Rebecca M.,
Saturation vapor pressures and thermodynamic properties of benzene and selected chlorinated benzenes at environmental temperatures,
Chemosphere, 1994, 29, 3, 581-589, https://doi.org/10.1016/0045-6535(94)90445-6
. [all data]
Stephenson and Malanowski, 1987
Stephenson, Richard M.; Malanowski, Stanislaw,
Handbook of the Thermodynamics of Organic Compounds, 1987, https://doi.org/10.1007/978-94-009-3173-2
. [all data]
Brown, 1952
Brown, I.,
Aust. J. Sci. Res., Ser. A, 1952, 5, 530. [all data]
Boublik, Fried, et al., 1984
Boublik, T.; Fried, V.; Hala, E.,
The Vapour Pressures of Pure Substances: Selected Values of the Temperature Dependence of the Vapour Pressures of Some Pure Substances in the Normal and Low Pressure Region, 2nd ed., Elsevier, New York, 1984, 972. [all data]
Zibberman-Granovskaya, 1940
Zibberman-Granovskaya, A.A.,
Russ. J. Phys. Chem., 1940, 14, 759. [all data]
Brown, 1952, 2
Brown, I.,
Liquid-Vapour Equilibria. III. The Systems Benzene-n-Heptane, n-Hexane-Chlorobenzene, and cycloHexane-Nitrobenzene,
Aust. J. Sci. Res. Ser. A:, 1952, 5, 530-540. [all data]
Domalski and Hearing, 1996
Domalski, Eugene S.; Hearing, Elizabeth D.,
Heat Capacities and Entropies of Organic Compounds in the Condensed Phase. Volume III,
J. Phys. Chem. Ref. Data, 1996, 25, 1, 1, https://doi.org/10.1063/1.555985
. [all data]
Sieck, 1985
Sieck, L.W.,
Thermochemistry of Solvation of NO2- and C6H5NO2- by Polar Molecules in the Vapor Phase. Comparison with Cl- and Variation with Ligand Structure.,
J. Phys. Chem., 1985, 89, 25, 5552, https://doi.org/10.1021/j100271a049
. [all data]
Larson and McMahon, 1984
Larson, J.W.; McMahon, T.B.,
Gas phase negative ion chemistry of alkylchloroformates,
Can. J. Chem., 1984, 62, 675. [all data]
Paul and Kebarle, 1991
Paul, G.J.C.; Kebarle, P.,
Stabilities of Complexes of Br- with Substituted Benzenes (SB) Based on Determinations of the Gas-Phase Equilibria Br- + SB = (BrSB)-,
J. Am. Chem. Soc., 1991, 113, 4, 1148, https://doi.org/10.1021/ja00004a014
. [all data]
French, Ikuta, et al., 1982
French, M.A.; Ikuta, S.; Kebarle, P.,
Hydrogen bonding of O-H and C-H hydrogen donors to Cl-. Results from mass spectrometric measurement of the ion-molecule equilibria RH + Cl- = RHCl-,
Can. J. Chem., 1982, 60, 1907. [all data]
Wenthold and Squires, 1995
Wenthold, P.G.; Squires, R.R.,
Determination of the gas-phase acidities of halogen-substituted aromatic compounds using the silane-cleavage method,
J. Mass Spectrom., 1995, 30, 1, 17, https://doi.org/10.1002/jms.1190300105
. [all data]
Wenthold and Squires, 1994
Wenthold, P.G.; Squires, R.R.,
Gas-phase properties and reactivity of the acetate radical anion. Determination of the C-H bond strengths in acetic acid and acetate ion,
J. Am. Chem. Soc., 1994, 116, 26, 11890, https://doi.org/10.1021/ja00105a032
. [all data]
Wenthold, Paulino, et al., 1991
Wenthold, P.G.; Paulino, J.A.; Squires, R.R.,
The Absolute Heats of Formation of ortho-Benzyne, meta-Benzyne, and para-Benzyne,
J. Am. Chem. Soc., 1991, 113, 19, 7414, https://doi.org/10.1021/ja00019a044
. [all data]
Andrade and Riveros, 1996
Andrade, P.B.M.; Riveros, J.M.,
Relative Gas-phase Acidities of Fluoro- and Chlorobenzene,
J. Mass Spectrom., 1996, 31, 7, 767, https://doi.org/10.1002/(SICI)1096-9888(199607)31:7<767::AID-JMS345>3.0.CO;2-Q
. [all data]
Bartmess and McIver Jr., 1979
Bartmess, J.E.; McIver Jr.,
The Gas Phase Acidity Scale
in Gas Phase Ion Chemistry, Gas Phase Ion Chemistry, V. 2, M.T. Bowers, Ed., Academic Press, NY, 1979, Ch. 11, Elsevier, 1979. [all data]
Meot-Ner (Mautner) and El-Shall, 1986
Meot-Ner (Mautner), M.; El-Shall, M.S.,
Ionic Charge Transfer Complexes. 1. Cationic Complexes with Delocalized and Partially Localized pi Systems,
J. Am. Chem. Soc., 1986, 108, 15, 4386, https://doi.org/10.1021/ja00275a026
. [all data]
Meot-Ner (Mautner), Hamlet, et al., 1978
Meot-Ner (Mautner), M.; Hamlet, P.; Hunter, E.P.; Field, F.H.,
Bonding Energies in Association Ions of Aromatic Molecules. Correlations with Ionization Energies,
J. Am. Chem. Soc., 1978, 100, 17, 5466, https://doi.org/10.1021/ja00485a034
. [all data]
Reents and Freiser, 1981
Reents, W.D.; Freiser, B.S.,
Gas-Phase Binding Energies and Spectroscopic Properties of NO+ Charge-Transfer Complexes,
J. Am. Chem. Soc., 1981, 103, 2791. [all data]
Farid and McMahon, 1978
Farid, R.; McMahon, T.B.,
Gas-Phase Ion-Molecule Reactions of Alkyl Nitrites by Ion Cyclotron Resonance Spectroscopy,
Int. J. Mass Spectrom. Ion Phys., 1978, 27, 2, 163, https://doi.org/10.1016/0020-7381(78)80037-0
. [all data]
Nesterova, Rozhnov, et al., 1985
Nesterova, T.N.; Rozhnov, A.M.; Malova, T.N.; Kovzel, E.N.,
Molar enthalpies of formation of isopropylchlorobenzenes derived from equilibrium measurements,
J. Chem. Thermodyn., 1985, 17, 649-656. [all data]
Kovzel, Nesterova, et al., 1981
Kovzel, E.N.; Nesterova, T.N.; Rozhnov, A.M.; Kartavtseva, T.A.,
Study of equilibrium in in the chlorobenzene-butylchlorobenzenes systems,
Termodin. Organ. Soedin., 1981, 65-68. [all data]
Kirkbride, 1956
Kirkbride, F.W.,
The heats of chlorination of some hydrocarbons and their chloro-derivatives,
J. Appl. Chem., 1956, 6, 11-21. [all data]
Leighton and Calo, 1981
Leighton, D.T.; Calo, J.M.,
Distribution Coefficients of Chlorinated Hydrocarbons in Dilute Air-Water Systems for Groundwater Contamination Applications,
J. Chem. Eng. Data, 1981, 26, 382-385. [all data]
Mackay, Shiu, et al., 1979
Mackay, D.; Shiu, W.-Y.; Sutherland, R.P.,
Determination of Air-Water Henry's Law Constants for Hydrophobic Pollutants,
Environ. Sci. Technol., 1979, 13, 333-337. [all data]
Hunter and Lias, 1998
Hunter, E.P.; Lias, S.G.,
Evaluated Gas Phase Basicities and Proton Affinities of Molecules: An Update,
J. Phys. Chem. Ref. Data, 1998, 27, 3, 413-656, https://doi.org/10.1063/1.556018
. [all data]
Fujisawa, Ohno, et al., 1986
Fujisawa, S.; Ohno, K.; Masuda, S.; Harada, Y.,
Penning ionization electron spectroscopy of monohalogenobenzenes: C6H5F, C6H5Cl, C6H5Br, and C6H5I,
J. Am. Chem. Soc., 1986, 108, 6505. [all data]
Klasinc, Kovac, et al., 1983
Klasinc, L.; Kovac, B.; Gusten, H.,
Photoelectron spectra of acenes. Electronic structure and substituent effects,
Pure Appl. Chem., 1983, 55, 289. [all data]
Ruscic, Klasinc, et al., 1981
Ruscic, B.; Klasinc, L.; Wolf, A.; Knop, J.V.,
Photoelectron spectra of and Ab initio calculations on chlorobenzenes. 1. Chlorobenzene and dichlorobenzenes,
J. Phys. Chem., 1981, 85, 1486. [all data]
Kimura, Katsumata, et al., 1981
Kimura, K.; Katsumata, S.; Achiba, Y.; Yamazaki, T.; Iwata, S.,
Ionization energies, Ab initio assignments, and valence electronic structure for 200 molecules
in Handbook of HeI Photoelectron Spectra of Fundamental Organic Compounds, Japan Scientific Soc. Press, Tokyo, 1981. [all data]
Mohraz, Maier, et al., 1980
Mohraz, M.; Maier, J.P.; Heilbronner, E.,
He(I α) and He(Iα) photoelectron spectra of fluorinated chloro- and bromobenzenes,
J. Electron Spectrosc. Relat. Phenom., 1980, 19, 429. [all data]
Maier and Marthaler, 1978
Maier, J.P.; Marthaler, O.,
Emission spectra of the radical cations of 1,3-dichlorobenzene, 1,4-dichlorobenzene and 1,3,5-trichlorobenzene in the gas phase,
Chem. Phys., 1978, 32, 419. [all data]
Lias and Ausloos, 1978
Lias, S.G.; Ausloos, P.J.,
eIonization energies of organic compounds by equilibrium measurements,
J. Am. Chem. Soc., 1978, 100, 6027. [all data]
Behan, Johnstone, et al., 1976
Behan, J.M.; Johnstone, R.A.W.; Bentley, T.W.,
An evaluation of empirical methods for calculating the ionization potentials of substituted benzenes,
Org. Mass Spectrom., 1976, 11, 207. [all data]
Baldwin, Loudon, et al., 1976
Baldwin, M.A.; Loudon, A.G.; Maccoll, A.; Webb, K.S.,
The nature and fragmentation pathways of the molecular ions of some arylureas, arylthioureas, acetanilides, thioacetanilides and related compounds,
Org. Mass Spectrom., 1976, 11, 1181. [all data]
Baer, Tsai, et al., 1976
Baer, T.; Tsai, B.P.; Smith, D.; Murray, P.T.,
Absolute unimolecular decay rates of energy selected metastable halobenzene ions,
J. Chem. Phys., 1976, 64, 2460. [all data]
Gilbert, Leach, et al., 1973
Gilbert, J.R.; Leach, W.P.; Miller, J.R.,
Ionisation appearance potential measurements in arene chromium tricarbonyls,
J. Organomet. Chem., 1973, 49, 219. [all data]
Cooks, Bertrand, et al., 1973
Cooks, R.G.; Bertrand, M.; Beynon, J.H.; Rennekamp, M.E.; Setser, D.W.,
Energy partitioning data as an ion structure probe. Substituted anisoles,
J. Am. Chem. Soc., 1973, 95, 1732. [all data]
Sergeev, Akopyan, et al., 1970
Sergeev, Yu.L.; Akopyan, M.E.; Vilesov, F.I.; Kleimenov, V.I.,
Photoionization processes in phenyl halides,
Opt. i Spektroskopiya, 1970, 29, 119, In original 63. [all data]
Momigny, Goffart, et al., 1968
Momigny, J.; Goffart, C.; D'Or, L.,
Photoionization studies by total ionization measurements. I. Benzene and its monohalogeno derivatives,
Intern. J. Mass Spectrom. Ion Phys., 1968, 1, 53. [all data]
Quemerais, Morlais, et al., 1967
Quemerais, A.; Morlais, M.; Robin, S.,
Spectres d'absorption du benzene et du monochlorobenzene dans l'ultraviolet de 1300 a 2300 A,
Compt. Rend., 1967, 265, 649. [all data]
Bralsford, Harris, et al., 1960
Bralsford, R.; Harris, P.V.; Price, W.C.,
The effect of fluorine on the electronic spectra and ionization potentials of molecules,
Proc. Roy. Soc. (London), 1960, A258, 459. [all data]
Watanabe, 1957
Watanabe, K.,
Ionization potentials of some molecules,
J. Chem. Phys., 1957, 26, 542. [all data]
Potts, Lyus, et al., 1980
Potts, A.W.; Lyus, M.L.; Lee, E.P.F.; Fattahallah, G.H.,
High resolution ultraviolet photoelectron spectra of C6H5X and p-C6H4X2 where X = Cl, Br or I,
J. Chem. Soc. Faraday Trans. 2, 1980, 76, 556. [all data]
Sell and Kupperman, 1978
Sell, J.A.; Kupperman, A.,
Angular distributions in the photoelectron spectra of benzene and its monohalogenated derivatives,
Chem. Phys., 1978, 33, 367. [all data]
Klasinc, Novak, et al., 1978
Klasinc, L.; Novak, I.; Scholz, M.; Kluge, G.,
Photoelektronenspektren substituierter Pyridine und Benzole und ihre Interpretation durch die CNDO/SWW-Methode,
Croat. Chem. Acta, 1978, 51, 43. [all data]
Streets and Ceasar, 1973
Streets, D.G.; Ceasar, G.P.,
Inductive mesomeric effects on the π orbitals of halobenzenes,
Mol. Phys., 1973, 26, 1037. [all data]
Momigny, 1959
Momigny, J.,
Determination et discussion des potentials d'apparition d'ions fragmentaires dans le benzene et ses derives monohalogenes,
Bull. Soc. Roy. Sci. Liege, 1959, 28, 251. [all data]
Ripoche, Dimicoli, et al., 1991
Ripoche, X.; Dimicoli, I.; Botter, R.,
Unimolecular decay rates for laser induced Cl loss from energy selected chlorobenzene cations [Eo(C6H5Cl+ Ü C6H5+ + Cl)=2.74±0.02 eV; cited data derived using recommended IP for chlorobenzene.],
Int. J. Mass Spectrom. Ion Processes, 1991, 107, 165. [all data]
Burgers and Holmes, 1984
Burgers, P.C.; Holmes, J.L.,
Fragmentation rate constants and appearance energies for reactions having a large kinetic shift and the energy partitioning in their metastable decomposition,
Int. J. Mass Spectrom. Ion Processes, 1984, 58, 15. [all data]
Rosenstock, Stockbauer, et al., 1980
Rosenstock, H.M.; Stockbauer, R.; Parr, A.C.,
Photoelectron-photoion coincidence study of the bromobenzene ion,
J. Chem. Phys., 1980, 73, 773. [all data]
Rosenstock, Stockbauer, et al., 1979
Rosenstock, H.M.; Stockbauer, R.; Parr, A.C.,
Kinetic shift in chlorobenzene ion fragmentation and the heat of formation of the phenyl ion,
J. Chem. Phys., 1979, 71, 3708. [all data]
Johnstone and Mellon, 1972
Johnstone, R.A.W.; Mellon, F.A.,
Electron-impact ionization and appearance potentials,
J. Chem. Soc. Faraday Trans. 2, 1972, 68, 1209. [all data]
Majer and Patrick, 1962
Majer, J.R.; Patrick, C.R.,
Electron impact on some halogenated aromatic compounds,
J. Chem. Soc. Faraday Trans., 1962, 58, 17. [all data]
Grammaticakis, 1949
Grammaticakis, P.,
Contribution a l'etude de l'absorption dans l'ultraviolet moyen des anilines orthosubstituees. II. Ortho-halogenanilines N-substituees,
Bull. Soc. Chim. Fr., 1949, 16, 761. [all data]
Santiuste, Harangi, et al., 2003
Santiuste, J.M.; Harangi, J.; Takács, J.M.,
Mosaic increments for predicting the gas chromatographic retention data of the chlorobenzenes,
J. Chromatogr. A, 2003, 1002, 1-2, 155-168, https://doi.org/10.1016/S0021-9673(03)00736-2
. [all data]
Santiuste J.M. and Takacs J.M., 2003
Santiuste J.M.; Takacs J.M.,
Relationships between retention data of benzene and chlorobenzenes with their physico-chemical properties and topological indices,
Chromatographia, 2003, 58, 87-96. [all data]
Dallos, Sisak, et al., 2000
Dallos, A.; Sisak, A.; Kulcsár, Z.; Kováts, E.,
Pair-wise interactions by gas chromatography VII. Interaction free enthalpies of solutes with secondary alcohol groups,
J. Chromatogr. A, 2000, 904, 2, 211-242, https://doi.org/10.1016/S0021-9673(00)00908-0
. [all data]
Garay, 2000
Garay, F.,
Application of a flow-tunable, serially coupled gas chromatographic capillary column system for the analysis of complex mixtures,
Chromatographia Sup., 2000, 51, 1, s108-s120, https://doi.org/10.1007/BF02492792
. [all data]
Vezzani, Bertocchi, et al., 1998
Vezzani, S.; Bertocchi, A.; Moretti, P.; Castello, G.,
Prediction of the gas chromatographic retention values of chlorobenzenes on different station phases by using structure-retention correlations,
J. Chromatogr. A, 1998, 803, 1-2, 211-218, https://doi.org/10.1016/S0021-9673(97)01281-8
. [all data]
Gerbino, Garbarino, et al., 1996
Gerbino, T.C.; Garbarino, G.; Petit-Bon, P.,
Programmed temperature retention indices: calculation of linear programmed temperature retention indices of halogenated benzenes from isothermal data,
Ann. Chim. (Rome), 1996, 86, 63-75. [all data]
Righezza, Hassani, et al., 1996
Righezza, M.; Hassani, A.; Meklati, B.Y.; Chrétien, J.R.,
Quantitative structure-retention relationships (QSRR) of congeneric aromatics series studied on phenyl OV phases in gas chromatography,
J. Chromatogr. A, 1996, 723, 1, 77-91, https://doi.org/10.1016/0021-9673(95)00816-0
. [all data]
Villalobos, 1995
Villalobos, R.,
A window diagram for key component analysis in on-line gas chromatography,
J. Hi. Res. Chromatogr., 1995, 18, 6, 343-347, https://doi.org/10.1002/jhrc.1240180604
. [all data]
Spieksma, Luijk, et al., 1994
Spieksma, Walter; Luijk, Ronald; Govers, Harrie A.J.,
Determination of the liquid vapour pressure of low-volatility compounds from the Kováts retention index,
Journal of Chromatography A, 1994, 672, 1-2, 141-148, https://doi.org/10.1016/0021-9673(94)80602-0
. [all data]
Hassani and Meklati, 1992
Hassani, A.; Meklati, B.Y.,
Gas chromatographic behaviour of monosubstituted benzenes, benzaldehydes and acetophenones on OV polymethylphenyl-silicone stationary phases,
Chromatographia, 1992, 33, 5/6, 267-271, https://doi.org/10.1007/BF02276193
. [all data]
Reddy, Dutoit, et al., 1992
Reddy, K.S.; Dutoit, J.-Cl.; Kovats, E. sz.,
Pair-wise interactions by gas chromatography. I. Interaction free enthalpies of solutes with non-associated primary alcohol groups,
J. Chromatogr., 1992, 609, 1-2, 229-259, https://doi.org/10.1016/0021-9673(92)80167-S
. [all data]
Dutoit, 1991
Dutoit, J.,
Gas chromatographic retention behaviour of some solutes on structurally similar polar and non-polar stationary phases,
J. Chromatogr., 1991, 555, 1-2, 191-204, https://doi.org/10.1016/S0021-9673(01)87179-X
. [all data]
Evans and Haken, 1989
Evans, M.B.; Haken, J.K.,
Dispersion and selectivity indices in gas chromatography. IV. Chlorinated aromatic compounds,
J. Chromatogr., 1989, 468, 373-382, https://doi.org/10.1016/S0021-9673(00)96332-5
. [all data]
Tarjan, Nyiredy, et al., 1989
Tarjan, G.; Nyiredy, Sz.; Gyor, M.; Lombosi, E.R.; Lombosi, T.S.; Budahegyi, M.V.; Meszaros, S.Y.; Takacs, J.M.,
Review. Thirtieth Anniversary of the Retention Index According to Kovats in Gas-Liquid Chromatography,
J. Chromatogr., 1989, 472, 1-92, https://doi.org/10.1016/S0021-9673(00)94099-8
. [all data]
Evans and Haken, 1987
Evans, M.B.; Haken, J.K.,
Dispersion and selectivity indices of the halogenated derivatives of cyclohexane, benzene and anisole,
J. Chromatogr., 1987, 389, 240-244, https://doi.org/10.1016/S0021-9673(01)94428-0
. [all data]
Haken and Vernon, 1986
Haken, J.K.; Vernon, F.,
Gas chromatography of halogenated derivatives of cyclohexane, benzene and anisole,
J. Chromatogr., 1986, 361, 57-61, https://doi.org/10.1016/S0021-9673(01)86893-X
. [all data]
Oszczapowicz, Osek, et al., 1985
Oszczapowicz, J.; Osek, J.; Ciszkowski, K.; Krawczyk, W.; Ostrowski, M.,
Retention Indices of Dimethylbenzamidines and Benzylideneamines on a Non-Polar Column,
J. Chromatogr., 1985, 330, 79-85, https://doi.org/10.1016/S0021-9673(01)81964-6
. [all data]
Oszczapowicz, Osek, et al., 1984
Oszczapowicz, J.; Osek, J.; Dolecka, E.,
Retention indices of dimethylformamidines, dimethylacetamidines and tetramethylguanidines on a non-polar column,
J. Chromatogr., 1984, 315, 95-100, https://doi.org/10.1016/S0021-9673(01)90727-7
. [all data]
Tiess, 1984
Tiess, D.,
Gaschromatographische Retentionsindices von 125 leicht- bis mittelflüchtigen organischen Substanzen toxikologisch-analytischer Relevanz auf SE-30,
Wiss. Z. Wilhelm-Pieck-Univ. Rostock Math. Naturwiss. Reihe, 1984, 33, 6-9. [all data]
Chien, Furio, et al., 1983
Chien, C.-F.; Furio, D.L.; Kopecni, M.M.; Laub, R.J.,
Specific retention volumes and retention indices of selected hydrocarbon solutes with OV-3, OV-7, OV-11, OV-17, OV-22, and OV-25 polymethylphenylsiloxane solvents,
J. Hi. Res. Chromatogr., 1983, 6, 12, 669-679, https://doi.org/10.1002/jhrc.1240061207
. [all data]
Haken and Korhonene, 1983
Haken, J.K.; Korhonene, I.O.O.,
Retention increments of isomeric chlorobenzenes,
J. Chromatogr., 1983, 265, 323-327, https://doi.org/10.1016/S0021-9673(01)96727-5
. [all data]
Winskowski, 1983
Winskowski, J.,
Gaschromatographische Identifizierung von Stoffen anhand von Indexziffem und unterschiedlichen Detektoren,
Chromatographia, 1983, 17, 3, 160-165, https://doi.org/10.1007/BF02271041
. [all data]
Jaworski, 1982
Jaworski, M.,
Wybrane przyklady stosowania systemu indeksów retencji,
Przem. Chem., 1982, 61, 9, 334-338. [all data]
Evans and Newton, 1976
Evans, M.B.; Newton, R.,
Inverse gas chromatography in the study of polymer degradation. Part I. Oxidation of squalene as a model for the oxidative degradation of natural rubber,
Chromatographia, 1976, 9, 11, 561-566, https://doi.org/10.1007/BF02275963
. [all data]
Riedo, Fritz, et al., 1976
Riedo, F.; Fritz, D.; Tarján, G.; Kováts, E.Sz.,
A tailor-made C87 hydrocarbon as a possible non-polar standard stationary phase for gas chromatography,
J. Chromatogr., 1976, 126, 63-83, https://doi.org/10.1016/S0021-9673(01)84063-2
. [all data]
Ryba, 1976
Ryba, M.,
Unlösliche Restfilme er stationären Flüssigkeit in gas-chromatographischen Glaskapillaren,
Chromatographia, 1976, 9, 3, 105-112, https://doi.org/10.1007/BF02330376
. [all data]
Brown, Chapman, et al., 1968
Brown, I.; Chapman, I.L.; Nicholson, G.J.,
Gas chromatography of polar solutes in electron acceptor stationary phases,
Aust. J. Chem., 1968, 21, 5, 1125-1141, https://doi.org/10.1071/CH9681125
. [all data]
Evans and Smith, 1967
Evans, M.B.; Smith, J.F.,
Gas chromatography in qualitative analysis. IV. An investigation of the changes in relative rentention data accompanying the oxidation of apolar stationary phases,
J. Chromatogr., 1967, 28, 277-284, https://doi.org/10.1016/S0021-9673(01)85968-9
. [all data]
Adlard, Evans, et al., 1965
Adlard, E.R.; Evans, M.B.; Butlin, A.G.; Evans, R.S.; Hill, R.; Huber, J.F.K.; Littlewood, A.B.; McCambley, W.G.; Smith, J.F.; Swanton, W.T.; Swoboda, P.A.T.,
Recommendations of the data sub-committee for the publication of retention data,
J. Gas Chromatogr., 1965, 3, 9, 298-302, https://doi.org/10.1093/chromsci/3.9.298
. [all data]
Wehrli and Kováts, 1959
Wehrli, A.; Kováts, E.,
Gas-chromatographische Charakterisierung ogranischer Verbindungen. Teil 3: Berechnung der Retentionsindices aliphatischer, alicyclischer und aromatischer Verbindungen,
Helv. Chim. Acta, 1959, 7, 7, 2709-2736, https://doi.org/10.1002/hlca.19590420745
. [all data]
Shimadzu, 2003
Shimadzu,
Gas chromatography analysis of organic solvents using capillary columns (No. 2), 2003, retrieved from http://www.shimadzu.com/apps/form.cfm. [all data]
Jalali-Heravi and Garkani-Nejad, 1993
Jalali-Heravi, M.; Garkani-Nejad, Z.,
Prediction of gas chromatographic retention indices of some benzene derivatives,
J. Chromatogr., 1993, 648, 2, 389-393, https://doi.org/10.1016/0021-9673(93)80421-4
. [all data]
Pérez-Parajón, Santiuste, et al., 2004
Pérez-Parajón, J.M.; Santiuste, J.M.; Takács, J.M.,
Sensitivity of the methylbenzenes and chlorobenzenes retention index to column temperature, stationary phase polarity, and number and chemical nature of substituents,
J. Chromatogr. A, 2004, 1048, 2, 223-232, https://doi.org/10.1016/j.chroma.2004.07.028
. [all data]
Vernon and Suratman, 1983
Vernon, F.; Suratman, J.B.,
The retention index system applied to alkylbenzenes and monosubstituted derivatives,
Chromatographia, 1983, 17, 11, 600-604, https://doi.org/10.1007/BF02261943
. [all data]
Goebel, 1982
Goebel, K.-J.,
Gaschromatographische Identifizierung Niedrig Siedender Substanzen Mittels Retentionsindices und Rechnerhilfe,
J. Chromatogr., 1982, 235, 1, 119-127, https://doi.org/10.1016/S0021-9673(00)95793-5
. [all data]
Censullo, Jones, et al., 2003
Censullo, A.C.; Jones, D.R.; Wills, M.T.,
Speciation of the volatile organic compounds (VOCs) in solventborne aerosol coatings by solid phase microextraction-gas chromatography,
J. Coat. Technol., 2003, 75, 936, 47-53, https://doi.org/10.1007/BF02697922
. [all data]
Sun and Stremple, 2003
Sun, G.; Stremple, P.,
Retention index characterization of flavor, fragrance, and many other compounds on DB-1 and DB-XLB, 2003, retrieved from http://www.chem.agilent.com/cag/cabu/pdf/b-0279.pdf. [all data]
Xu, van Stee, et al., 2003
Xu, X.; van Stee, L.L.P.; Williams, J.; Beens, J.; Adahchour, M.; Vreuls, R.J.J.; Brinkman, U.A.Th.; Lelieveld, J.,
Comprehensive two-dimensional gas chromatography (GC×GC) measurements of volatile organic compounds in the atmosphere,
Atmos. Chem. Phys., 2003, 3, 3, 665-682, https://doi.org/10.5194/acp-3-665-2003
. [all data]
Gautzsch and Zinn, 1996
Gautzsch, R.; Zinn, P.,
Use of incremental models to estimate the retention indexes of aromatic compounds,
Chromatographia, 1996, 43, 3/4, 163-176, https://doi.org/10.1007/BF02292946
. [all data]
Helmig, Pollock, et al., 1996
Helmig, D.; Pollock, W.; Greenberg, J.; Zimmerman, P.,
Gas chromatography mass spectrometry analysis of volatile organic trace gases at Mauna Loa Observatory, Hawaii,
J. Geophys. Res., 1996, 101, D9, 14697-14710, https://doi.org/10.1029/96JD00212
. [all data]
Gerbino and Castello, 1995
Gerbino, T.C.; Castello, G.,
Prediction of programmed temperature retention indices on capillary columns of different polarities,
J. Chromatogr. A, 1995, 699, 1-2, 161-171, https://doi.org/10.1016/0021-9673(95)00024-H
. [all data]
White, Hackett, et al., 1992
White, C.M.; Hackett, J.; Anderson, R.R.; Kail, S.; Spock, P.S.,
Linear temperature programmed retention indices of gasoline range hydrocarbons and chlorinated hydrocarbons on cross-linked polydimethylsiloxane,
J. Hi. Res. Chromatogr., 1992, 15, 2, 105-120, https://doi.org/10.1002/jhrc.1240150211
. [all data]
Weber, 1986
Weber, L.,
Utilization of the Sadtler standard RI system in micropollution analyses,
J. Hi. Res. Chromatogr. Chromatogr. Comm., 1986, 9, 8, 446-451, https://doi.org/10.1002/jhrc.1240090806
. [all data]
Buchman, Cao, et al., 1984
Buchman, O.; Cao, G.-Y.; Peng, C.T.,
Structure assignment by retention index in gas-liquid radiochromatography of substituted cyclohexenes,
J. Chromatogr., 1984, 312, 75-90, https://doi.org/10.1016/S0021-9673(01)92765-7
. [all data]
Peng, Ding, et al., 1988
Peng, C.T.; Ding, S.F.; Hua, R.L.; Yang, Z.C.,
Prediction of Retention Indexes I. Structure-Retention Index Relationship on Apolar Columns,
J. Chromatogr., 1988, 436, 137-172, https://doi.org/10.1016/S0021-9673(00)94575-8
. [all data]
Tello, Lebron-Aguilar, et al., 2009
Tello, A.M.; Lebron-Aguilar, R.; Quintanilla-Lopez, J.E.; Santiuste, J.M.,
Isothermal retention indices on poly93-cyanopropylmethyl)siloxane stationary phases,
J. Chromatogr. A, 2009, 1216, 10, 1630-1639, https://doi.org/10.1016/j.chroma.2008.10.025
. [all data]
Lebrón-Aguilar, Quintanilla-López, et al., 2007
Lebrón-Aguilar, R.; Quintanilla-López, J.E.; Tello, A.M.; Santiuste, J.M.,
Isothermal retention indices on poly (3,3,3-trifluoropropylmethylsiloxane) stationary phases,
J. Chromatogr. A, 2007, 1160, 1-2, 276-288, https://doi.org/10.1016/j.chroma.2007.05.025
. [all data]
Shimadzu, 2003, 2
Shimadzu,
Gas chromatography analysis of organic solvents using capillary columns (No. 3), 2003, retrieved from http://www.shimadzu.com/apps/form.cfm. [all data]
Bermejo, Moinelo, et al., 1980
Bermejo, J.; Moinelo, S.R.; Suarez Canga, C.,
Calculo de indices de retencion a patir de DI y de la polaridad de la fase, Calculo de indices de retencion a patir de DI y de la polaridad de la fase, Instituto Nacional del Carbon y sus Derivados Francisco Pintado Fe (INCAR), La Corredoria, Oviedo, Espana, 1980, 13. [all data]
Anderson, 1968
Anderson, D.G.,
USe of Kovats retention indices and response factors for the qualitative and quantitative analysis of coating solvents,
J. Paint Technol., 1968, 40, 527, 549-557. [all data]
Tsuge, Ohtan, et al., 2011
Tsuge, S.; Ohtan, H.; Watanabe, C.,
Pyrolysis - GC/MS Data Book of Synthetic Polymers, Elsevier, 2011, 420. [all data]
Zenkevich, Moeder, et al., 2004
Zenkevich, I.G.; Moeder, M.; Koeller, G.; Schrader, S.,
Using new structurally related additive schemes in the precalculation of gas chromatographic retention indices of polychlorinated hydroxybiphenyls on HP-5 stationary phase,
J. Chromatogr. A, 2004, 1025, 2, 227-236, https://doi.org/10.1016/j.chroma.2003.10.106
. [all data]
Health Safety Executive, 2000
Health Safety Executive,
MDHS 96 Volatile organic compounds in air - Laboratory method using pumed solid sorbent tubes, solvent desorption and gas chromatography
in Methods for the Determination of Hazardous Substances (MDHS) guidance, Crown, Colegate, Norwich, 2000, 1-24, retrieved from http://www.hse.gov.uk/pubns/mdhs/pdfs/mdhs96.pdf. [all data]
Jung, Wichmann, et al., 1999
Jung, A.; Wichmann, K.-H.; Kolb, M.,
VOC emission of polymeric packaging materials,
LaborPraxis, 1999, 23, 9, 20-22. [all data]
Huang, Liang, et al., 1996
Huang, C.; Liang, H.; Han, S.,
The analysis of organic compounds in waste water by gas extraction/thermal desorption/gas chromatography-mass spectrometry,
Chin. J. Chromatogr., 1996, 14, 6, 421-424. [all data]
Messadi and Ali-Mokhnache, 1993
Messadi, D.; Ali-Mokhnache, S.,
Calculation of retention indices and peak widths in temperature programmed gas-liquid chromatography,
Chromatographia, 1993, 37, 5/6, 264-270, https://doi.org/10.1007/BF02278631
. [all data]
Zenkevich and Tsibulskaya, 1989
Zenkevich, I.G.; Tsibulskaya, I.A.,
Influence of Relative Amounts of Mixture Components on the Precision of Measurements of Gas Chromatographic Retention Indices,
Zh. Anal. Khim. (Rus.), 1989, 44, 1, 90-96. [all data]
Robinson, Adams, et al., 2012
Robinson, A.L.; Adams, D.O.; Boss, P.K.; Heymann, H.; Solomon, P.S.; Trengove, R.D.,
Influence of geographic origine on the sensory characteristics and wine composition of Vitus viniferas cv. Cabernet Sauvignon wines from Australia (Supplemental data),
Am. J. Enol. Vitic., 2012, 64, 4, 467-476, https://doi.org/10.5344/ajev.2012.12023
. [all data]
Ebrahimi and Hadjmohammadi, 2006
Ebrahimi, P.; Hadjmohammadi, M.R.,
Simultaneous modeling of the Kovats retention indices on phenyl OV stationary phases with different polarity using MLR and ANN,
QSAR Comb. Sci., 2006, 25, 10, 836-845, https://doi.org/10.1002/qsar.200530145
. [all data]
Zenkevich, Eliseenkov, et al., 2006
Zenkevich, I.G.; Eliseenkov, E.V.; Kasatochkin, A.N.,
Application of Retention Indices in GC-MS Identification of Halogenated Organic Compounds,
Mass Spectromery (Rus.), 2006, 3, 2, 131-140. [all data]
Flanagan, Streete, et al., 1997
Flanagan, R.J.; Streete, P.J.; Ramsey, J.D.,
Volatile Substance Abuse, UNODC Technical Series, No 5, United Nations, Office on Drugs and Crime, Vienna International Centre, PO Box 500, A-1400 Vienna, Austria, 1997, 56, retrieved from http://www.odccp.org/pdf/technicalseries1997-01-011.pdf. [all data]
Zenkevich and Chupalov, 1996
Zenkevich, I.G.; Chupalov, A.A.,
New Possibilities of Chromato Mass Pectrometric Identification of Organic Compounds Using Increments of Gas Chromatographic Retention Indices of Molecular Structural Fragments,
Zh. Org. Khim. (Rus.), 1996, 32, 5, 656-666. [all data]
Sorimachi, Tanabe, et al., 1995
Sorimachi, J.; Tanabe, A.; Mitobe, H.; Kuniaki, K.; Masaaki, S.,
Programmed temperature retention indices for volatile organic compounds on headspace GC/MS analysis,
Niigata-ken Eisei Kogai Kenkyusho Nenpo, 1995, 11, 75-79. [all data]
Ciccioli, Cecinato, et al., 1994
Ciccioli, P.; Cecinato, A.; Brancaleoni, E.; Brachetti, A.; Frattoni, M.; Sparapani, R.,
Composition and Distribution of Polar and Non-Polar VOCs in Urban, Rural, Forest and Remote Areas,
Eur Commission EUR, 1994, 549-568. [all data]
Vezzani, Moretti, et al., 1994
Vezzani, S.; Moretti, P.; Castello, G.,
Fast and Accurate Method for the Automatic Prediction of Programmed-Temperature Retention Times,
J. Chromatogr. A, 1994, 677, 2, 331-343, https://doi.org/10.1016/0021-9673(94)80161-4
. [all data]
Strete, Ruprah, et al., 1992
Strete, P.J.; Ruprah, M.; Ramsey, J.D.; Flanagan, R.J.,
Detection and identification of volatile substances by headspace capillary gas chromatography to aid the diagnosis of acute poisoning,
Analyst, 1992, 117, 7, 1111-1127, https://doi.org/10.1039/an9921701111
. [all data]
Weller and Wolf, 1989
Weller, J.-P.; Wolf, M.,
Massenspektroskopie und Headspace-GC,
Beitr. Gerichtl. Med., 1989, 47, 525-532. [all data]
Zenkevich and Malamakhov, 1987
Zenkevich, I.G.; Malamakhov, A.C.,
Evaluation of Molecular Weights of Organic Compounds based on Retention Parameters at Chromato-Spectral Analysys. Additional Criterion of Molecular Ions' Identification,
Vestn. St. Petersb. Univ. Ser. 4: Fiz. Khim, 1987, 2, 101-106. [all data]
Waggott and Davies, 1984
Waggott, A.; Davies, I.W.,
Identification of organic pollutants using linear temperature programmed retention indices (LTPRIs) - Part II, 1984, retrieved from http://dwi.defra.gov.uk/research/completed-research/reports/dwi0383.pdf. [all data]
Ramsey and Flanagan, 1982
Ramsey, J.D.; Flanagan, R.J.,
Detection and Identification of Volatile Organic Compounds in Blood by Headspace Gas Chromatography as an Aid to the Diagnosis of Solvent Abuse,
J. Chromatogr., 1982, 240, 2, 423-444, https://doi.org/10.1016/S0021-9673(00)99622-5
. [all data]
Dowling, Evans, et al., 1990
Dowling, J.J.; Evans, M.B.; Haken, J.K.,
Gas-liquid chromatography in qualitative analysis. XVIII. Study of the dependence of the retention behavior of polyoxyethylene glycol columns on the nature of the support and phase loading,
J. Chromatogr., 1990, 500, 355-365, https://doi.org/10.1016/S0021-9673(00)96077-1
. [all data]
Shimadzu, 2012
Shimadzu, Pharmaceutical Related,
Analysis of pharmaceutical residual solvent (observation of separation) (1) - GC, 2012, retrieved from www.shimadzu.ru/applications/Applicationspdf/GC/Pharma/Pharmaceutical residual solvents GC.pdf. [all data]
Shimadzu Corporation, 2003
Shimadzu Corporation,
Analysis of pharmaceutical residual solvent (observation of separation), 2003, retrieved from http://www.shimadzu.com.br/analitica/aplicacoes/book/pharm69.pdf. [all data]
le Pape, Grua-Priol, et al., 2004
le Pape, M.-A.; Grua-Priol, J.; Prost, C.; Demaimay, M.,
Optimization of dynamic headspace extraction of the edible red algae Palmaria palmata and identification of the volatile components,
J. Agric. Food Chem., 2004, 52, 3, 550-556, https://doi.org/10.1021/jf030478x
. [all data]