Lumiflavine
- Formula: C13H12N4O2
- Molecular weight: 256.2600
- IUPAC Standard InChIKey: KPDQZGKJTJRBGU-UHFFFAOYSA-N
- CAS Registry Number: 1088-56-8
- Chemical structure:
View 3d structure (requires JavaScript / HTML 5) - Other names: Benzo[g]pteridine-2,4(3H,10H)-dione, 7,8,10-trimethyl-; Lumiflavin; Lumilactoflavin; 7,8,10-Trimethylisoalloxazine; Lumiflavin (III); 7,8,10-trimethylbenzo[g]pteridine-2,4(3H,10H)-dione

Gas phase ion energetics data

Data compiled by: Sharon G. Lias, Rhoda D. Levin, and Sherif A. Kafafi
Ionization energy determinations
IE (eV) | Method | Reference | Comment |
---|---|---|---|
8.72 | PE | Palmer, Simpson, et al., 1980 | Vertical value |

References

Palmer, Simpson, et al., 1980
Palmer, M.H.; Simpson, I.; Platenkamp, R.J.,
The electronic structure of flavin derivatives,
J. Mol. Struct., 1980, 66, 243. [all data]
Nanni and Sawyer, 1980
Nanni, E.G., Jr.; Sawyer, D.T.,
J. Am. Chem. Soc., 1980, 102, 7591. [all data]