4-Heptanone, 2,6-dimethyl-
- Formula: C9H18O
- Molecular weight: 142.2386
- IUPAC Standard InChIKey: PTTPXKJBFFKCEK-UHFFFAOYSA-N
- CAS Registry Number: 108-83-8
- Chemical structure:
View 3d structure (requires JavaScript / HTML 5) - Other names: Diisobutyl ketone; s-Diisopropylacetone; DIBK; Isobutyl ketone; Isovalerone; 2,6-Dimethyl-4-heptanone; (iso-C4H9)2CO; 2,6-Dimethylheptan-4-one; Di-isobutylcetone; Diisobutilchetone; Diisobutylketon; 2,6-Dimethyl-heptan-4-on; 2,6-Dimetil-eptan-4-one; sym-Diisopropylacetone; UN 1157; Valerone; NSC 15136; 2,6-dimethyl-4-heptanone (diisobutyl ketone)

Gas phase thermochemistry data

Data compiled by: Hussein Y. Afeefy, Joel F. Liebman, and Stephen E. Stein
Quantity | Value | Units | Method | Reference | Comment |
---|---|---|---|---|---|
ΔfH°gas | -357.7 ± 1.2 | kJ/mol | Ccr | Seller, 1970 |

Condensed phase thermochemistry data

Data compiled as indicated in comments:
ALS - Hussein Y. Afeefy, Joel F. Liebman, and Stephen E. Stein
DH - Eugene S. Domalski and Elizabeth D. Hearing
Quantity | Value | Units | Method | Reference | Comment |
---|---|---|---|---|---|
ΔfH°liquid | -408.6 ± 1.2 | kJ/mol | Ccr | Seller, 1970 | ALS |
Quantity | Value | Units | Method | Reference | Comment |
ΔcH°liquid | -5705.5 ± 1.1 | kJ/mol | Ccr | Seller, 1970 | Corresponding ΔfHºliquid = -408.56 kJ/mol (simple calculation by NIST; no Washburn corrections); ALS |
Constant pressure heat capacity of liquid
Cp,liquid (J/mol*K) | Temperature (K) | Reference | Comment |
---|---|---|---|
297.3 | 298.15 | Vesely, Barcal, et al., 1989 | T = 298.15 to 318.15 K.; DH |

Phase change data

Data compiled as indicated in comments:
BS - Robert L. Brown and Stephen E. Stein
TRC - Thermodynamics Research Center, NIST Boulder Laboratories, Chris Muzny director
AC - William E. Acree, Jr., James S. Chickos
ALS - Hussein Y. Afeefy, Joel F. Liebman, and Stephen E. Stein
DH - Eugene S. Domalski and Elizabeth D. Hearing
Quantity | Value | Units | Method | Reference | Comment |
---|---|---|---|---|---|
Tboil | 441. ± 3. | K | AVG | N/A | Average of 15 out of 16 values; Individual data points |
Quantity | Value | Units | Method | Reference | Comment |
Tfus | 231.6 | K | N/A | Anonymous, 1958 | Uncertainty assigned by TRC = 3. K; TRC |
Tfus | 227.0 | K | N/A | Anonymous, 1955 | Uncertainty assigned by TRC = 0.6 K; TRC |
Tfus | 227.0 | K | N/A | Doolittle, 1954 | Uncertainty assigned by TRC = 0.6 K; TRC |
Tfus | 231.7 | K | N/A | Anonymous, 1953 | Uncertainty assigned by TRC = 2. K; TRC |
Tfus | 227.11 | K | N/A | Stross, Gable, et al., 1947 | Uncertainty assigned by TRC = 0.07 K; TRC |
Quantity | Value | Units | Method | Reference | Comment |
ΔvapH° | 51.0 | kJ/mol | N/A | Ambrose, Ellender, et al., 1975 | Based on data from 322. to 471. K.; AC |
ΔvapH° | 50.92 ± 0.04 | kJ/mol | C | Seller, 1970 | ALS |
ΔvapH° | 50.9 ± 0.1 | kJ/mol | C | Seller, 1970 | AC |
Enthalpy of vaporization
ΔvapH (kJ/mol) | Temperature (K) | Method | Reference | Comment |
---|---|---|---|---|
38.600 | 379.3 | N/A | Svoboda, Kubes, et al., 1992 | Value corrected to 298.15 K, obtained by extrapolation.; DH |
49.8 ± 0.1 | 308. | C | Svoboda, Kubes, et al., 1992 | AC |
49.3 ± 0.1 | 313. | C | Svoboda, Kubes, et al., 1992 | AC |
48.4 ± 0.1 | 323. | C | Svoboda, Kubes, et al., 1992 | AC |
47.9 ± 0.1 | 328. | C | Svoboda, Kubes, et al., 1992 | AC |
47.1 ± 0.1 | 338. | C | Svoboda, Kubes, et al., 1992 | AC |
46.6 ± 0.1 | 343. | C | Svoboda, Kubes, et al., 1992 | AC |
46.1 ± 0.1 | 348. | C | Svoboda, Kubes, et al., 1992 | AC |
45.2 ± 0.1 | 358. | C | Svoboda, Kubes, et al., 1992 | AC |
46.8 | 351. | A,MM | Stephenson and Malanowski, 1987 | Based on data from 336. to 451. K. See also Stross, Gable, et al., 1947, 2.; AC |

Gas phase ion energetics data

Data evaluated as indicated in comments:
L - Sharon G. Lias
Data compiled as indicated in comments:
LLK - Sharon G. Lias, Rhoda D. Levin, and Sherif A. Kafafi
RDSH - Henry M. Rosenstock, Keith Draxl, Bruce W. Steiner, and John T. Herron
Quantity | Value | Units | Method | Reference | Comment |
---|---|---|---|---|---|
IE (evaluated) | 9.01 ± 0.03 | eV | N/A | N/A | L |
Ionization energy determinations
IE (eV) | Method | Reference | Comment |
---|---|---|---|
8.98 ± 0.01 | PE | Hernandez, Masclet, et al., 1977 | LLK |
9.04 ± 0.03 | PI | Vilesov, 1960 | RDSH |

Kovats' RI, non-polar column, isothermal

View large format table.

Column type Active phase Temperature (C) I Reference Comment
CapillaryOV-1333.954.7Hu, Lu, et al., 2006
PackedApiezon L130.935.Wehrli and Kováts, 1959Celite; Column length: 2.25 m
PackedApiezon L190.943.Wehrli and Kováts, 1959Celite; Column length: 2.25 m

Van Den Dool and Kratz RI, non-polar column, temperature ramp

View large format table.

Column type Active phase I Reference Comment
CapillaryPetrocol DH962.1Censullo, Jones, et al., 200350. m/0.25 mm/0.5 μm, He, 35. C @ 10. min, 3. K/min, 200. C @ 10. min
CapillaryDB-1951.2Sun and Stremple, 200330. m/0.25 mm/0.25 μm, He, 3. K/min; Tstart: 40. C; Tend: 325. C

Van Den Dool and Kratz RI, polar column, temperature ramp

View large format table.

Column type Active phase I Reference Comment
CapillaryCarbowax1189.5Censullo, Jones, et al., 200360. m/0.25 mm/0.5 μm, He, 50. C @ 10. min, 5. K/min, 250. C @ 10. min

Normal alkane RI, non-polar column, isothermal

View large format table.

Column type Active phase Temperature (C) I Reference Comment
PackedDC-400150.961.Anderson, 1968Helium, Gas-Pak (60-80 mesh); Column length: 3.0 m

Normal alkane RI, non-polar column, temperature ramp

View large format table.

Column type Active phase I Reference Comment
CapillaryOV-101953.Zenkevich, Eliseenkov, et al., 201125. m/0.20 mm/0.25 μm, Nitrogen, 6. K/min; Tstart: 40. C; Tend: 240. C
CapillaryOV-101956.Zenkevich and Tsibulskaya, 1989Helium, 75. C @ 0. min, 6. K/min, 220. C @ 0. min; Column length: 54. m; Column diameter: 0.26 mm
CapillaryOV-101956.Zenkevich and Tsibulskaya, 1989Helium, 75. C @ 0. min, 6. K/min, 220. C @ 0. min; Column length: 54. m; Column diameter: 0.26 mm

Normal alkane RI, non-polar column, custom temperature program

View large format table.

Column type Active phase I Reference Comment
CapillaryMethyl Silicone945.Chen and Feng, 2007Program: not specified
CapillaryMethyl Silicone955.Feng and Mu, 2007Program: not specified
CapillarySE-30983.Vinogradov, 2004Program: not specified
CapillaryMethyl Silicone955.Estrada and Gutierrez, 1999Program: not specified
CapillaryOV-1999.Ramsey and Flanagan, 1982Program: not specified

Normal alkane RI, polar column, custom temperature program

View large format table.

Column type Active phase I Reference Comment
CapillaryDB-Wax1178.Canuti, Conversano, et al., 200930. m/0.25 mm/0.25 μm, Helium; Program: 40 0C (4 min) 2.5 0C/min -> 80 0C 5 0C/min -> 110 0C 10 0C/min -> 220 0C (5 min)
CapillaryDB-Wax1207.Canuti, Conversano, et al., 200930. m/0.25 mm/0.25 μm, Helium; Program: not specified
CapillaryBP-201162.Pontes, Marques, et al., 200730. m/0.25 mm/0.25 μm, He; Program: 50C(1min) => 2.5C/min => 100C => 2C/min => 180C => 15C/min => 220C
CapillaryCarbowax 20M1207.Vinogradov, 2004Program: not specified
CapillaryCarbowax 20M1207.Ramsey and Flanagan, 1982Program: not specified

References

Seller, 1970
Seller, P.,
Enthalpies of formation of some aliphatic branched ketones,
J. Chem. Thermodyn., 1970, 2, 211-219. [all data]
Vesely, Barcal, et al., 1989
Vesely, F.; Barcal, P.; Zabransky, M.; Svoboda, V.,
Heat capacities of 4-methyl-2-pentanone, 2,6-dimethyl-4-heptanone, 1-hexanol, 1-heptanol, and 1-octanol in the temperature range 298-318 K,
Collect. Czech. Chem. Commun., 1989, 54, 602-607. [all data]
Anonymous, 1958
Anonymous, R.,
, Am. Pet. Inst. Res. Proj. 45, Ohio State Univ., 1958. [all data]
Anonymous, 1955
Anonymous, R.,
, Am. Pet. Inst. Res. Proj. 45, Tech. Rep. 14, No. 1, Ohio State Univ., 1955. [all data]
Doolittle, 1954
Doolittle, A.K.,
The Technology of Solvents and Plasticizers, Wiley-Inter- science, New York, 1954. [all data]
Anonymous, 1953
Anonymous, R.,
, Physical Properties of Chemical Substances, Dow Chemical Company, 1953. [all data]
Stross, Gable, et al., 1947
Stross, F.H.; Gable, C.M.; Rounds. G.C.,
The Vapor Pressures and Some Other Properties of Diisobutyl Ketone and Diisobutylcarbinol,
J. Am. Chem. Soc., 1947, 69, 1629-30. [all data]
Ambrose, Ellender, et al., 1975
Ambrose, D.; Ellender, J.H.; Lees, E.B.; Sprake, C.H.S.; Townsend, R.,
Thermodynamic properties of organic oxygen compounds XXXVIII. Vapour pressures of some aliphatic ketones,
The Journal of Chemical Thermodynamics, 1975, 7, 5, 453-472, https://doi.org/10.1016/0021-9614(75)90275-X
. [all data]
Svoboda, Kubes, et al., 1992
Svoboda, V.; Kubes, V.; Basarova, P.,
Enthalpies of vaporization and cohesive energies of hexan-2-one, 2-methylpentan-4-one, 2,2-dimethylbutan-3-one, 2,6-dimethylheptan-4-one and cyclohexanone,
J. Chem. Thermodynam., 1992, 24, 333-336. [all data]
Stephenson and Malanowski, 1987
Stephenson, Richard M.; Malanowski, Stanislaw,
Handbook of the Thermodynamics of Organic Compounds, 1987, https://doi.org/10.1007/978-94-009-3173-2
. [all data]
Stross, Gable, et al., 1947, 2
Stross, F.H.; Gable, C.M.; Rounds, G.C.,
The Vapor Pressures and Some Other Properties of Di-i-butyl Ketone and Di-i-butylcarbinol,
J. Am. Chem. Soc., 1947, 69, 7, 1629-1630, https://doi.org/10.1021/ja01199a017
. [all data]
Hernandez, Masclet, et al., 1977
Hernandez, R.; Masclet, P.; Mouvier, G.,
Spectroscopie de photoelectrons d'aldehydes et de cetones aliphatiques,
J. Electron Spectrosc. Relat. Phenom., 1977, 10, 333. [all data]
Vilesov, 1960
Vilesov, F.I.,
The photoionization of vapors of compounds whose molecules contain carbonyl groups,
Dokl. Phys. Chem., 1960, 132, 521, In original 1332. [all data]