Pyridine, 2,4,6-trimethyl-
- Formula: C8H11N
- Molecular weight: 121.1796
- IUPAC Standard InChIKey: BWZVCCNYKMEVEX-UHFFFAOYSA-N
- CAS Registry Number: 108-75-8
- Chemical structure:
View 3d structure (requires JavaScript / HTML 5) - Other names: α,γ,α'-Collidine; γ-Collidine; s-Collidine; 2,4,6-Collidine; 2,4,6-Trimethylpyridine; sym-Collidine; 2,4,6-Kollidin; gamma-Collidine; NSC 460

Condensed phase thermochemistry data

Data compiled as indicated in comments:
ALS - Hussein Y. Afeefy, Joel F. Liebman, and Stephen E. Stein
DH - Eugene S. Domalski and Elizabeth D. Hearing
Quantity | Value | Units | Method | Reference | Comment |
---|---|---|---|---|---|
ΔfH°liquid | -7.41 ± 0.55 | kcal/mol | Ccb | Ribeiro da Silva, Matos, et al., 1997 | ALS |
Quantity | Value | Units | Method | Reference | Comment |
ΔcH°liquid | -1120.7 ± 0.48 | kcal/mol | Ccb | Ribeiro da Silva, Matos, et al., 1997 | ALS |
Constant pressure heat capacity of liquid
Cp,liquid (cal/mol*K) | Temperature (K) | Reference | Comment |
---|---|---|---|
51.41 | 300.60 | Svoboda and Zabransky, 1991 | T = 300 to 328 K. Cp(liq) = 81.418 + 0.44263T J/mol*K (300 to 328 K).; DH |

Phase change data

Data compiled as indicated in comments:
BS - Robert L. Brown and Stephen E. Stein
TRC - Thermodynamics Research Center, NIST Boulder Laboratories, Chris Muzny director
AC - William E. Acree, Jr., James S. Chickos
DH - Eugene S. Domalski and Elizabeth D. Hearing
Quantity | Value | Units | Method | Reference | Comment |
---|---|---|---|---|---|
Tboil | 444. ± 3. | K | AVG | N/A | Average of 7 values; Individual data points |
Quantity | Value | Units | Method | Reference | Comment |
Tfus | 228.15 | K | N/A | Assal, 1966 | Uncertainty assigned by TRC = 1. K; TRC |
Tfus | 228.95 | K | N/A | Mastrangelo, 1957 | Uncertainty assigned by TRC = 0.05 K; TRC |
Tfus | 228.69 | K | N/A | Brown, Johnson, et al., 1954 | Uncertainty assigned by TRC = 0.1 K; TRC |
Quantity | Value | Units | Method | Reference | Comment |
ΔvapH° | 12.0 ± 0.69 | kcal/mol | CGC | Lipkind and Chickos, 2009 | Based on data from 342. to 373. K.; AC |
ΔvapH° | 12.0 | kcal/mol | CGC | Chickos, Hosseini, et al., 1995 | Based on data from 323. to 373. K.; AC |
ΔvapH° | 12.0 ± 0.05 | kcal/mol | N/A | Majer, Svoboda, et al., 1985 | AC |
Enthalpy of vaporization
ΔvapH (kcal/mol) | Temperature (K) | Method | Reference | Comment |
---|---|---|---|---|
11.1 | 363. | N/A | Sakoguchi, Ueoka, et al., 1995 | Based on data from 303. to 424. K.; AC |
12.2 | 313. | EB | Lencka, 1990 | Based on data from 298. to 444. K.; AC |
11.5 | 328. | C | Majer, Svoboda, et al., 1985 | AC |
11.3 | 343. | C | Majer, Svoboda, et al., 1985 | AC |
10.9 | 368. | C | Majer, Svoboda, et al., 1985 | AC |
Enthalpy of fusion
ΔfusH (kcal/mol) | Temperature (K) | Reference | Comment |
---|---|---|---|
2.279 | 228.96 | Mastrangelo, 1957, 2 | DH |
2.28 | 229. | Domalski and Hearing, 1996 | AC |

Gas phase ion energetics data

Data compiled by: Sharon G. Lias, Rhoda D. Levin, and Sherif A. Kafafi
Ionization energy determinations
IE (eV) | Method | Reference | Comment |
---|---|---|---|
8.9 ± 0.1 | PE | Ramsey and Walker, 1974 | Vertical value |

Normal alkane RI, non-polar column, custom temperature program

Data compiled by: NIST Mass Spectrometry Data Center, William E. Wallace, director

Column type Capillary
Active phase SE-30
Column length (m)
Carrier gas
Substrate
Column diameter (mm)
Phase thickness (μm)
Program not specified
I 1004.
ReferenceLi, Gao, et al., 2000
Comment MSDC-RI

Kovats' RI, non-polar column, isothermal

View large format table.

Column type Active phase Temperature (C) I Reference Comment
PackedC78, Branched paraffin130.986.6Dallos, Sisak, et al., 2000He; Column length: 3.3 m
PackedC78, Branched paraffin130.986.6Reddy, Dutoit, et al., 1992Chromosorb G HP; Column length: 3.3 m
PackedApolane130.988.Dutoit, 1991Column length: 3.7 m
CapillarySE-30110.976.Samusenko and Golovnya, 198825. m/0.32 mm/1. μm, He
CapillarySE-3080.972.Samusenko and Golovnya, 198825. m/0.32 mm/1. μm, He
CapillaryOV-101150.982.Morishita, Morimoto, et al., 1986N2; Column length: 20. m; Column diameter: 0.23 mm
PackedSE-30150.985.Tiess, 1984Ar, Gas Chrom Q (80-100 mesh); Column length: 3. m
PackedApiezon L130.1012.Shatts, Avots, et al., 1977He, Chromosorb W AW-DMCS; Column length: 2.4 m
PackedPMS-100130.996.Anderson, Jurel, et al., 1973He, Celite 545 (44-60 mesh); Column length: 3. m
PackedPMS-100150.980.Anderson, Jurel, et al., 1973He, Celite 545 (44-60 mesh); Column length: 3. m
PackedPMS-100180.976.Anderson, Jurel, et al., 1973He, Celite 545 (44-60 mesh); Column length: 3. m

Kovats' RI, polar column, isothermal

View large format table.

Column type Active phase Temperature (C) I Reference Comment
CapillaryPEG-40M110.1368.Golovnya, Samusenko, et al., 1987He; Column length: 50. m; Column diameter: 0.3 mm
CapillaryPEG-40M80.1353.Golovnya, Samusenko, et al., 1987He; Column length: 50. m; Column diameter: 0.3 mm
CapillaryPEG-20M150.1410.Morishita, Morimoto, et al., 1986N2; Column length: 20. m; Column diameter: 0.23 mm
PackedPEG-2000150.1405.Anderson, Jurel, et al., 1973He, Celite 545 (44-60 mesh); Column length: 3. m
PackedPEG-2000152.1397.Anderson, Jurel, et al., 1973He, Celite 545 (44-60 mesh); Column length: 3. m
PackedPEG-2000179.1405.Anderson, Jurel, et al., 1973He, Celite 545 (44-60 mesh); Column length: 3. m
PackedPEG-2000180.1402.Anderson, Jurel, et al., 1973He, Celite 545 (44-60 mesh); Column length: 3. m
PackedPEG-2000200.1398.Anderson, Jurel, et al., 1973He, Celite 545 (44-60 mesh); Column length: 3. m

Van Den Dool and Kratz RI, non-polar column, temperature ramp

View large format table.

Column type Active phase I Reference Comment
CapillaryOV-101976.Golovnya, Samusenko, et al., 1988He, 2. K/min; Column length: 50. m; Column diameter: 0.25 mm; Tstart: 100. C
CapillaryOV-101977.Golovnya, Samusenko, et al., 1988He, 8. K/min; Column length: 50. m; Column diameter: 0.25 mm; Tstart: 70. C
CapillaryOV-101977.Golovnya, Samusenko, et al., 1988He, 4. K/min; Column length: 50. m; Column diameter: 0.25 mm; Tstart: 80. C
CapillaryDB-5993.Premecz and Ford, 1987He, 60. C @ 10. min, 10. K/min, 280. C @ 3. min; Column length: 30. m; Column diameter: 0.32 mm
CapillaryDB-5987.Rostad and Pereira, 198630. m/0.26 mm/0.25 μm, He, 50. C @ 4. min, 6. K/min, 300. C @ 20. min

Van Den Dool and Kratz RI, polar column, temperature ramp

View large format table.

Column type Active phase I Reference Comment
CapillaryCP-Wax 52CB1355.Alasalvar, Taylor, et al., 200560. m/0.25 mm/0.25 μm, 35. C @ 4. min, 3. K/min; Tend: 203. C
CapillarySupelcowax-101365.Chung, 200060. m/0.25 mm/0.25 μm, He, 2. K/min, 195. C @ 90. min; Tstart: 35. C
CapillarySupelcowax-101365.Chung, 199960. m/0.25 mm/0.25 μm, He, 35. C @ 5. min, 2. K/min, 195. C @ 90. min
CapillarySupelcowax-101365.Chung, 1999, 260. m/0.25 mm/0.25 μm, He, 35. C @ 5. min, 2. K/min, 195. C @ 90. min
CapillarySupelcowax-101364.Cadwallader, Tan, et al., 199560. m/0.25 mm/0.25 μm, He, 40. C @ 5. min, 2. K/min, 200. C @ 30. min
CapillaryPEG-40M1372.Golovnya, Samusenko, et al., 198825. m/0.32 mm/0.80 μm, He, 2. K/min; Tstart: 100. C
CapillaryPEG-40M1375.Golovnya, Samusenko, et al., 198825. m/0.32 mm/0.80 μm, He, 8. K/min; Tstart: 70. C
CapillaryPEG-40M1371.Golovnya, Samusenko, et al., 198825. m/0.32 mm/0.80 μm, He, 4. K/min; Tstart: 80. C
CapillaryCAM1358.Premecz and Ford, 1987He, 60. C @ 5. min, 5. K/min, 240. C @ 21. min; Column length: 15. m; Column diameter: 0.24 mm

Van Den Dool and Kratz RI, polar column, custom temperature program

View large format table.

Column type Active phase I Reference Comment
CapillaryCP-Wax 52CB1360.Alasalvar, Shahidi, et al., 200360. m/0.25 mm/0.25 μm, He; Program: 40C => 5C/min => 60C => 2.5C/min => 155C
CapillaryDB-Wax1378.Pennarun, Prost, et al., 200330. m/0.32 mm/0.5 μm, He; Program: 50C => 6C/min => 70C => 4C/min => 150C => 10C/min => 250C
CapillaryDB-Wax1378.Pennarun, Prost, et al., 200230. m/0.32 mm/0.5 μm, He; Program: 50C => 6C/min => 70C => 4C/min => 150C => 10C/min => 250C
CapillarySupelcowax-101362.Baek and Cadwallader, 199660. m/0.25 mm/0.25 μm; Program: 40C => (6C/min) => 80C(6min) => (15C/min) => 200C(10min)

Normal alkane RI, non-polar column, temperature ramp

View large format table.

Column type Active phase I Reference Comment
CapillaryHP-5 MS996.Lazarevic, Radulovic, et al., 201030. m/0.25 mm/0.25 μm, Helium, 5. K/min; Tstart: 70. C; Tend: 290. C
CapillaryHP-5999.Radulovic, Dordevic, et al., 201030. m/0.25 mm/0.25 μm, Hydrogen, 5. K/min; Tstart: 70. C; Tend: 290. C
CapillarySE-30976.5Bur'yan and Nabivach, 19921.7 K/min; Tstart: 82. C; Tend: 177. C

Lee's RI, non-polar column, temperature ramp

View large format table.

Column type Active phase I Reference Comment
CapillaryDB-5158.66Rostad and Pereira, 198630. m/0.26 mm/0.25 μm, He, 50. C @ 4. min, 6. K/min, 300. C @ 20. min

References

Ribeiro da Silva, Matos, et al., 1997
Ribeiro da Silva, M.A.V.; Matos, M.A.R.; do Rio, C.M.A.,
Standard molar enthalpy of formation of 2,4,6-trimethylpyridine,
J. Chem. Thermodyn., 1997, 29, 901-906. [all data]
Svoboda and Zabransky, 1991
Svoboda, V.; Zabransky, M.,
Heat capacities of liquid 2,3,6-trimethylpyridine, 2,4,6-trimethylpyridine and 3-methoxypropionitrile within the range of temperatures of 300 to 328 K,
Collect. Czech. Chem. Commun., 1991, 56(12), 2786-2790. [all data]
Assal, 1966
Assal, F.A.,
Vapour-liquid equilibria in phenol-pyridine base systems,
Bull. Acad. Pol. Sci., Ser. Sci. Chim., 1966, 14, 603. [all data]
Mastrangelo, 1957
Mastrangelo, S.V.R.,
Adiabatic calorimeter for determination of cryoscopic data.,
Anal. Chem., 1957, 29, 841. [all data]
Brown, Johnson, et al., 1954
Brown, H.C.; Johnson, S.; Podall, H.,
Purification and Physical Properties of 2,6-Lutidine and 2,4,6-Collidine,
J. Am. Chem. Soc., 1954, 76, 5556. [all data]
Lipkind and Chickos, 2009
Lipkind, Dmitri; Chickos, James S.,
An examination of the vaporization enthalpies and vapor pressures of pyrazine, pyrimidine, pyridazine, and 1,3,5-triazine,
Struct Chem, 2009, 20, 1, 49-58, https://doi.org/10.1007/s11224-008-9389-5
. [all data]
Chickos, Hosseini, et al., 1995
Chickos, James S.; Hosseini, Sarah; Hesse, Donald G.,
Determination of vaporization enthalpies of simple organic molecules by correlations of changes in gas chromatographic net retention times,
Thermochimica Acta, 1995, 249, 41-62, https://doi.org/10.1016/0040-6031(95)90670-3
. [all data]
Majer, Svoboda, et al., 1985
Majer, V.; Svoboda, V.; Lencka, M.,
Enthalpies of vaporization and cohesive energies of dimethylpyridines and trimethylpyridines,
The Journal of Chemical Thermodynamics, 1985, 17, 4, 365-370, https://doi.org/10.1016/0021-9614(85)90133-8
. [all data]
Sakoguchi, Ueoka, et al., 1995
Sakoguchi, Akihiro; Ueoka, Ryuichi; Kato, Yasuo; Arai, Yasuhiko,
Vapor Pressures of Alkylpyridines and Alkylpyrazines.,
KAGAKU KOGAKU RONBUNSHU, 1995, 21, 1, 219-223, https://doi.org/10.1252/kakoronbunshu.21.219
. [all data]
Lencka, 1990
Lencka, Malgorzata,
Measurements of the vapour pressures of pyridine, 2-methylpyridine, 2,4-dimethylpyridine, 2,6-dimethylpyridine, and 2,4,6-trimethylpyridine from 0.1 kPa to atmospheric pressure using a modified Swietoslawski ebulliometer,
The Journal of Chemical Thermodynamics, 1990, 22, 5, 473-480, https://doi.org/10.1016/0021-9614(90)90139-H
. [all data]
Mastrangelo, 1957, 2
Mastrangelo, S.V.R.,
Adiabatic calorimeter for determination of cryoscopic data,
Anal. Chem., 1957, 29(5), 841-845. [all data]
Domalski and Hearing, 1996
Domalski, Eugene S.; Hearing, Elizabeth D.,
Heat Capacities and Entropies of Organic Compounds in the Condensed Phase. Volume III,
J. Phys. Chem. Ref. Data, 1996, 25, 1, 1, https://doi.org/10.1063/1.555985
. [all data]
Ramsey and Walker, 1974
Ramsey, B.G.; Walker, F.A.,
A linear relationship between substituted pyridine lone pair vertical ionization potentials and pKa,
J. Am. Chem. Soc., 1974, 96, 3314. [all data]