1,3,5-Triazine, hexahydro-1,3,5-trimethyl-
- Formula: C6H15N3
- Molecular weight: 129.2034
- IUPAC Standard InChIKey: DPMZXMBOYHBELT-UHFFFAOYSA-N
- CAS Registry Number: 108-74-7
- Chemical structure:
View 3d structure (requires JavaScript / HTML 5) - Other names: s-Triazine, hexahydro-1,3,5-trimethyl-; F 7771; Hexahydro-1,3,5-Trimethyl-s-triazine; 1,3,5-Trimethylhexahydro-s-triazine; 1,3,5-Trimethylhexahydro-1,3,5-triazine; 1,3,5-Trimethylhexahydro-sym-triazine; hexahydro-1,3,5-trimethyl-1,3,5-triazine

Phase change data

Data compiled as indicated in comments:
BS - Robert L. Brown and Stephen E. Stein
AC - William E. Acree, Jr., James S. Chickos
Quantity | Value | Units | Method | Reference | Comment |
---|---|---|---|---|---|
Tboil | 436.0 | K | N/A | Aldrich Chemical Company Inc., 1990 | BS |
Quantity | Value | Units | Method | Reference | Comment |
ΔvapH° | 51.2 ± 0.8 | kJ/mol | GS | Verevkin, 2002 | Based on data from 284. to 328. K.; AC |
Enthalpy of vaporization
ΔvapH (kJ/mol) | Temperature (K) | Method | Reference | Comment |
---|---|---|---|---|
50.8 ± 0.8 | 306. | GS | Verevkin, 2002 | Based on data from 284. to 328. K.; AC |

Gas phase ion energetics data

Data evaluated as indicated in comments:
L - Sharon G. Lias
Data compiled as indicated in comments:
LBLHLM - Sharon G. Lias, John E. Bartmess, Joel F. Liebman, John L. Holmes, Rhoda D. Levin, and W. Gary Mallard
LLK - Sharon G. Lias, Rhoda D. Levin, and Sherif A. Kafafi
Quantity | Value | Units | Method | Reference | Comment |
---|---|---|---|---|---|
IE (evaluated) | 7.6 | eV | N/A | N/A | L |
Ionization energy determinations
IE (eV) | Method | Reference | Comment |
---|---|---|---|
7.6 | PE | Beck, Hunig, et al., 1986 | LBLHLM |
7.6 | PE | Frost, MacDonald, et al., 1978 | LLK |
8.26 | PE | Beck, Hunig, et al., 1986 | Vertical value; LBLHLM |
8.33 ± 0.05 | PE | Frost, MacDonald, et al., 1978 | Vertical value; LLK |

References

Aldrich Chemical Company Inc., 1990
Aldrich Chemical Company Inc.,
Catalog Handbook of Fine Chemicals, Aldrich Chemical Company, Inc., Milwaukee WI, 1990, 1. [all data]
Verevkin, 2002
Verevkin, Sergey P.,
Relationships among strain energies of mono- and poly-cyclic cyclohexanoid molecules and strain of their component rings,
The Journal of Chemical Thermodynamics, 2002, 34, 2, 263-275, https://doi.org/10.1006/jcht.2001.0896
. [all data]
Beck, Hunig, et al., 1986
Beck, K.; Hunig, S.; Poppek, R.; Prokschy, F.; Rademacher, P.,
Photoelektronenspektroscopische untersuchungen an hexahydro-1,3,5-triazinen,
Chem. Ber., 1986, 119, 554. [all data]
Frost, MacDonald, et al., 1978
Frost, D.C.; MacDonald, B.; McDowell, C.A.; Westwood, N.P.C.,
Pyrolysis of trimethyl hexahydro-s-triazines. The photoelectron spectra of N-methylmethylenimine, CH2=NCH3, and C-methyl- methylenimine, CH3CH=NH,
J. Electron Spectrosc. Relat. Phenom., 1978, 14, 379. [all data]