Mesitylene
- Formula: C9H12
- Molecular weight: 120.1916
- IUPAC Standard InChIKey: AUHZEENZYGFFBQ-UHFFFAOYSA-N
- CAS Registry Number: 108-67-8
- Chemical structure:
View 3d structure (requires JavaScript / HTML 5) - Other names: Benzene, 1,3,5-trimethyl-; s-Trimethylbenzene; 1,3,5-Trimethylbenzene; sym-Trimethylbenzene; Fleet-X; TMB; UN 2325; 2,4,6-Trimethylbenzene; 3,5-Dimethyltoluene; NSC 9273; Trimethylbenzene; Trimethylbenzol; 1,3,5-trimethylbenzene (mesitylene); Trimethylbenzene (Related); Trimethylbenzol (Related)

Gas phase thermochemistry data

Data compiled by: Glushko Thermocenter, Russian Academy of Sciences, Moscow
Quantity | Value | Units | Method | Reference | Comment |
---|---|---|---|---|---|
S°gas | 92.09 ± 0.15 | cal/mol*K | N/A | Taylor R.D., 1955 |
Constant pressure heat capacity of gas
Cp,gas (cal/mol*K) | Temperature (K) | Reference | Comment |
---|---|---|---|
24.93 | 200. | Draeger, 1985 | Discrepancies with other statistically calculated values of S(T) and Cp(T) amount to 1, 2, and 3 J/mol*K for [ Thermodynamics Research Center, 1997], [ Pitzer K.S., 1943], and [ Taylor W.J., 1946], respectively. |
32.50 | 273.15 | ||
35.23 ± 0.1 | 298.15 | ||
35.44 | 300. | ||
46.30 | 400. | ||
56.07 | 500. | ||
64.34 | 600. | ||
71.27 | 700. | ||
77.13 | 800. | ||
82.10 | 900. | ||
86.33 | 1000. | ||
89.96 | 1100. | ||
93.09 | 1200. | ||
95.77 | 1300. | ||
98.09 | 1400. | ||
100.1 | 1500. |

Condensed phase thermochemistry data

Data compiled as indicated in comments:
ALS - Hussein Y. Afeefy, Joel F. Liebman, and Stephen E. Stein
DH - Eugene S. Domalski and Elizabeth D. Hearing
Quantity | Value | Units | Method | Reference | Comment |
---|---|---|---|---|---|
ΔcH°liquid | -1241.19 ± 0.31 | kcal/mol | Ccb | Johnson, Prosen, et al., 1945 | Corresponding ΔfHºliquid = -15.16 kcal/mol (simple calculation by NIST; no Washburn corrections); ALS |
ΔcH°liquid | -1243.5 | kcal/mol | Ccb | Richards and Barry, 1915 | At 291 K; Corresponding ΔfHºliquid = -12.9 kcal/mol (simple calculation by NIST; no Washburn corrections); ALS |
Quantity | Value | Units | Method | Reference | Comment |
S°liquid | 65.380 | cal/mol*K | N/A | Taylor and Kilpatrick, 1955 | DH |
Constant pressure heat capacity of liquid
Cp,liquid (cal/mol*K) | Temperature (K) | Reference | Comment |
---|---|---|---|
49.677 | 298.15 | Grolier, Roux-Desgranges, et al., 1993 | DH |
49.12 | 294.99 | Andolenko and Grigor'ev, 1979 | T = 295 to 424 K. Unsmoothed experimental datum given as 1.710 kJ/kg*K.; DH |
49.632 | 298.15 | Wilhelm, Faradjzadeh, et al., 1979 | DH |
49.6381 | 298.15 | Fortier and Benson, 1977 | DH |
49.35 | 298. | Recko, 1968 | T = 24 to 40°C. Equation only.; DH |
48.150 | 299.8 | Helfrey, Heiser, et al., 1955 | T = 80 to 220°F.; DH |
50.031 | 298.15 | Taylor and Kilpatrick, 1955 | T = 20 to 305 K.; DH |
50.91 | 298. | Kurbatov, 1947 | T = 15 to 155°C, mean Cp, five temperatures.; DH |
50.50 | 298. | von Reis, 1881 | T = 292 to 403 K.; DH |

Phase change data

Data compiled as indicated in comments:
BS - Robert L. Brown and Stephen E. Stein
TRC - Thermodynamics Research Center, NIST Boulder Laboratories, Chris Muzny director
AC - William E. Acree, Jr., James S. Chickos
ALS - Hussein Y. Afeefy, Joel F. Liebman, and Stephen E. Stein
DH - Eugene S. Domalski and Elizabeth D. Hearing
Quantity | Value | Units | Method | Reference | Comment |
---|---|---|---|---|---|
Tboil | 437.8 ± 0.8 | K | AVG | N/A | Average of 48 out of 54 values; Individual data points |
Quantity | Value | Units | Method | Reference | Comment |
Tfus | 225. ± 8. | K | AVG | N/A | Average of 21 out of 22 values; Individual data points |
Quantity | Value | Units | Method | Reference | Comment |
Ttriple | 228.42 | K | N/A | Taylor and Kilpatrick, 1955, 2 | Crystal phase 1 phase; Uncertainty assigned by TRC = 0.01 K; TRC |
Quantity | Value | Units | Method | Reference | Comment |
Tc | 639. ± 4. | K | AVG | N/A | Average of 8 values; Individual data points |
Quantity | Value | Units | Method | Reference | Comment |
Pc | 30.9 ± 0.4 | atm | N/A | Tsonopoulos and Ambrose, 1995 | |
Pc | 31.206 | atm | N/A | Kay and Pak, 1980 | Uncertainty assigned by TRC = 0.0031 atm; Visual, Table 2, mercury interface at room temperature.; TRC |
Pc | 32.12 | atm | N/A | Kay and Pak, 1980 | Uncertainty assigned by TRC = 0.0032 atm; Visual, Table 2, mercury interface at sample tempera; TRC |
Pc | 30.86 | atm | N/A | Ambrose, Broderick, et al., 1967 | Uncertainty assigned by TRC = 0.06 atm; TRC |
Pc | 32.17 | atm | N/A | Altschul, 1893 | Uncertainty assigned by TRC = 0.0968 atm; TRC |
Quantity | Value | Units | Method | Reference | Comment |
ΔvapH° | 11.36 ± 0.02 | kcal/mol | AVG | N/A | Average of 8 values; Individual data points |
Enthalpy of vaporization
ΔvapH (kcal/mol) | Temperature (K) | Method | Reference | Comment |
---|---|---|---|---|
11.0 ± 0.31 | 319. | MM | Wiberg and Waldron, 1991 | Based on data from 296. to 342. K.; AC |
10.4 | 363. | N/A | Park and Gmehling, 1989 | Based on data from 348. to 424. K.; AC |
11.9 | 264. | A | Stephenson and Malanowski, 1987 | Based on data from 249. to 356. K.; AC |
10.5 | 369. | A | Stephenson and Malanowski, 1987 | Based on data from 354. to 445. K. See also Forziati, Norris, et al., 1949.; AC |
11.4 | 286. | MM | Chickos, Hyman, et al., 1981 | Based on data from 273. to 299. K.; AC |
12.2 | 262. | RG | Hopke and Sears, 1948 | Based on data from 255. to 268. K.; AC |
Antoine Equation Parameters
log10(P) = A − (B / (T + C))
P = vapor pressure (atm)
T = temperature (K)
View plot Requires a JavaScript / HTML 5 canvas capable browser.
Temperature (K) | A | B | C | Reference |
---|---|---|---|---|
354.64 to 438.87 | 4.19356 | 1569.622 | -63.572 | Forziati, Norris, et al., 1949, 2 |
Enthalpy of fusion
ΔfusH (kcal/mol) | Temperature (K) | Reference | Comment |
---|---|---|---|
2.27 | 228.4 | Domalski and Hearing, 1996 | See also Radomska and Radomski, 1991.; AC |
2.27 | 228.4 | Radomska and Radomski, 1991 | AC |
Enthalpy of phase transition
ΔHtrs (kcal/mol) | Temperature (K) | Initial Phase | Final Phase | Reference | Comment |
---|---|---|---|---|---|
2.2741 | 228.42 | crystaline, I | liquid | Taylor and Kilpatrick, 1955 | Metastable melting points at 221.46 K and 223.35 K.; DH |
Entropy of phase transition
ΔStrs (cal/mol*K) | Temperature (K) | Initial Phase | Final Phase | Reference | Comment |
---|---|---|---|---|---|
9.955 | 228.42 | crystaline, I | liquid | Taylor and Kilpatrick, 1955 | Metastable; DH |

Reaction thermochemistry data

Data compiled as indicated in comments:
M - Michael M. Meot-Ner (Mautner) and Sharon G. Lias
ALS - Hussein Y. Afeefy, Joel F. Liebman, and Stephen E. Stein
B - John E. Bartmess
RCD - Robert C. Dunbar
Individual Reactions
By formula: C3H9Si+ + C9H12 = (C3H9Si+ • C9H12)
Quantity | Value | Units | Method | Reference | Comment |
---|---|---|---|---|---|
ΔrH° | 31.0 | kcal/mol | PHPMS | Wojtyniak and Stone, 1986 | gas phase; switching reaction,Thermochemical ladder((CH3)3Si+)(C6H6), Entropy change calculated or estimated; M |
Quantity | Value | Units | Method | Reference | Comment |
ΔrS° | 35.2 | cal/mol*K | N/A | Wojtyniak and Stone, 1986 | gas phase; switching reaction,Thermochemical ladder((CH3)3Si+)(C6H6), Entropy change calculated or estimated; M |
Free energy of reaction
ΔrG° (kcal/mol) | T (K) | Method | Reference | Comment |
---|---|---|---|---|
14.6 | 468. | PHPMS | Wojtyniak and Stone, 1986 | gas phase; switching reaction,Thermochemical ladder((CH3)3Si+)(C6H6), Entropy change calculated or estimated; M |
By formula: C3H9Sn+ + C9H12 = (C3H9Sn+ • C9H12)
Quantity | Value | Units | Method | Reference | Comment |
---|---|---|---|---|---|
ΔrH° | 32.0 | kcal/mol | PHPMS | Stone and Splinter, 1984 | gas phase; switching reaction((CH3)3Sn+)CH3OH, Entropy change calculated or estimated; M |
Quantity | Value | Units | Method | Reference | Comment |
ΔrS° | 31.8 | cal/mol*K | N/A | Stone and Splinter, 1984 | gas phase; switching reaction((CH3)3Sn+)CH3OH, Entropy change calculated or estimated; M |
Free energy of reaction
ΔrG° (kcal/mol) | T (K) | Method | Reference | Comment |
---|---|---|---|---|
15.3 | 525. | PHPMS | Stone and Splinter, 1984 | gas phase; switching reaction((CH3)3Sn+)CH3OH, Entropy change calculated or estimated; M |
By formula: C9H13+ + C9H12 = (C9H13+ • C9H12)
Quantity | Value | Units | Method | Reference | Comment |
---|---|---|---|---|---|
ΔrH° | 12.4 | kcal/mol | PHPMS | Meot-Ner (Mautner), 1980 | gas phase; Entropy change calculated or estimated; M |
Quantity | Value | Units | Method | Reference | Comment |
ΔrS° | 28. | cal/mol*K | N/A | Meot-Ner (Mautner), 1980 | gas phase; Entropy change calculated or estimated; M |
Free energy of reaction
ΔrG° (kcal/mol) | T (K) | Method | Reference | Comment |
---|---|---|---|---|
4.8 | 272. | PHPMS | Meot-Ner (Mautner), 1980 | gas phase; Entropy change calculated or estimated; M |
By formula: C11H10+ + C9H12 = (C11H10+ • C9H12)
Bond type: Charge transfer bond (positive ion)
Quantity | Value | Units | Method | Reference | Comment |
---|---|---|---|---|---|
ΔrH° | 13.9 | kcal/mol | PHPMS | El-Shall and Meot-Ner (Mautner), 1987 | gas phase; M |
Quantity | Value | Units | Method | Reference | Comment |
ΔrS° | 29.7 | cal/mol*K | PHPMS | El-Shall and Meot-Ner (Mautner), 1987 | gas phase; M |
By formula: C6H7N+ + C9H12 = (C6H7N+ • C9H12)
Bond type: Charge transfer bond (positive ion)
Quantity | Value | Units | Method | Reference | Comment |
---|---|---|---|---|---|
ΔrH° | 15.3 | kcal/mol | PHPMS | Meot-Ner (Mautner) and El-Shall, 1986 | gas phase; M |
Quantity | Value | Units | Method | Reference | Comment |
ΔrS° | 25.6 | cal/mol*K | PHPMS | Meot-Ner (Mautner) and El-Shall, 1986 | gas phase; M |
By formula: C9H12+ + C9H12 = (C9H12+ • C9H12)
Bond type: Charge transfer bond (positive ion)
Quantity | Value | Units | Method | Reference | Comment |
---|---|---|---|---|---|
ΔrH° | 17.2 | kcal/mol | PHPMS | Meot-Ner (Mautner), Hamlet, et al., 1978 | gas phase; M |
Quantity | Value | Units | Method | Reference | Comment |
ΔrS° | 30. | cal/mol*K | PHPMS | Meot-Ner (Mautner), Hamlet, et al., 1978 | gas phase; M |
By formula: C9H12 + 3H2 = C9H18
Quantity | Value | Units | Method | Reference | Comment |
---|---|---|---|---|---|
ΔrH° | -46.88 ± 0.20 | kcal/mol | Chyd | Dolliver, Gresham, et al., 1937 | gas phase; Reanalyzed by Cox and Pilcher, 1970, Original value = -47.6 ± 0.2 kcal/mol; At 355 °K; ALS |
By formula: Cl- + C9H12 = (Cl- • C9H12)
Quantity | Value | Units | Method | Reference | Comment |
---|---|---|---|---|---|
ΔrG° | 4.50 | kcal/mol | TDEq | French, Ikuta, et al., 1982 | gas phase; B |
Free energy of reaction
ΔrG° (kcal/mol) | T (K) | Method | Reference | Comment |
---|---|---|---|---|
4.5 | 300. | PHPMS | French, Ikuta, et al., 1982 | gas phase; M |
By formula: H4N+ + C9H12 = (H4N+ • C9H12)
Quantity | Value | Units | Method | Reference | Comment |
---|---|---|---|---|---|
ΔrH° | 21.8 | kcal/mol | PHPMS | Deakyne and Meot-Ner (Mautner), 1985 | gas phase; M |
Quantity | Value | Units | Method | Reference | Comment |
ΔrS° | 21.2 | cal/mol*K | PHPMS | Deakyne and Meot-Ner (Mautner), 1985 | gas phase; M |
By formula: 2C9H12 + 6H2 = C9H18 + C9H18
Quantity | Value | Units | Method | Reference | Comment |
---|---|---|---|---|---|
ΔrH° | -47.3 ± 0.5 | kcal/mol | Eqk | Egan and Buss, 1959 | gas phase; At 480-571 K; ALS |
By formula: (Cr+ • C9H12) + C9H12 = (Cr+ • 2C9H12)
Quantity | Value | Units | Method | Reference | Comment |
---|---|---|---|---|---|
ΔrH° | 50.7 ± 9.1 | kcal/mol | RAK | Lin and Dunbar, 1997 | RCD |
By formula: Cr+ + C9H12 = (Cr+ • C9H12)
Quantity | Value | Units | Method | Reference | Comment |
---|---|---|---|---|---|
ΔrH° | 46.1 ± 6.9 | kcal/mol | RAK | Lin and Dunbar, 1997 | RCD |
By formula: Ca+ + C9H12 = (Ca+ • C9H12)
Quantity | Value | Units | Method | Reference | Comment |
---|---|---|---|---|---|
ΔrH° | 32.3 | kcal/mol | RAK | Gapeev and Dunbar, 2000 | RCD |
By formula: Sr+ + C9H12 = (Sr+ • C9H12)
Quantity | Value | Units | Method | Reference | Comment |
---|---|---|---|---|---|
ΔrH° | 27.7 | kcal/mol | RAK | Gapeev and Dunbar, 2000 | RCD |

Henry's Law data

Data compiled by: Rolf Sander
Henry's Law constant (water solution)
kH(T) = k°H exp(d(ln(kH))/d(1/T) ((1/T) - 1/(298.15 K)))
k°H = Henry's law constant for solubility in water at 298.15 K (mol/(kg*bar))
d(ln(kH))/d(1/T) = Temperature dependence constant (K)
k°H (mol/(kg*bar)) | d(ln(kH))/d(1/T) (K) | Method | Reference | Comment |
---|---|---|---|---|
0.12 | Q | N/A | missing citation give several references for the Henry's law constants but don't assign them to specific species. | |
0.14 | 3600. | X | N/A | |
0.17 | L | N/A |

Gas phase ion energetics data

Data evaluated as indicated in comments:
HL - Edward P. Hunter and Sharon G. Lias
L - Sharon G. Lias
Data compiled as indicated in comments:
MM - Michael M. Meot-Ner (Mautner)
LBLHLM - Sharon G. Lias, John E. Bartmess, Joel F. Liebman, John L. Holmes, Rhoda D. Levin, and W. Gary Mallard
LLK - Sharon G. Lias, Rhoda D. Levin, and Sherif A. Kafafi
RDSH - Henry M. Rosenstock, Keith Draxl, Bruce W. Steiner, and John T. Herron
Quantity | Value | Units | Method | Reference | Comment |
---|---|---|---|---|---|
IE (evaluated) | 8.40 ± 0.01 | eV | N/A | N/A | L |
Quantity | Value | Units | Method | Reference | Comment |
Proton affinity (review) | 199.9 | kcal/mol | N/A | Hunter and Lias, 1998 | HL |
Quantity | Value | Units | Method | Reference | Comment |
Gas basicity | 193.3 | kcal/mol | N/A | Hunter and Lias, 1998 | HL |
Proton affinity at 298K
Proton affinity (kcal/mol) | Reference | Comment |
---|---|---|
199.6 | Aue, Guidoni, et al., 2000 | Experimental literature data re-evaluated by the authors using ab initio protonation entropies; MM |
Gas basicity at 298K
Gas basicity (review) (kcal/mol) | Reference | Comment |
---|---|---|
193.3 | Aue, Guidoni, et al., 2000 | Experimental literature data re-evaluated by the authors using ab initio protonation entropies; MM |
Ionization energy determinations
IE (eV) | Method | Reference | Comment |
---|---|---|---|
8.41 ± 0.01 | EQ | Lias and Ausloos, 1978 | LLK |
8.46 | CTS | Kobayashi, Kobayashi, et al., 1973 | LLK |
8.2 ± 0.1 | EI | Gilbert, Leach, et al., 1973 | LLK |
8.47 | CTS | Huttner and Fischer, 1967 | RDSH |
8.40 ± 0.01 | PI | Watanabe, Nakayama, et al., 1962 | RDSH |
8.55 | CTS | Kinoshita, 1962 | RDSH |
8.39 ± 0.01 | PI | Price, Bralsford, et al., 1959 | RDSH |
8.41 ± 0.02 | PI | Vilesov and Terenin, 1957 | RDSH |
8.42 | PE | Howell, Goncalves, et al., 1984 | Vertical value; LBLHLM |
8.42 | PE | Cetinkaya, Lappert, et al., 1983 | Vertical value; LBLHLM |
8.45 | PE | Worley and Webb, 1980 | Vertical value; LLK |
8.45 ± 0.05 | PE | Gower, Kane-Maguire, et al., 1977 | Vertical value; LLK |
8.45 ± 0.05 | PE | Evans, Green, et al., 1974 | Vertical value; LLK |
8.65 ± 0.03 | PE | Klessinger, 1972 | Vertical value; LLK |

Ion clustering data

Data compiled as indicated in comments:
M - Michael M. Meot-Ner (Mautner) and Sharon G. Lias
RCD - Robert C. Dunbar
B - John E. Bartmess
Clustering reactions
By formula: C3H9Si+ + C9H12 = (C3H9Si+ • C9H12)
Quantity | Value | Units | Method | Reference | Comment |
---|---|---|---|---|---|
ΔrH° | 31.0 | kcal/mol | PHPMS | Wojtyniak and Stone, 1986 | gas phase; switching reaction,Thermochemical ladder((CH3)3Si+)(C6H6), Entropy change calculated or estimated; M |
Quantity | Value | Units | Method | Reference | Comment |
ΔrS° | 35.2 | cal/mol*K | N/A | Wojtyniak and Stone, 1986 | gas phase; switching reaction,Thermochemical ladder((CH3)3Si+)(C6H6), Entropy change calculated or estimated; M |
Free energy of reaction
ΔrG° (kcal/mol) | T (K) | Method | Reference | Comment |
---|---|---|---|---|
14.6 | 468. | PHPMS | Wojtyniak and Stone, 1986 | gas phase; switching reaction,Thermochemical ladder((CH3)3Si+)(C6H6), Entropy change calculated or estimated; M |
By formula: C3H9Sn+ + C9H12 = (C3H9Sn+ • C9H12)
Quantity | Value | Units | Method | Reference | Comment |
---|---|---|---|---|---|
ΔrH° | 32.0 | kcal/mol | PHPMS | Stone and Splinter, 1984 | gas phase; switching reaction((CH3)3Sn+)CH3OH, Entropy change calculated or estimated; M |
Quantity | Value | Units | Method | Reference | Comment |
ΔrS° | 31.8 | cal/mol*K | N/A | Stone and Splinter, 1984 | gas phase; switching reaction((CH3)3Sn+)CH3OH, Entropy change calculated or estimated; M |
Free energy of reaction
ΔrG° (kcal/mol) | T (K) | Method | Reference | Comment |
---|---|---|---|---|
15.3 | 525. | PHPMS | Stone and Splinter, 1984 | gas phase; switching reaction((CH3)3Sn+)CH3OH, Entropy change calculated or estimated; M |
By formula: C6H7N+ + C9H12 = (C6H7N+ • C9H12)
Bond type: Charge transfer bond (positive ion)
Quantity | Value | Units | Method | Reference | Comment |
---|---|---|---|---|---|
ΔrH° | 15.3 | kcal/mol | PHPMS | Meot-Ner (Mautner) and El-Shall, 1986 | gas phase; M |
Quantity | Value | Units | Method | Reference | Comment |
ΔrS° | 25.6 | cal/mol*K | PHPMS | Meot-Ner (Mautner) and El-Shall, 1986 | gas phase; M |
By formula: C9H12+ + C9H12 = (C9H12+ • C9H12)
Bond type: Charge transfer bond (positive ion)
Quantity | Value | Units | Method | Reference | Comment |
---|---|---|---|---|---|
ΔrH° | 17.2 | kcal/mol | PHPMS | Meot-Ner (Mautner), Hamlet, et al., 1978 | gas phase; M |
Quantity | Value | Units | Method | Reference | Comment |
ΔrS° | 30. | cal/mol*K | PHPMS | Meot-Ner (Mautner), Hamlet, et al., 1978 | gas phase; M |
By formula: C9H13+ + C9H12 = (C9H13+ • C9H12)
Quantity | Value | Units | Method | Reference | Comment |
---|---|---|---|---|---|
ΔrH° | 12.4 | kcal/mol | PHPMS | Meot-Ner (Mautner), 1980 | gas phase; Entropy change calculated or estimated; M |
Quantity | Value | Units | Method | Reference | Comment |
ΔrS° | 28. | cal/mol*K | N/A | Meot-Ner (Mautner), 1980 | gas phase; Entropy change calculated or estimated; M |
Free energy of reaction
ΔrG° (kcal/mol) | T (K) | Method | Reference | Comment |
---|---|---|---|---|
4.8 | 272. | PHPMS | Meot-Ner (Mautner), 1980 | gas phase; Entropy change calculated or estimated; M |
By formula: C11H10+ + C9H12 = (C11H10+ • C9H12)
Bond type: Charge transfer bond (positive ion)
Quantity | Value | Units | Method | Reference | Comment |
---|---|---|---|---|---|
ΔrH° | 13.9 | kcal/mol | PHPMS | El-Shall and Meot-Ner (Mautner), 1987 | gas phase; M |
Quantity | Value | Units | Method | Reference | Comment |
ΔrS° | 29.7 | cal/mol*K | PHPMS | El-Shall and Meot-Ner (Mautner), 1987 | gas phase; M |
By formula: Ca+ + C9H12 = (Ca+ • C9H12)
Quantity | Value | Units | Method | Reference | Comment |
---|---|---|---|---|---|
ΔrH° | 32.3 | kcal/mol | RAK | Gapeev and Dunbar, 2000 | RCD |
By formula: Cl- + C9H12 = (Cl- • C9H12)
Quantity | Value | Units | Method | Reference | Comment |
---|---|---|---|---|---|
ΔrG° | 4.50 | kcal/mol | TDEq | French, Ikuta, et al., 1982 | gas phase; B |
Free energy of reaction
ΔrG° (kcal/mol) | T (K) | Method | Reference | Comment |
---|---|---|---|---|
4.5 | 300. | PHPMS | French, Ikuta, et al., 1982 | gas phase; M |
By formula: Cr+ + C9H12 = (Cr+ • C9H12)
Quantity | Value | Units | Method | Reference | Comment |
---|---|---|---|---|---|
ΔrH° | 46.1 ± 6.9 | kcal/mol | RAK | Lin and Dunbar, 1997 | RCD |
By formula: (Cr+ • C9H12) + C9H12 = (Cr+ • 2C9H12)
Quantity | Value | Units | Method | Reference | Comment |
---|---|---|---|---|---|
ΔrH° | 50.7 ± 9.1 | kcal/mol | RAK | Lin and Dunbar, 1997 | RCD |
By formula: H4N+ + C9H12 = (H4N+ • C9H12)
Quantity | Value | Units | Method | Reference | Comment |
---|---|---|---|---|---|
ΔrH° | 21.8 | kcal/mol | PHPMS | Deakyne and Meot-Ner (Mautner), 1985 | gas phase; M |
Quantity | Value | Units | Method | Reference | Comment |
ΔrS° | 21.2 | cal/mol*K | PHPMS | Deakyne and Meot-Ner (Mautner), 1985 | gas phase; M |
By formula: Sr+ + C9H12 = (Sr+ • C9H12)
Quantity | Value | Units | Method | Reference | Comment |
---|---|---|---|---|---|
ΔrH° | 27.7 | kcal/mol | RAK | Gapeev and Dunbar, 2000 | RCD |

Normal alkane RI, non-polar column, isothermal

Data compiled by: NIST Mass Spectrometry Data Center, William E. Wallace, director

Column type CapillaryCapillaryCapillaryCapillaryCapillary
Active phase Methyl SiliconeSqualaneSqualaneOV-101OV-101
Column length (m)    50.50.
Carrier gas
Substrate
Column diameter (mm)    0.200.20
Phase thickness (μm)
Temperature (C) 120.100.100.100.100.
I 963.967.968.963.963.
ReferenceChen and Feng, 2006Berezkin, 1993Berezkin, 1993Tian, 1993Tian, 1993
Comment MSDC-RI MSDC-RI MSDC-RI MSDC-RI MSDC-RI
Column type CapillaryCapillaryCapillaryCapillaryCapillary
Active phase OV-101OV-101OV-101E-301Squalane
Column length (m) 50.50. 50.50.
Carrier gas    N2N2
Substrate
Column diameter (mm) 0.200.20 0.250.25
Phase thickness (μm)
Temperature (C) 120.120.70.100.100.
I 967.967.954.967.972.
ReferenceTian, 1993Tian, 1993Wu and Lu, 1984Bermejo, Moinelo, et al., 1980Bermejo, Moinelo, et al., 1980
Comment MSDC-RI MSDC-RI MSDC-RI MSDC-RI MSDC-RI
Column type CapillaryCapillaryPacked
Active phase SqualaneSqualanePolydimethyl siloxane
Column length (m)  100.
Carrier gas H2N2
Substrate
Column diameter (mm)  0.25
Phase thickness (μm)
Temperature (C) 95.4110.110.
I 958.972.968.
ReferenceSojak and Vigdergauz, 1978Papazova and Pankova, 1975Ferrand, 1962
Comment MSDC-RI MSDC-RI MSDC-RI

Normal alkane RI, non-polar column, custom temperature program

Data compiled by: NIST Mass Spectrometry Data Center, William E. Wallace, director

Column type CapillaryCapillaryCapillaryCapillaryCapillary
Active phase HP-5 MSRTX-5 MSPolydimethyl siloxane with 5 % Ph groupsPolydimethyl siloxane with 5 % Ph groups5 % Phenyl polydimethyl siloxane
Column length (m) 30.15.
Carrier gas HeliumHelium
Substrate
Column diameter (mm) 0.250.25
Phase thickness (μm) 0.250.25
Program not specified35 0C (6 min) 5 0C/min -> 150 0C 10 0C/min -> 280 0C (3 min)not specifiednot specifiednot specified
I 963.995.996.999.996.
ReferenceKotowska, Zalikowski, et al., 2012Nadaf, Halimi, et al., 2012Robinson, Adams, et al., 2012Robinson, Adams, et al., 2012Chaverri, Diaz, et al., 2011
Comment MSDC-RI MSDC-RI MSDC-RI MSDC-RI MSDC-RI
Column type CapillaryCapillaryCapillaryCapillaryCapillary
Active phase HP-5SLB-5 MSSLB-5 MSHP-5HP-5
Column length (m) 60.30.30.30.30.
Carrier gas HeliumHeliumHelium
Substrate
Column diameter (mm) 0.250.250.250.250.25
Phase thickness (μm) 0.250.250.250.250.25
Program 30 0C (2 min) 2 0Cmin -> 60 0C 10 0C/min -> 100 0C 20 0C/min -> 140 0C 10 0C/min -> 200 0C (10 min)50 0C 3 0C/min -> 250 0C (1 min) 10 0C/min -> 300 0C (5 min)not specified40 0C (2 min) 5 0C/min -> 80 0C 7 oC/min -> 160 0C 9 0C/min -> 200 0C 20 0C/min -> 280 0C (10 min)not specified
I 995.994.994.992.996.
ReferenceRotsatschakul, Visesanguan, et al., 2009Costa, De Fina, et al., 2008Costa, De Fina, et al., 2008Zhao, Li, et al., 2008Zhao, Li, et al., 2008
Comment MSDC-RI MSDC-RI MSDC-RI MSDC-RI MSDC-RI
Column type CapillaryCapillaryCapillaryCapillaryCapillary
Active phase BP-5Methyl SiliconeHP-5MSPolymethylsiloxane, (PMS-20000)OV-101
Column length (m) 30.60.30.
Carrier gas HeHelium
Substrate
Column diameter (mm) 0.320.320.25
Phase thickness (μm) 0.251.00.25
Program 60C => 4C/min => 150C => 10C/min => 220C-50 0C (2 min) 8 0C/min -> 200 0C (7.75 min) 25 0C -> 225 0C (8 min)40C(3min) => 4C/min => 75C => 8C/min => 250Cnot specifiednot specified
I 997.964.964.956.963.
ReferenceHashemi, Abolghasemi, et al., 2007Blunden, Aneja, et al., 2005Vichi, Pizzale, et al., 2005Cornwell and Cordano, 2003Zhu and Wang, 2001
Comment MSDC-RI MSDC-RI MSDC-RI MSDC-RI MSDC-RI
Column type CapillaryCapillaryCapillaryCapillaryCapillary
Active phase DB-1BPX-5Methyl SiliconeMethyl SiliconeMethyl Silicone
Column length (m)  50.
Carrier gas  Helium
Substrate
Column diameter (mm)  0.32
Phase thickness (μm)  0.50
Program not specified40 0C (5 min) 20 0C/min -> 60 0C (5 min) 4 0C/min -> 250 0C (10 min)not specifiednot specifiednot specified
I 953.1003.962.963.963.
ReferenceZhu and Wang, 2001Madruga, Arruda, et al., 2000Spieksma, 1999Zenkevich, 1999Zenkevich and Tsibulskaya, 1997
Comment MSDC-RI MSDC-RI MSDC-RI MSDC-RI MSDC-RI
Column type CapillaryCapillaryCapillaryCapillaryCapillary
Active phase DB-1SE-30SE-30DB-1OV-101
Column length (m) 30.  60.
Carrier gas
Substrate
Column diameter (mm) 0.53  0.32
Phase thickness (μm) 1.5  0.25
Program 40 0C (4 min) 8 0C/min -> 200 0C (1 min) 5 0C/min -> 280 0C (20 min)not specifiednot specifiednot specifiednot specified
I 985.956.964.954.969.
ReferencePeng, 1996Xiuhua, Zhang, et al., 1996Xiuhua, Zhang, et al., 1996Ciccioli, Cecinato, et al., 1994Dimov, Osman, et al., 1994
Comment MSDC-RI MSDC-RI MSDC-RI MSDC-RI MSDC-RI
Column type CapillaryCapillaryCapillaryCapillaryCapillary
Active phase DB-1OV-1OV-1OV-1OV-1
Column length (m) 60.60.60.60.60.
Carrier gas
Substrate
Column diameter (mm) 0.320.320.320.320.32
Phase thickness (μm) 0.25
Program 3 min at 5 C; 5 - 50 C at 3 deg/min; 50 - 220 C at 5 deg/min1) 1st 30m column temp ramp 4C/min 60-120C 2)2nd 30m column isothermal 100C1) 1st 30m column temp ramp 4C/min 60-120C. 2) 2nd 30m column isothermal 120C.1) 1st 30m column temp ramp 6C/min 60-120C. 2) 2nd 30m column isothermal 120C.1)1st 30m column temp ramp 3C/min 60-120 2)2nd 30m column isothermal 120C
I 954.962.6968.9966.5967.4
ReferenceCiccioli, Brancaleoni, et al., 1993Engewald and Maurer, 1990Engewald and Maurer, 1990Engewald and Maurer, 1990Engewald and Maurer, 1990
Comment MSDC-RI MSDC-RI MSDC-RI MSDC-RI MSDC-RI
Column type CapillaryCapillaryCapillaryCapillaryCapillary
Active phase SqualaneSE-52OV-1, SE-30, Methyl silicone, SP-2100, OV-101, DB-1, etc.OV-1, SE-30, Methyl silicone, SP-2100, OV-101, DB-1, etc.OV-1, SE-30, Methyl silicone, SP-2100, OV-101, DB-1, etc.
Column length (m)  100.50.50.50.
Carrier gas   HydrogenHydrogenHydrogen
Substrate
Column diameter (mm)  0.500.320.320.32
Phase thickness (μm)
Program not specifiednot specifiednot specifiednot specifiednot specified
I 967.7976.952.953.954.
ReferenceDimov and Mekenyan, 1989van Langenhove and Schamp, 1986Waggott and Davies, 1984Waggott and Davies, 1984Waggott and Davies, 1984
Comment MSDC-RI MSDC-RI MSDC-RI MSDC-RI MSDC-RI
Column type CapillaryPackedPackedPackedPacked
Active phase OV-1, SE-30, Methyl silicone, SP-2100, OV-101, DB-1, etc.SE-30SqualaneSE-30Squalane
Column length (m) 50.6.13.06.13.0
Carrier gas HydrogenN2N2
Substrate  Chromosorb WEmbacelChrom WEmbacel
Column diameter (mm) 0.32
Phase thickness (μm)
Program not specified50C910min) => 20C/min => 90(6min) => 10C/min => 150C(hold)25C(5min) => 2C/min => 35 => 4C/min => 95C(hold)50C(10min) => 20C/min(2min) => 90C(6min) => 10C/min(6min) => (hold at 150C)25C(5min) => 2C/min(5min) => 4C/min(15min) => (hold at 95C)
I 960.973.968.973.968.
ReferenceWaggott and Davies, 1984Robinson and Odell, 1971Robinson and Odell, 1971Robinson and Odell, 1971, 2Robinson and Odell, 1971, 2
Comment MSDC-RI MSDC-RI MSDC-RI MSDC-RI MSDC-RI

References

Taylor R.D., 1955
Taylor R.D.,
Entropy, heat capacity, and heats of transition of 1,3,5-trimethylbenzene,
J. Chem. Phys., 1955, 23, 1232-1235. [all data]
Draeger, 1985
Draeger, J.A.,
The methylbenzenes II. Fundamental vibrational shifts, statistical thermodynamic functions, and properties of formation,
J. Chem. Thermodyn., 1985, 17, 263-275. [all data]
Thermodynamics Research Center, 1997
Thermodynamics Research Center,
Selected Values of Properties of Chemical Compounds., Thermodynamics Research Center, Texas A&M University, College Station, Texas, 1997. [all data]
Pitzer K.S., 1943
Pitzer K.S.,
The thermodynamics and molecular structure of benzene and its methyl derivatives,
J. Am. Chem. Soc., 1943, 65, 803-829. [all data]
Taylor W.J., 1946
Taylor W.J.,
Heats, equilibrium constants, and free energies of formation of the alkylbenzenes,
J. Res. Nat. Bur. Stand., 1946, 37, 95-122. [all data]
Johnson, Prosen, et al., 1945
Johnson, W.H.; Prosen, E.J.; Rossini, F.D.,
Heats of combustion and isomerization of the eight C9H12 alkylbenzenes,
J. Res. NBS, 1945, 35, 141-146. [all data]
Richards and Barry, 1915
Richards, T.W.; Barry, F.,
The heats of combustion of aromatic hydrocarbons and hexamethylene,
J. Am. Chem. Soc., 1915, 37, 993-1020. [all data]
Taylor and Kilpatrick, 1955
Taylor, R.D.; Kilpatrick, J.E.,
Entropy, heat capacity, heats of transition of 1,3,5-trimethylbenzene,
J. Chem. Phys., 1955, 23, 1232-1235. [all data]
Grolier, Roux-Desgranges, et al., 1993
Grolier, J.-P.E.; Roux-Desgranges, G.; Berkane, M.; Jimenez, E.; Wilhelm, E.,
Heat capacities and densities of mixtures of very polar substances 2. Mixtures containing N,N-dimethylformamide,
J. Chem. Thermodynam., 1993, 25(1), 41-50. [all data]
Andolenko and Grigor'ev, 1979
Andolenko, R.A.; Grigor'ev, B.A.,
Investigation of isobaric heat capacity of aromatic hydrocarbons at atmospheric pressure, Iaz. Vyssh. Ucheb. Zaved.,
Neft i Gaz (11), 1979, 78, 90. [all data]
Wilhelm, Faradjzadeh, et al., 1979
Wilhelm, E.; Faradjzadeh, A.; Grolier, J.-P.E.,
Molar excess heat capacities and excess volumes of 1,2-dichloroethane + cyclooctane, + mesitylene, and + tetrachloromethane,
J. Chem. Thermodynam., 1979, 11, 979-984. [all data]
Fortier and Benson, 1977
Fortier, J.-L.; Benson, G.C.,
Excess heat capacities of binary mixtures of tetrachloromethane witlh some aromatic liquids at 298.15 K,
J. Chem. Thermodynam., 1977, 9, 1181-1188. [all data]
Recko, 1968
Recko, W.M.,
Excess heat capacity of the binary systems formed by n-propyl alcohol with benzene, mesitylene and cyclohexane,
Bull. Acad. Pol. Sci. Ser. Sci. Chim., 1968, 16, 549-552. [all data]
Helfrey, Heiser, et al., 1955
Helfrey, P.F.; Heiser, D.A.; Sage, B.H.,
Isobaric heat capacities at bubble point, Two trimethylbenzenes and n-heptane,
Ind. Eng. Chem., 1955, 44, 2385-2388. [all data]
Kurbatov, 1947
Kurbatov, V.Ya.,
Specific heat of liquids. I. Specific heat of benzenoid hydrocarbons,
Zhur. Obshch. Khim., 1947, 17, 1999-2003. [all data]
von Reis, 1881
von Reis, M.A.,
Die specifische Wärme flüssiger organischer Verbindungen und ihre Beziehung zu deren Moleculargewicht,
Ann. Physik [3], 1881, 13, 447-464. [all data]
Taylor and Kilpatrick, 1955, 2
Taylor, R.D.; Kilpatrick, J.E.,
Entropy, Heat Capacity and Heats of Trans. of 1,3,5-Trimethylbenzene,
J. Chem. Phys., 1955, 23, 1232-5. [all data]
Tsonopoulos and Ambrose, 1995
Tsonopoulos, C.; Ambrose, D.,
Vapor-Liquid Critical Properties of Elements and Compounds. 3. Aromatic Hydrocarbons,
J. Chem. Eng. Data, 1995, 40, 547-558. [all data]
Kay and Pak, 1980
Kay, W.B.; Pak, S.C.,
Determination of the critical constants of high-boiling hydrocarbons. Experiments with gallium as a containing fluid,
J. Chem. Thermodyn., 1980, 12, 673. [all data]
Ambrose, Broderick, et al., 1967
Ambrose, D.; Broderick, B.E.; Townsend, R.,
The Vapour Pressures above the Normal Boiling Point and the Critical Pressures of Some Aromatic Hydrocarbons,
J. Chem. Soc. , 1967, 1967, 1967, 633-41. [all data]
Altschul, 1893
Altschul, M.,
The critical values of some organic compounds,
Z. Phys. Chem., Stoechiom. Verwandtschaftsl., 1893, 11, 577. [all data]
Wiberg and Waldron, 1991
Wiberg, K.B.; Waldron, R.F.,
Lactones. 2. Enthalpies of hydrolysis, reduction, and formation of the C4-C13 monocyclic lactones. strain energies and conformations,
J. Am. Chem. Soc., 1991, 113, 7697-7705. [all data]
Park and Gmehling, 1989
Park, So Jin; Gmehling, Juergen,
Isobaric vapor-liquid equilibrium data for the binary systems 1,3,5-trimethylbenzene/N-formylmorpholine and m-xylene/N-formylmorpholine,
J. Chem. Eng. Data, 1989, 34, 4, 399-401, https://doi.org/10.1021/je00058a008
. [all data]
Stephenson and Malanowski, 1987
Stephenson, Richard M.; Malanowski, Stanislaw,
Handbook of the Thermodynamics of Organic Compounds, 1987, https://doi.org/10.1007/978-94-009-3173-2
. [all data]
Forziati, Norris, et al., 1949
Forziati, Alphonse F.; Norris, William R.; Rossini, Frederick D.,
Vapor pressures and boiling points of sixty API-NBS hydrocarbons,
J. RES. NATL. BUR. STAN., 1949, 43, 6, 555-17, https://doi.org/10.6028/jres.043.050
. [all data]
Chickos, Hyman, et al., 1981
Chickos, James S.; Hyman, Arthur S.; Ladon, Liina H.; Liebman, Joel F.,
Measurement and estimation of the heats of vaporization of hydrocarbons,
J. Org. Chem., 1981, 46, 21, 4294-4296, https://doi.org/10.1021/jo00334a040
. [all data]
Hopke and Sears, 1948
Hopke, E.R.; Sears, G.W.,
Vapor Pressures of Trimethylbenzenes in the Low Pressure Region 1,2,
J. Am. Chem. Soc., 1948, 70, 11, 3801-3803, https://doi.org/10.1021/ja01191a077
. [all data]
Forziati, Norris, et al., 1949, 2
Forziati, A.F.; Norris, W.R.; Rossini, F.D.,
Vapor Pressures and Boiling Points of Sixty API-NBS Hydrocarbons,
J. Res. Natl. Bur. Stand. (U.S.), 1949, 43, 6, 555-563, https://doi.org/10.6028/jres.043.050
. [all data]
Domalski and Hearing, 1996
Domalski, Eugene S.; Hearing, Elizabeth D.,
Heat Capacities and Entropies of Organic Compounds in the Condensed Phase. Volume III,
J. Phys. Chem. Ref. Data, 1996, 25, 1, 1, https://doi.org/10.1063/1.555985
. [all data]
Radomska and Radomski, 1991
Radomska, M.; Radomski, R.,
Phase diagrams in the binary systems of tetracyanoethylene with mesitylene, durene and pentamethylbenzene,
Journal of Thermal Analysis, 1991, 37, 4, 693-704, https://doi.org/10.1007/BF01913148
. [all data]
Wojtyniak and Stone, 1986
Wojtyniak, A.C.M.; Stone, A.J.,
A High-Pressure Mass Spectrometric Study of the Bonding of Trimethylsilylium to Oxygen and Aromatic Bases,
Can. J. Chem., 1986, 74, 59. [all data]
Stone and Splinter, 1984
Stone, J.A.; Splinter, D.E.,
A high-pressure mass spectrometric study of the binding of (CH3)3Sn+ to lewis bases in the gas phase,
Int. J. Mass Spectrom. Ion Processes, 1984, 59, 169. [all data]
Meot-Ner (Mautner), 1980
Meot-Ner (Mautner), M.,
Dimer Cations of Polycyclic Aromatics: Experimental Bonding Energies and Resonance Stabilization,
J. Phys. Chem., 1980, 84, 21, 2724, https://doi.org/10.1021/j100458a012
. [all data]
El-Shall and Meot-Ner (Mautner), 1987
El-Shall, M.S.; Meot-Ner (Mautner), M.,
Ionic Charge Transfer Complexes. 3. Delocalised pi Systems as Electron Acceptors and Donors,
J. Phys. Chem., 1987, 91, 5, 1088, https://doi.org/10.1021/j100289a017
. [all data]
Meot-Ner (Mautner) and El-Shall, 1986
Meot-Ner (Mautner), M.; El-Shall, M.S.,
Ionic Charge Transfer Complexes. 1. Cationic Complexes with Delocalized and Partially Localized pi Systems,
J. Am. Chem. Soc., 1986, 108, 15, 4386, https://doi.org/10.1021/ja00275a026
. [all data]
Meot-Ner (Mautner), Hamlet, et al., 1978
Meot-Ner (Mautner), M.; Hamlet, P.; Hunter, E.P.; Field, F.H.,
Bonding Energies in Association Ions of Aromatic Molecules. Correlations with Ionization Energies,
J. Am. Chem. Soc., 1978, 100, 17, 5466, https://doi.org/10.1021/ja00485a034
. [all data]
Dolliver, Gresham, et al., 1937
Dolliver, M.a.; Gresham, T.L.; Kistiakowsky, G.B.; Vaughan, W.E.,
Heats of organic reactions. V. Heats of hydrogenation of various hydrocarbons,
J. Am. Chem. Soc., 1937, 59, 831-841. [all data]
Cox and Pilcher, 1970
Cox, J.D.; Pilcher, G.,
Thermochemistry of Organic and Organometallic Compounds, Academic Press, New York, 1970, 1-636. [all data]
French, Ikuta, et al., 1982
French, M.A.; Ikuta, S.; Kebarle, P.,
Hydrogen bonding of O-H and C-H hydrogen donors to Cl-. Results from mass spectrometric measurement of the ion-molecule equilibria RH + Cl- = RHCl-,
Can. J. Chem., 1982, 60, 1907. [all data]
Deakyne and Meot-Ner (Mautner), 1985
Deakyne, C.A.; Meot-Ner (Mautner), M.,
Unconventional Ionic Hydrogen Bonds. 2. NH+ pi. Complexes of Onium Ions with Olefins and Benzene Derivatives,
J. Am. Chem. Soc., 1985, 107, 2, 474, https://doi.org/10.1021/ja00288a034
. [all data]
Egan and Buss, 1959
Egan, C.J.; Buss, W.C.,
Determination of the equilibrium constants for the hydrogenation of mesitylene. The thermodynamic properties of the 1,3,5-trimethylcyclohexanes,
J. Phys. Chem., 1959, 63, 1887-1889. [all data]
Lin and Dunbar, 1997
Lin, C.-Y.; Dunbar, R.C.,
Radiative Association Kinetics and Binding Energies of Chromium Ions with Benzene and Benzene Derivatives,
Organometallics, 1997, 16, 12, 2691, https://doi.org/10.1021/om960949n
. [all data]
Gapeev and Dunbar, 2000
Gapeev, A.; Dunbar, R.C.,
Binding of Alkaline Earth Halide Ions MX+ to Benzene and Mesitylene,
J. Am. Soc. Mass Spectrom., 2000, 13, 5, 477, https://doi.org/10.1016/S1044-0305(02)00373-2
. [all data]
Hunter and Lias, 1998
Hunter, E.P.; Lias, S.G.,
Evaluated Gas Phase Basicities and Proton Affinities of Molecules: An Update,
J. Phys. Chem. Ref. Data, 1998, 27, 3, 413-656, https://doi.org/10.1063/1.556018
. [all data]
Aue, Guidoni, et al., 2000
Aue, D.H.; Guidoni, M.; Betowski, L.D.,
Ab initio calculated gas-phase basicities of polynuclear aromatic hydrocarbons,
Int. J. Mass Spectrom., 2000, 201, 283. [all data]
Lias and Ausloos, 1978
Lias, S.G.; Ausloos, P.J.,
eIonization energies of organic compounds by equilibrium measurements,
J. Am. Chem. Soc., 1978, 100, 6027. [all data]
Kobayashi, Kobayashi, et al., 1973
Kobayashi, H.; Kobayashi, M.; Kaizu, Y.,
Molecular complexes of arenetricarbonylchromium,
Bull. Chem. Soc. Jpn., 1973, 46, 3109. [all data]
Gilbert, Leach, et al., 1973
Gilbert, J.R.; Leach, W.P.; Miller, J.R.,
Ionisation appearance potential measurements in arene chromium tricarbonyls,
J. Organomet. Chem., 1973, 49, 219. [all data]
Huttner and Fischer, 1967
Huttner, G.; Fischer, E.O.,
Uber Aromatenkomplexe von Metallen. XCVIII. Spectroskopische Untersuchungen an Charge-Transfer-Komplexen von Aromaten-Chrom Tricarbonylen mit 1,3,5-Trinitrobenzol,
J. Organometal. Chem., 1967, 8, 299. [all data]
Watanabe, Nakayama, et al., 1962
Watanabe, K.; Nakayama, T.; Mottl, J.,
Ionization potentials of some molecules,
J. Quant. Spectry. Radiative Transfer, 1962, 2, 369. [all data]
Kinoshita, 1962
Kinoshita, M.,
The absorption spectra of the molecular complexes of aromatic compounds with p-bromanil,
Bull. Chem. Soc. Japan, 1962, 35, 1609. [all data]
Price, Bralsford, et al., 1959
Price, W.C.; Bralsford, R.; Harris, P.V.; Ridley, R.G.,
Ultra-violet spectra and ionization potentials of hydrocarbon molecules,
Spectrochim. Acta, 1959, 14, 45. [all data]
Vilesov and Terenin, 1957
Vilesov, F.I.; Terenin, A.N.,
The photoionization of the vapors of certain organic compounds,
Dokl. Akad. Nauk SSSR, 1957, 115, 744, In original 539. [all data]
Howell, Goncalves, et al., 1984
Howell, J.O.; Goncalves, J.M.; Amatore, C.; Klasinc, L.; Wightman, R.M.; Kochi, J.K.,
Electron transfer from aromatic hydrocarbons and their π-complexes with metals. Comparison of the standard oxidation potentials and vertical ionization potentials,
J. Am. Chem. Soc., 1984, 106, 3968. [all data]
Cetinkaya, Lappert, et al., 1983
Cetinkaya, B.; Lappert, M.F.; Suffolk, R.J.,
Photoelectron spectra of some sterically hindered phenols and related compounds,
J. Chem. Res. Synop., 1983, 316. [all data]
Worley and Webb, 1980
Worley, S.D.; Webb, T.R.,
The electronic structure of transition-metal carbonyl complexes of norbornadiene and mesitylene,
J. Organomet. Chem., 1980, 192, 139. [all data]
Gower, Kane-Maguire, et al., 1977
Gower, M.; Kane-Maguire, L.A.P.; Maier, J.P.; Sweigart, D.A.,
Ultraviolet photoelectron spectra of cyclohepta-1,3,5-triene and mesitylene tricarbonyl complexes of the group 6A metals,
J. Chem. Soc. Dalton Trans., 1977, 316. [all data]
Evans, Green, et al., 1974
Evans, S.; Green, J.C.; Jackson, S.E.; Higginson, B.,
He(I) photoelectron spectra of some transition-metal sandwich complexes,
J. Chem. Soc. Dalton Trans., 1974, 304. [all data]
Klessinger, 1972
Klessinger, M.,
Ionization potentials of substituted benzenes,
Angew. Chem. Int. Ed. Engl., 1972, 11, 525. [all data]