2H-Pyran-2,6(3H)-dione, dihydro-
- Formula: C5H6O3
- Molecular weight: 114.0993
- IUPAC Standard InChIKey: VANNPISTIUFMLH-UHFFFAOYSA-N
- CAS Registry Number: 108-55-4
- Chemical structure:
View 3d structure (requires JavaScript / HTML 5) - Other names: Glutaric acid anhydride; Glutaric anhydride; Pentanedioic anhydride; Anhydrid kyseliny glutarove; Dihydro-2H-pyran-2,6(3H)-dione

Gas phase thermochemistry data

Data compiled by: Hussein Y. Afeefy, Joel F. Liebman, and Stephen E. Stein
Quantity | Value | Units | Method | Reference | Comment |
---|---|---|---|---|---|
ΔfH°gas | -532.4 ± 1.8 | kJ/mol | Ccb | Yan and Pilcher, 1990 |

Condensed phase thermochemistry data

Data compiled by: Hussein Y. Afeefy, Joel F. Liebman, and Stephen E. Stein
Quantity | Value | Units | Method | Reference | Comment |
---|---|---|---|---|---|
ΔfH°solid | -618.5 ± 0.9 | kJ/mol | Ccb | Yan and Pilcher, 1990 | |
Quantity | Value | Units | Method | Reference | Comment |
ΔcH°solid | -2206.5 ± 0.6 | kJ/mol | Ccb | Yan and Pilcher, 1990 | Corresponding ΔfHºsolid = -618.5 kJ/mol (simple calculation by NIST; no Washburn corrections) |

Phase change data

Data compiled as indicated in comments:
BS - Robert L. Brown and Stephen E. Stein
AC - William E. Acree, Jr., James S. Chickos
ALS - Hussein Y. Afeefy, Joel F. Liebman, and Stephen E. Stein
DRB - Donald R. Burgess, Jr.
Quantity | Value | Units | Method | Reference | Comment |
---|---|---|---|---|---|
ΔsubH° | 86.1 ± 1.6 | kJ/mol | N/A | Meng-Yan and Pilcher, 1990 | AC |
ΔsubH° | 86.1 ± 1.6 | kJ/mol | C | Yan and Pilcher, 1990 | ALS |
ΔsubH° | 86.1 | kJ/mol | N/A | Yan and Pilcher, 1990 | DRB |
Reduced pressure boiling point
Tboil (K) | Pressure (bar) | Reference | Comment |
---|---|---|---|
423.2 | 0.013 | Weast and Grasselli, 1989 | BS |
438. to 443. | 0.027 | Frinton Laboratories Inc., 1986 | BS |
Enthalpy of vaporization
ΔvapH (kJ/mol) | Temperature (K) | Method | Reference | Comment |
---|---|---|---|---|
60.9 | 388. | A | Stephenson and Malanowski, 1987 | Based on data from 373. to 560. K. See also Stull, 1947.; AC |
Antoine Equation Parameters
log10(P) = A − (B / (T + C))
P = vapor pressure (bar)
T = temperature (K)
View plot Requires a JavaScript / HTML 5 canvas capable browser.
Temperature (K) | A | B | C | Reference | Comment |
---|---|---|---|---|---|
374.0 to 560. | 5.57029 | 3040.829 | -13.919 | Stull, 1947 | Coefficents calculated by NIST from author's data. |
Enthalpy of sublimation
ΔsubH (kJ/mol) | Temperature (K) | Method | Reference | Comment |
---|---|---|---|---|
85.9 ± 1.6 | 309. | ME | Meng-Yan and Pilcher, 1990 | Based on data from 298. to 320. K.; AC |

Gas phase ion energetics data

Data compiled by: Sharon G. Lias, Rhoda D. Levin, and Sherif A. Kafafi
Ionization energy determinations
IE (eV) | Method | Reference | Comment |
---|---|---|---|
11.17 | PE | Dougherty, Brint, et al., 1978 | Vertical value |

References

Yan and Pilcher, 1990
Yan, Y.M.; Pilcher, G.,
Enthalpies of combustion of succinic anhydride, glutaric anhydride, and glutarimide,
J. Chem. Thermodyn., 1990, 22, 893-898. [all data]
Meng-Yan and Pilcher, 1990
Meng-Yan, Yang; Pilcher, G.,
Enthalpies of combustion of succinic anhydride, glutaric anhydride, and glutarimide,
The Journal of Chemical Thermodynamics, 1990, 22, 9, 893-898, https://doi.org/10.1016/0021-9614(90)90177-R
. [all data]
Weast and Grasselli, 1989
CRC Handbook of Data on Organic Compounds, 2nd Editon, Weast,R.C and Grasselli, J.G., ed(s)., CRC Press, Inc., Boca Raton, FL, 1989, 1. [all data]
Frinton Laboratories Inc., 1986
Frinton Laboratories Inc.,
Catalog Number 11, Frinton Laboratories Inc., Vineland, NJ, 1986, 99. [all data]
Stephenson and Malanowski, 1987
Stephenson, Richard M.; Malanowski, Stanislaw,
Handbook of the Thermodynamics of Organic Compounds, 1987, https://doi.org/10.1007/978-94-009-3173-2
. [all data]
Stull, 1947
Stull, Daniel R.,
Vapor Pressure of Pure Substances. Organic and Inorganic Compounds,
Ind. Eng. Chem., 1947, 39, 4, 517-540, https://doi.org/10.1021/ie50448a022
. [all data]
Dougherty, Brint, et al., 1978
Dougherty, D.; Brint, P.; McGlynn, S.P.,
Photoelectron spectroscopy of carbonyls. Lone-pair interactions in α-, β-, γ δ-dicarbonyls,
J. Am. Chem. Soc., 1978, 100, 5597. [all data]