Benzene, 1-chloro-3-methyl-
- Formula: C7H7Cl
- Molecular weight: 126.583
- IUPAC Standard InChIKey: OSOUNOBYRMOXQQ-UHFFFAOYSA-N
- CAS Registry Number: 108-41-8
- Chemical structure:

Reaction thermochemistry data

Data compiled by: John E. Bartmess
Individual Reactions
C7H6Cl- + =
By formula: C7H6Cl- + H+ = C7H7Cl
Quantity | Value | Units | Method | Reference | Comment |
---|---|---|---|---|---|
ΔrH° | 1565. ± 8.8 | kJ/mol | G+TS | Caldwell and Bartmess | gas phase; value altered from reference due to change in acidity scale |
Quantity | Value | Units | Method | Reference | Comment |
ΔrG° | 1535. ± 8.4 | kJ/mol | IMRE | Caldwell and Bartmess | gas phase; value altered from reference due to change in acidity scale |

Gas phase ion energetics data

Data evaluated as indicated in comments:
HL - Edward P. Hunter and Sharon G. Lias
Data compiled as indicated in comments:
B - John E. Bartmess
LLK - Sharon G. Lias, Rhoda D. Levin, and Sherif A. Kafafi
RDSH - Henry M. Rosenstock, Keith Draxl, Bruce W. Steiner, and John T. Herron
LL - Sharon G. Lias and Joel F. Liebman
Quantity | Value | Units | Method | Reference | Comment |
---|---|---|---|---|---|
Proton affinity (review) | 783.9 | kJ/mol | N/A | Hunter and Lias, 1998 | HL |
Quantity | Value | Units | Method | Reference | Comment |
Gas basicity | 754.5 | kJ/mol | N/A | Hunter and Lias, 1998 | HL |
Ionization energy determinations
IE (eV) | Method | Reference | Comment |
---|---|---|---|
8.7 ± 0.1 | EI | Tajima and Tsuchiya, 1972 | LLK |
8.83 ± 0.02 | PI | Watanabe, Nakayama, et al., 1962 | RDSH |
Appearance energy determinations
Ion | AE (eV) | Other Products | Method | Reference | Comment |
---|---|---|---|---|---|
C5H5+ | 15.7 ± 0.2 | C2H2+Cl | EI | Tajima and Tsuchiya, 1973 | LLK |
C5H5+ | 15.71 ± 0.15 | C2H2+Cl | EI | Tajima and Tsuchiya, 1972 | LLK |
C7H6Cl+ | 12.05 ± 0.07 | H | EI | Selim, Rabbih, et al., 1994 | LL |
C7H7+ | 11.25 ± 0.06 | Cl | EI | Selim, Rabbih, et al., 1994 | LL |
C7H7+ | 11.3 ± 0.1 | Cl | EI | Tajima and Tsuchiya, 1972 | LLK |
C7H7+ | 11.9 | Cl | EI | Yeo and Williams, 1970 | RDSH |
C7H7+ | 11.3 ± 0.1 | Cl | EI | Brown, 1970 | RDSH |
De-protonation reactions
C7H6Cl- + =
By formula: C7H6Cl- + H+ = C7H7Cl
Quantity | Value | Units | Method | Reference | Comment |
---|---|---|---|---|---|
ΔrH° | 1565. ± 8.8 | kJ/mol | G+TS | Caldwell and Bartmess | gas phase; value altered from reference due to change in acidity scale; B |
Quantity | Value | Units | Method | Reference | Comment |
ΔrG° | 1535. ± 8.4 | kJ/mol | IMRE | Caldwell and Bartmess | gas phase; value altered from reference due to change in acidity scale; B |

Normal alkane RI, non-polar column, isothermal

Data compiled by: NIST Mass Spectrometry Data Center, William E. Wallace, director

Column type CapillaryCapillary
Active phase E-301Squalane
Column length (m) 50.50.
Carrier gas N2N2
Substrate
Column diameter (mm) 0.250.25
Phase thickness (μm)
Temperature (C) 100.100.
I 954.944.
ReferenceBermejo, Moinelo, et al., 1980Bermejo, Moinelo, et al., 1980
Comment MSDC-RI MSDC-RI

Condensed phase thermochemistry data

Data compiled by: Hussein Y. Afeefy, Joel F. Liebman, and Stephen E. Stein

Quantity Value Units Method Reference Comment
Δcliquid-896. ± 2.kcal/molCcbSmith, Bjellerup, et al., 1953At 291.7 °K

Phase change data

Data compiled as indicated in comments:
BS - Robert L. Brown and Stephen E. Stein
TRC - Thermodynamics Research Center, NIST Boulder Laboratories, Chris Muzny director
AC - William E. Acree, Jr., James S. Chickos

Quantity Value Units Method Reference Comment
Tboil435.2KN/AWeast and Grasselli, 1989BS
Tboil431.2KN/AOgimachi, Andrews, et al., 1955Uncertainty assigned by TRC = 2. K; TRC
Tboil434.89KN/AStuckey and Saylor, 1940Uncertainty assigned by TRC = 0.2 K; TRC
Quantity Value Units Method Reference Comment
Tfus225.35KN/AMartin, Yalkowsky, et al., 1979Uncertainty assigned by TRC = 0.5 K; TRC
Tfus224.26KN/ABrown and Stock, 1957Uncertainty assigned by TRC = 0.6 K; TRC
Tfus246.9KN/ATimmermans, 1934as reported in Chem. Abstracts; TRC
Tfus225.35KN/AHaase, 1893Uncertainty assigned by TRC = 2. K; TRC

Enthalpy of vaporization

ΔvapH (kcal/mol) Temperature (K) Method Reference Comment
10.0388.N/ADykyj, Svoboda, et al., 1999Based on data from 373. - 435. K.; AC
10.4292.AStephenson and Malanowski, 1987Based on data from 277. - 436. K. See also Stull, 1947.; AC
11.0288.N/AStuckey and Saylor, 1940, 2Based on data from 273. - 348. K.; AC

Antoine Equation Parameters

log10(P) = A − (B / (T + C))
    P = vapor pressure (atm)
    T = temperature (K)

View plot Requires a JavaScript / HTML 5 canvas capable browser.

Temperature (K) A B C Reference Comment
277.9 - 435.54.475771807.576-32.105Stull, 1947Coefficents calculated by NIST from author's data.

In addition to the Thermodynamics Research Center (TRC) data available from this site, much more physical and chemical property data is available from the following TRC products:

Normal alkane RI, polar column, custom temperature program

Data compiled by: NIST Mass Spectrometry Data Center, William E. Wallace, director

Column type CapillaryCapillaryCapillaryCapillaryCapillary
Active phase DB-WaxSuperox 0.6; Carbowax 20MSuperox 0.6; Carbowax 20MCarbowax 400, Carbowax 20M, Carbowax 1540, Carbowax 4000, Superox 06, PEG 20M, etc.Carbowax 20M
Column length (m)  50.50.50.
Carrier gas  HydrogenHydrogenHydrogen
Substrate
Column diameter (mm)  0.320.320.32
Phase thickness (μm)
Program not specifiednot specifiednot specifiednot specifiednot specified
I 1313.1288.1301.1288.1291.
ReferencePeng, Yang, et al., 1991Waggott and Davies, 1984Waggott and Davies, 1984Waggott and Davies, 1984Ramsey and Flanagan, 1982
Comment MSDC-RI MSDC-RI MSDC-RI MSDC-RI MSDC-RI

References

Caldwell and Bartmess
Caldwell, G.; Bartmess, J.E.,
, Unpublished results. [all data]
Hunter and Lias, 1998
Hunter, E.P.; Lias, S.G.,
Evaluated Gas Phase Basicities and Proton Affinities of Molecules: An Update,
J. Phys. Chem. Ref. Data, 1998, 27, 3, 413-656, https://doi.org/10.1063/1.556018
. [all data]
Tajima and Tsuchiya, 1972
Tajima, S.; Tsuchiya, T.,
The effects of the repeller voltage and the shield voltage on appearance potential measurements by electron impact,
Shitsuryo Bunseki, 1972, 20, 117. [all data]
Watanabe, Nakayama, et al., 1962
Watanabe, K.; Nakayama, T.; Mottl, J.,
Ionization potentials of some molecules,
J. Quant. Spectry. Radiative Transfer, 1962, 2, 369. [all data]
Tajima and Tsuchiya, 1973
Tajima, S.; Tsuchiya, T.,
Energetics consideration of C5H5+ ions produced from various precursors by electron impact,
Bull. Chem. Soc. Jpn., 1973, 46, 3291. [all data]
Selim, Rabbih, et al., 1994
Selim, E.T.M.; Rabbih, M.A.; Fahmey, M.A.; Hawash, M.F.,
Loss of H and Cl from the molecular ions of chlorotoluene isomers using electron impact mass spectrometry,
Int. J. Mass Spectrom. Ion Processes, 1994, 134, 119. [all data]
Yeo and Williams, 1970
Yeo, A.N.H.; Williams, D.H.,
Rearrangement in the molecular ions of halogenotoluenes prior to fragmentation in the mass spectrometer,
Chem. Commun., 1970, 886. [all data]
Brown, 1970
Brown, P.,
Kinetic studies in mass spectrometry-IV. The [M - Cl] reaction in substituted chlorobenzenes and the question of molecular ion isomerization,
Org. Mass Spectrom., 1970, 3, 639. [all data]