1,3,2-Dithiaplumbacyclopentane, 2,2-diphenyl-

Gas phase ion energetics data

Data compiled by: Sharon G. Lias, John E. Bartmess, Joel F. Liebman, John L. Holmes, Rhoda D. Levin, and W. Gary Mallard

Ionization energy determinations

IE (eV) Method Reference Comment
8.0PEAndoni, Cauletti, et al., 1983
8.94PEAndoni, Cauletti, et al., 1983Vertical value

References

Andoni, Cauletti, et al., 1983
Andoni, E.; Cauletti, C.; Furlani, C., Electronic structure and bonding in 2,2-diphenyl-1,3-dithiacyclopentanes of IV a group elements studied by UV photoelectron spectroscopy, Inorg. Chim. Acta, 1983, 76, 35. [all data]