Diisopropyl ether
- Formula: C6H14O
- Molecular weight: 102.1748
- IUPAC Standard InChIKey: ZAFNJMIOTHYJRJ-UHFFFAOYSA-N
- CAS Registry Number: 108-20-3
- Chemical structure:
View 3d structure (requires JavaScript / HTML 5) - Other names: Propane, 2,2'-oxybis-; Isopropyl ether; Diisopropyl oxide; 2-Isopropoxypropane; Diiospropyl ether; 2,2'-Oxybispropane; (iso-C3H7)2O; 1,1'-Dimethyldiethyl ether; Ether, isopropyl; Ether isopropylique; Izopropylowy eter; UN 1159; Bis(isopropyl) ether

Gas phase thermochemistry data

Data compiled as indicated in comments:
ALS - Hussein Y. Afeefy, Joel F. Liebman, and Stephen E. Stein
GT - Glushko Thermocenter, Russian Academy of Sciences, Moscow
Quantity | Value | Units | Method | Reference | Comment |
---|---|---|---|---|---|
ΔfH°gas | -318. ± 3. | kJ/mol | Ccb | Colomina, Pell, et al., 1965 | ALS |
Constant pressure heat capacity of gas
Cp,gas (J/mol*K) | Temperature (K) | Reference | Comment |
---|---|---|---|
182.47 | 360.04 | Andon R.J.L., 1974 | GT |
191.01 | 380.01 | ||
199.33 | 399.98 | ||
209.60 | 424.98 | ||
219.11 | 449.98 |

Condensed phase thermochemistry data

Data compiled as indicated in comments:
ALS - Hussein Y. Afeefy, Joel F. Liebman, and Stephen E. Stein
DH - Eugene S. Domalski and Elizabeth D. Hearing
Quantity | Value | Units | Method | Reference | Comment |
---|---|---|---|---|---|
ΔfH°liquid | -351.5 ± 1.4 | kJ/mol | Ccb | Colomina, Pell, et al., 1965 | ALS |
Quantity | Value | Units | Method | Reference | Comment |
ΔcH°liquid | -4010.4 ± 1.3 | kJ/mol | Ccb | Colomina, Pell, et al., 1965 | Corresponding ΔfHºliquid = -351.5 kJ/mol (simple calculation by NIST; no Washburn corrections); ALS |
Quantity | Value | Units | Method | Reference | Comment |
S°liquid | 304.6 | J/mol*K | N/A | Andon, Counsell, et al., 1974 | DH |
S°liquid | 294.6 | J/mol*K | N/A | Parks, Huffman, et al., 1933 | Extrapolation below 90 K, 61.30 J/mol*K.; DH |
Constant pressure heat capacity of liquid
Cp,liquid (J/mol*K) | Temperature (K) | Reference | Comment |
---|---|---|---|
216.74 | 298.15 | Grolier, Roux-Desgranges, et al., 1993 | DH |
216.1 | 298.15 | Andon, Counsell, et al., 1974 | T = 10 to 340 K.; DH |
216.31 | 293.1 | Parks, Huffman, et al., 1933 | T = 92 to 213 K. Value is unsmoothed experimental datum.; DH |

Phase change data

Data compiled as indicated in comments:
TRC - Thermodynamics Research Center, NIST Boulder Laboratories, Chris Muzny director
BS - Robert L. Brown and Stephen E. Stein
AC - William E. Acree, Jr., James S. Chickos
ALS - Hussein Y. Afeefy, Joel F. Liebman, and Stephen E. Stein
DH - Eugene S. Domalski and Elizabeth D. Hearing
Quantity | Value | Units | Method | Reference | Comment |
---|---|---|---|---|---|
Tboil | 341.4 ± 0.7 | K | AVG | N/A | Average of 14 values; Individual data points |
Quantity | Value | Units | Method | Reference | Comment |
Tfus | 187.26 | K | N/A | Dreisbach and Martin, 1949 | Uncertainty assigned by TRC = 0.05 K; TRC |
Quantity | Value | Units | Method | Reference | Comment |
Ttriple | 187.77 | K | N/A | Andon, Counsell, et al., 1974, 2 | Uncertainty assigned by TRC = 0.06 K; TRC |
Ttriple | 186.3 | K | N/A | Parks, Huffman, et al., 1933, 2 | Uncertainty assigned by TRC = 0.2 K; TRC |
Quantity | Value | Units | Method | Reference | Comment |
Tc | 500.3 | K | N/A | Majer and Svoboda, 1985 | |
Tc | 499.6 | K | N/A | Durig and Li, 1975 | Uncertainty assigned by TRC = 0.3 K; TRC |
Tc | 499.6 | K | N/A | Young, 1975 | Uncertainty assigned by TRC = 0.3 K; TRC |
Tc | 500.32 | K | N/A | Ambrose, Broderick, et al., 1974 | Uncertainty assigned by TRC = 0.1 K; TRC |
Tc | 500.1 | K | N/A | Kobe, Ravicz, et al., 1956 | Uncertainty assigned by TRC = 0.3 K; TRC |
Quantity | Value | Units | Method | Reference | Comment |
Pc | 28.32 | bar | N/A | Ambrose, Broderick, et al., 1974 | Uncertainty assigned by TRC = 0.06 bar; TRC |
Pc | 28.751 | bar | N/A | Kobe, Ravicz, et al., 1956 | Uncertainty assigned by TRC = 0.1378 bar; TRC |
Quantity | Value | Units | Method | Reference | Comment |
Vc | 0.386 | l/mol | N/A | Kobe, Ravicz, et al., 1956 | Uncertainty assigned by TRC = 0.005 l/mol; TRC |
Quantity | Value | Units | Method | Reference | Comment |
ΔvapH° | 32.26 | kJ/mol | N/A | Majer and Svoboda, 1985 | |
ΔvapH° | 32.7 ± 0.5 | kJ/mol | EB | Efimova, Pashchenko, et al., 2007 | Based on data from 285. to 365. K.; AC |
ΔvapH° | 32.12 | kJ/mol | C | Majer, Wagner, et al., 1980 | ALS |
ΔvapH° | 32.1 ± 0.1 | kJ/mol | C | Majer, Wagner, et al., 1980 | AC |
Enthalpy of vaporization
ΔvapH (kJ/mol) | Temperature (K) | Method | Reference | Comment |
---|---|---|---|---|
29.1 | 341.5 | N/A | Majer and Svoboda, 1985 | |
33.0 | 293. | N/A | Garriga, Andrés, et al., 1999 | Based on data from 278. to 323. K.; AC |
31.1 | 322. | N/A | Montón, de la Torre, et al., 1999 | Based on data from 307. to 349. K.; AC |
29.9 | 375. | A | Stephenson and Malanowski, 1987 | Based on data from 360. to 440. K.; AC |
29.5 | 451. | A | Stephenson and Malanowski, 1987 | Based on data from 436. to 500. K.; AC |
32.6 | 299. | A | Stephenson and Malanowski, 1987 | Based on data from 284. to 365. K. See also Ambrose, Ellender, et al., 1976.; AC |
32.1 | 311. | A,EB | Stephenson and Malanowski, 1987 | Based on data from 296. to 342. K. See also Cidlinský and Polák, 1969.; AC |
29.2 | 341. | N/A | Ambrose, Ellender, et al., 1976 | Based on data from 284. to 365. K.; AC |
30.1 | 336. | N/A | Nisel'son and Lapivus, 1965 | Based on data from 321. to 350. K. See also Dykyj, 1972.; AC |
33.2 | 288. | N/A | Nicolini and Laffitte, 1949 | Based on data from 273. to 333. K. See also Boublik, Fried, et al., 1984.; AC |
Enthalpy of vaporization
ΔvapH =
A exp(-βTr) (1 − Tr)β
ΔvapH =
Enthalpy of vaporization (at saturation pressure)
(kJ/mol)
Tr = reduced temperature (T / Tc)
View plot Requires a JavaScript / HTML 5 canvas capable browser.
Temperature (K) | A (kJ/mol) | β | Tc (K) | Reference | Comment |
---|---|---|---|---|---|
298. to 358. | 50.44 | 0.3006 | 500.3 | Majer and Svoboda, 1985 |
Antoine Equation Parameters
log10(P) = A − (B / (T + C))
P = vapor pressure (bar)
T = temperature (K)
View plot Requires a JavaScript / HTML 5 canvas capable browser.
Temperature (K) | A | B | C | Reference |
---|---|---|---|---|
296.7 to 340.36 | 3.96649 | 1135.034 | -54.92 | Cidlinský and Polák, 1969 |
Enthalpy of fusion
ΔfusH (kJ/mol) | Temperature (K) | Reference | Comment |
---|---|---|---|
12.035 | 187.77 | Andon, Counsell, et al., 1974 | DH |
12.05 | 187.8 | Andon, Counsell, et al., 1974, 2 | AC |
11.025 | 186.3 | Parks, Huffman, et al., 1933 | DH |
Entropy of fusion
ΔfusS (J/mol*K) | Temperature (K) | Reference | Comment |
---|---|---|---|
64.09 | 187.77 | Andon, Counsell, et al., 1974 | DH |
59.18 | 186.3 | Parks, Huffman, et al., 1933 | DH |

Reaction thermochemistry data

Data compiled by: Michael M. Meot-Ner (Mautner) and Sharon G. Lias
Individual Reactions
By formula: C6H15O+ + C6H14O = (C6H15O+ • C6H14O)
Bond type: Hydrogen bonds of the type OH-O between organics
Quantity | Value | Units | Method | Reference | Comment |
---|---|---|---|---|---|
ΔrH° | 111. | kJ/mol | ICR | Larson and McMahon, 1982 | gas phase; switching reaction((CH3)2OOH+)(CH3)2O, Entropy change calculated or estimated; Grimsrud and Kebarle, 1973, Lias, Liebman, et al., 1984, Keesee and Castleman, 1986 |
Quantity | Value | Units | Method | Reference | Comment |
ΔrS° | 136. | J/mol*K | N/A | Larson and McMahon, 1982 | gas phase; switching reaction((CH3)2OOH+)(CH3)2O, Entropy change calculated or estimated; Grimsrud and Kebarle, 1973, Lias, Liebman, et al., 1984, Keesee and Castleman, 1986 |
Quantity | Value | Units | Method | Reference | Comment |
ΔrG° | 70.7 | kJ/mol | ICR | Larson and McMahon, 1982 | gas phase; switching reaction((CH3)2OOH+)(CH3)2O, Entropy change calculated or estimated; Grimsrud and Kebarle, 1973, Lias, Liebman, et al., 1984, Keesee and Castleman, 1986 |

Henry's Law data

Data compiled by: Rolf Sander
Henry's Law constant (water solution)
kH(T) = k°H exp(d(ln(kH))/d(1/T) ((1/T) - 1/(298.15 K)))
k°H = Henry's law constant for solubility in water at 298.15 K (mol/(kg*bar))
d(ln(kH))/d(1/T) = Temperature dependence constant (K)
k°H (mol/(kg*bar)) | d(ln(kH))/d(1/T) (K) | Method | Reference | Comment |
---|---|---|---|---|
0.49 | M | N/A | ||
0.57 | Q | N/A | missing citation give several references for the Henry's law constants but don't assign them to specific species. | |
0.10 | V | N/A | ||
0.099 | V | N/A |

Gas phase ion energetics data

Data evaluated as indicated in comments:
HL - Edward P. Hunter and Sharon G. Lias
L - Sharon G. Lias
Data compiled as indicated in comments:
LLK - Sharon G. Lias, Rhoda D. Levin, and Sherif A. Kafafi
RDSH - Henry M. Rosenstock, Keith Draxl, Bruce W. Steiner, and John T. Herron
Quantity | Value | Units | Method | Reference | Comment |
---|---|---|---|---|---|
IE (evaluated) | 9.20 ± 0.05 | eV | N/A | N/A | L |
Quantity | Value | Units | Method | Reference | Comment |
Proton affinity (review) | 855.5 | kJ/mol | N/A | Hunter and Lias, 1998 | HL |
Quantity | Value | Units | Method | Reference | Comment |
Gas basicity | 828.1 | kJ/mol | N/A | Hunter and Lias, 1998 | HL |
Ionization energy determinations
IE (eV) | Method | Reference | Comment |
---|---|---|---|
9.16 ± 0.05 | EI | Williams and Hamill, 1968 | RDSH |
9.20 ± 0.05 | PI | Watanabe, Nakayama, et al., 1962 | RDSH |
9.32 | PE | Aue and Bowers, 1979 | Vertical value; LLK |
Appearance energy determinations
Ion | AE (eV) | Other Products | Method | Reference | Comment |
---|---|---|---|---|---|
C3H7+ | 11.3 ± 0.1 | ? | EI | Williams and Hamill, 1968 | RDSH |
C3H7O+ | 11.59 ± 0.05 | C3H7 | EI | Williams and Hamill, 1968 | RDSH |

Ion clustering data

Data compiled by: Michael M. Meot-Ner (Mautner) and Sharon G. Lias
Clustering reactions
By formula: C6H15O+ + C6H14O = (C6H15O+ • C6H14O)
Bond type: Hydrogen bonds of the type OH-O between organics
Quantity | Value | Units | Method | Reference | Comment |
---|---|---|---|---|---|
ΔrH° | 111. | kJ/mol | ICR | Larson and McMahon, 1982 | gas phase; switching reaction((CH3)2OOH+)(CH3)2O, Entropy change calculated or estimated; Grimsrud and Kebarle, 1973, Lias, Liebman, et al., 1984, Keesee and Castleman, 1986 |
Quantity | Value | Units | Method | Reference | Comment |
ΔrS° | 136. | J/mol*K | N/A | Larson and McMahon, 1982 | gas phase; switching reaction((CH3)2OOH+)(CH3)2O, Entropy change calculated or estimated; Grimsrud and Kebarle, 1973, Lias, Liebman, et al., 1984, Keesee and Castleman, 1986 |
Quantity | Value | Units | Method | Reference | Comment |
ΔrG° | 70.7 | kJ/mol | ICR | Larson and McMahon, 1982 | gas phase; switching reaction((CH3)2OOH+)(CH3)2O, Entropy change calculated or estimated; Grimsrud and Kebarle, 1973, Lias, Liebman, et al., 1984, Keesee and Castleman, 1986 |

Kovats' RI, non-polar column, isothermal

Column type | Active phase | Temperature (C) | I | Reference | Comment |
---|---|---|---|---|---|
Packed | SE-30 | 120. | 593. | García-Raso, Martínez-Castro, et al., 1987 | N2, Supelcoport; Column length: 3. m |
Packed | SE-30 | 150. | 590. | Tiess, 1984 | Ar, Gas Chrom Q (80-100 mesh); Column length: 3. m |
Packed | SE-30 | 100. | 594. | Winskowski, 1983 | Gaschrom Q; Column length: 2. m |
Packed | Porapack Q | 200. | 624. | Goebel, 1982 | N2 |
Packed | Apiezon L | 120. | 563. | Bogoslovsky, Anvaer, et al., 1978 | Celite 545 |
Packed | Apiezon L | 160. | 564. | Bogoslovsky, Anvaer, et al., 1978 | Celite 545 |
Packed | Apiezon L | 70. | 570. | Bogoslovsky, Anvaer, et al., 1978 | |
Packed | Apiezon M | 130. | 565. | Golovnya and Garbuzov, 1974 | N2, Chromosorb W; Column length: 2.1 m |
Packed | Apiezon L | 130. | 568. | Wehrli and Kováts, 1959 | Celite; Column length: 2.25 m |
Packed | Apiezon L | 70. | 570. | Wehrli and Kováts, 1959 | Celite; Column length: 2.25 m |

Kovats' RI, non-polar column, custom temperature program

Column type | Active phase | I | Reference | Comment |
---|---|---|---|---|
Capillary | Petrocol DH-100 | 602. | Haagen-Smit Laboratory, 1997 | He; Column length: 100. m; Column diameter: 0.2 mm; Program: 5C(10min) => 5C/min => 50C(48min) => 1.5C/min => 195C(91min) |

Kovats' RI, polar column, isothermal

Column type | Active phase | Temperature (C) | I | Reference | Comment |
---|---|---|---|---|---|
Capillary | Carbowax 20M | 120. | 652. | García-Raso, Martínez-Castro, et al., 1987 | N2, Supelcoport; Column length: 25. m; Column diameter: 0.22 mm |
Packed | Carbowax 20M | 75. | 679. | Goebel, 1982 | N2, Kieselgur (60-100 mesh); Column length: 2. m |
Packed | PEG-2000 | 120. | 682. | Anderson, Jurel, et al., 1973 | He, Celite 545 (44-60 mesh); Column length: 3. m |
Packed | PEG-2000 | 150. | 670. | Anderson, Jurel, et al., 1973 | He, Celite 545 (44-60 mesh); Column length: 3. m |
Packed | PEG-2000 | 180. | 667. | Anderson, Jurel, et al., 1973 | He, Celite 545 (44-60 mesh); Column length: 3. m |

Van Den Dool and Kratz RI, polar column, temperature ramp

Column type | Active phase | I | Reference | Comment |
---|---|---|---|---|
Capillary | PEG-20M | 659.0 | Wang and Sun, 1985 | 3. K/min; Column length: 62. m; Column diameter: 0.27 mm; Tstart: 70. C |
Capillary | PEG-20M | 658.3 | Wang and Sun, 1985 | 4. K/min; Column length: 62. m; Column diameter: 0.27 mm; Tstart: 70. C |
Capillary | PEG-20M | 657.0 | Wang and Sun, 1985 | 2. K/min; Column length: 62. m; Column diameter: 0.27 mm; Tstart: 80. C |
Capillary | PEG-20M | 655.4 | Wang and Sun, 1985 | 2. K/min; Column length: 62. m; Column diameter: 0.27 mm; Tstart: 90. C |

Normal alkane RI, non-polar column, temperature ramp

Column type | Active phase | I | Reference | Comment |
---|---|---|---|---|
Capillary | Polydimethyl siloxane: CP-Sil 5 CB | 602. | Bramston-Cook, 2013 | 60. m/0.25 mm/1.0 μm, Helium, 45. C @ 1.45 min, 3.6 K/min, 210. C @ 2.72 min |

Normal alkane RI, non-polar column, custom temperature program

Column type | Active phase | I | Reference | Comment |
---|---|---|---|---|
Capillary | SE-30 | 590. | Vinogradov, 2004 | Program: not specified |
Capillary | Methyl Silicone | 568. | N/A | Program: not specified |
Capillary | SPB-1 | 598. | Flanagan, Streete, et al., 1997 | 60. m/0.53 mm/5. μm, He; Program: 40C(6min) => 5C/min => 80C => 10C/min => 200C |
Capillary | Methyl Silicone | 596. | Zenkevich, Korolenko, et al., 1995 | Program: not specified |
Capillary | SPB-1 | 598. | Strete, Ruprah, et al., 1992 | 60. m/0.53 mm/5.0 μm, Helium; Program: 40 0C (6 min) 5 0C/min -> 80 0C 10 0C/min -> 200 0C |
Capillary | SPB-1 | 594. | Strete, Ruprah, et al., 1992 | 60. m/0.53 mm/5.0 μm, Helium; Program: not specified |
Capillary | CP Sil 8 CB | 603. | Weller and Wolf, 1989 | 40. m/0.25 mm/0.25 μm, He; Program: 30 0C (1 min) 15 0C/min -> 45 0C 3 0C/min -> 120 0C |
Capillary | OV-1, SE-30, Methyl silicone, SP-2100, OV-101, DB-1, etc. | 594. | Waggott and Davies, 1984 | Hydrogen; Column length: 50. m; Column diameter: 0.32 mm; Program: not specified |
Capillary | OV-1 | 594. | Ramsey and Flanagan, 1982 | Program: not specified |

Normal alkane RI, polar column, temperature ramp

Column type | Active phase | I | Reference | Comment |
---|---|---|---|---|
Packed | Carbowax 20M | 651. | Tsao, 1969 | Helium, Chromosorb P HMDS, 5. K/min; Column length: 2. m; Tstart: 40. C; Tend: 200. C |

Normal alkane RI, polar column, custom temperature program

Column type | Active phase | I | Reference | Comment |
---|---|---|---|---|
Capillary | Carbowax 20M | 649. | Vinogradov, 2004 | Program: not specified |
Capillary | Polyethylene Glycol | 662. | Zenkevich, Korolenko, et al., 1995 | Program: not specified |
Capillary | Carbowax 400, Carbowax 20M, Carbowax 1540, Carbowax 4000, Superox 06, PEG 20M, etc. | 657. | Waggott and Davies, 1984 | Hydrogen; Column length: 50. m; Column diameter: 0.32 mm; Program: not specified |
Capillary | Carbowax 400, Carbowax 20M, Carbowax 1540, Carbowax 4000, Superox 06, PEG 20M, etc. | 658. | Waggott and Davies, 1984 | Hydrogen; Column length: 50. m; Column diameter: 0.32 mm; Program: not specified |
Capillary | Carbowax 400, Carbowax 20M, Carbowax 1540, Carbowax 4000, Superox 06, PEG 20M, etc. | 659. | Waggott and Davies, 1984 | Hydrogen; Column length: 50. m; Column diameter: 0.32 mm; Program: not specified |

References

Colomina, Pell, et al., 1965
Colomina, M.; Pell, A.S.; Skinner, H.A.; Coleman, D.J.,
Heats of combustion of four dialkylethers,
Trans. Faraday Soc., 1965, 61, 2641. [all data]
Andon R.J.L., 1974
Andon R.J.L.,
Thermodynamic properties of organic oxygen compounds. Part 36. Heat capacity of isopropyl ether,
J. Chem. Soc. Faraday Trans. 2, 1974, 70, 1914-1917. [all data]
Andon, Counsell, et al., 1974
Andon, R.J.L.; Counsell, J.F.; Lee, D.A.; Martin, J.F.,
Thermodynamic properties of organic oxygen compounds. Part 36. Heat capacity of isopropyl ether,
J. Chem. Soc. Faraday Trans., 1974, I 70, 1914-1917. [all data]
Parks, Huffman, et al., 1933
Parks, G.S.; Huffman, H.M.; Barmore, M.,
Thermal data on organic compounds. XI. The heat capacities,
entropies and free energies of ten compounds containing oxygen or nitrogen. J. Am. Chem. Soc., 1933, 55, 2733-2740. [all data]
Grolier, Roux-Desgranges, et al., 1993
Grolier, J.-P.E.; Roux-Desgranges, G.; Berkane, M.; Jimenez, E.; Wilhelm, E.,
Heat capacities and densities of mixtures of very polar substances 2. Mixtures containing N,N-dimethylformamide,
J. Chem. Thermodynam., 1993, 25(1), 41-50. [all data]
Dreisbach and Martin, 1949
Dreisbach, R.R.; Martin, R.A.,
Physical Data on Some Organic Compounds,
Ind. Eng. Chem., 1949, 41, 2875-8. [all data]
Andon, Counsell, et al., 1974, 2
Andon, Richard J.L.; Counsell, Jack F.; Lee, Derek A.; Martin, John F.,
Thermodynamic properties of organic oxygen compounds. Part 36.---Heat capacity of isopropyl ether,
J. Chem. Soc., Faraday Trans. 1, 1974, 70, 0, 1914, https://doi.org/10.1039/f19747001914
. [all data]
Parks, Huffman, et al., 1933, 2
Parks, G.S.; Huffman, H.M.; Barmore, M.,
Thermal Data on Organic Compounds. XI. The Heat Capacities, Entropies and Free Energies of Ten Compounds Containing Oxygen or Nitrogen,
J. Am. Chem. Soc., 1933, 55, 7, 2733, https://doi.org/10.1021/ja01334a016
. [all data]
Majer and Svoboda, 1985
Majer, V.; Svoboda, V.,
Enthalpies of Vaporization of Organic Compounds: A Critical Review and Data Compilation, Blackwell Scientific Publications, Oxford, 1985, 300. [all data]
Durig and Li, 1975
Durig, J.R.; Li, Y.S.,
Raman Spectra of Gases XVII Internal Rotational Motion in Ethylamine and Ethylamine-d2,
J. Chem. Phys., 1975, 63, 4110. [all data]
Young, 1975
Young, C.L.,
Gas-liquid critical properties. Diisopropyl ether-n-hexane system,
Int. DATA Ser., Sel. Data Mixtures, Ser. A, 1975, No. 2, 159. [all data]
Ambrose, Broderick, et al., 1974
Ambrose, D.; Broderick, B.E.; Townsend, R.,
The Critical Temperatures and Pressures of Thirty Organic Compounds,
J. Appl. Chem. Biotechnol., 1974, 24, 359. [all data]
Kobe, Ravicz, et al., 1956
Kobe, K.A.; Ravicz, A.E.; Vohra, S.P.,
Critical Properties and Vapor Pressures of Some Ethers and Heterocyclic Compounds,
J. Chem. Eng. Data, 1956, 1, 50. [all data]
Efimova, Pashchenko, et al., 2007
Efimova, A.A.; Pashchenko, L.L.; Varushchenko, R.M.; Krasnyh, E.; Levanova, S.V.,
The thermodynamics of vaporization of ethyl tert-butyl ether, isobutyl tert-butyl ether, and di-isopropyl ether,
The Journal of Chemical Thermodynamics, 2007, 39, 1, 142-147, https://doi.org/10.1016/j.jct.2006.05.007
. [all data]
Majer, Wagner, et al., 1980
Majer, V.; Wagner, Z.; Svoboda, V.; Cadek, V.,
Enthalpies of vaporization and cohesive energies for a group of aliphatic ethers,
J. Chem. Thermodyn., 1980, 12, 387-391. [all data]
Garriga, Andrés, et al., 1999
Garriga, Rosa; Andrés, Ana Cristina; Pérez, Pascual; Gracia, Mariano,
Vapor Pressures at Several Temperatures and Excess Functions at 298.15 K of Butanone with Di- n -propyl Ether or Diisopropyl Ether,
J. Chem. Eng. Data, 1999, 44, 2, 296-302, https://doi.org/10.1021/je980179h
. [all data]
Montón, de la Torre, et al., 1999
Montón, Juan B.; de la Torre, Javier; Burguet, M.C.; Muñoz, Rosa; Loras, Sonia,
Isobaric Vapor-Liquid Equilibrium in the Systems 2,3-Dimethylpentane + Methyl 1,1-Dimethylethyl Ether, + Diisopropyl Ether and + Methyl 1,1-Dimethylpropyl Ether,
J. Chem. Eng. Data, 1999, 44, 6, 1158-1162, https://doi.org/10.1021/je990110p
. [all data]
Stephenson and Malanowski, 1987
Stephenson, Richard M.; Malanowski, Stanislaw,
Handbook of the Thermodynamics of Organic Compounds, 1987, https://doi.org/10.1007/978-94-009-3173-2
. [all data]
Ambrose, Ellender, et al., 1976
Ambrose, D.; Ellender, J.H.; Sprake, C.H.S.; Townsend, R.,
Thermodynamic properties of organic oxygen compounds XLIII. Vapour pressures of some ethers,
The Journal of Chemical Thermodynamics, 1976, 8, 2, 165-178, https://doi.org/10.1016/0021-9614(76)90090-2
. [all data]
Cidlinský and Polák, 1969
Cidlinský, J.; Polák, J.,
Saturated vapour pressures of some ethers,
Collect. Czech. Chem. Commun., 1969, 34, 4, 1317-1321, https://doi.org/10.1135/cccc19691317
. [all data]
Nisel'son and Lapivus, 1965
Nisel'son, L.A.; Lapivus, I.I.,
Russ. J. Phys. Chem., 1965, 39, 931. [all data]
Dykyj, 1972
Dykyj, J.,
Petrochemia, 1972, 12, 1, 13. [all data]
Nicolini and Laffitte, 1949
Nicolini, E.; Laffitte, P.,
Compt. Rend., 1949, 229, 757. [all data]
Boublik, Fried, et al., 1984
Boublik, T.; Fried, V.; Hala, E.,
The Vapour Pressures of Pure Substances: Selected Values of the Temperature Dependence of the Vapour Pressures of Some Pure Substances in the Normal and Low Pressure Region, 2nd ed., Elsevier, New York, 1984, 972. [all data]
Larson and McMahon, 1982
Larson, J.W.; McMahon, T.B.,
Formation, Thermochemistry, and Relative Stabilities of Proton - Bound dimers of Oxygen n - Donor Bases from Ion Cyclotron Resonance Solvent - Exchange Equilibria Measurements,
J. Am. Chem. Soc., 1982, 104, 23, 6255, https://doi.org/10.1021/ja00387a016
. [all data]
Grimsrud and Kebarle, 1973
Grimsrud, E.P.; Kebarle, P.,
Gas Phase Ion Equilibria Studies of the Solvation of the Hydrogen Ion by Methanol, Dimethyl Ether and Water. Effect of Hydrogen Bonding,
J. Am. Chem. Soc., 1973, 95, 24, 7939, https://doi.org/10.1021/ja00805a002
. [all data]
Lias, Liebman, et al., 1984
Lias, S.G.; Liebman, J.F.; Levin, R.D.,
Evaluated gas phase basicities and proton affinities of molecules heats of formation of protonated molecules,
J. Phys. Chem. Ref. Data, 1984, 13, 695. [all data]
Keesee and Castleman, 1986
Keesee, R.G.; Castleman, A.W., Jr.,
Thermochemical data on Ggs-phase ion-molecule association and clustering reactions,
J. Phys. Chem. Ref. Data, 1986, 15, 1011. [all data]
Hunter and Lias, 1998
Hunter, E.P.; Lias, S.G.,
Evaluated Gas Phase Basicities and Proton Affinities of Molecules: An Update,
J. Phys. Chem. Ref. Data, 1998, 27, 3, 413-656, https://doi.org/10.1063/1.556018
. [all data]
Williams and Hamill, 1968
Williams, J.M.; Hamill, W.H.,
Ionization potentials of molecules and free radicals and appearance potentials by electron impact in the mass spectrometer,
J. Chem. Phys., 1968, 49, 4467. [all data]
Watanabe, Nakayama, et al., 1962
Watanabe, K.; Nakayama, T.; Mottl, J.,
Ionization potentials of some molecules,
J. Quant. Spectry. Radiative Transfer, 1962, 2, 369. [all data]
Aue and Bowers, 1979
Aue, D.H.; Bowers, M.T.,
Chapter 9. Stabilities of positive ions from equilibrium gas phase basicity measurements
in Ions Chemistry,, ed. M.T. Bowers, 1979. [all data]
García-Raso, Martínez-Castro, et al., 1987
García-Raso, A.; Martínez-Castro, I.; Páez, M.I.; Sanz, J.; García-Raso, J.; Saura-Calixto, F.,
Gas Chromatographic Behaviour of Carbohydrate Trimethylsilyl Ethers. I. Aldopentoses,
J. Chromatogr., 1987, 398, 9-20, https://doi.org/10.1016/S0021-9673(01)96491-X
. [all data]
Tiess, 1984
Tiess, D.,
Gaschromatographische Retentionsindices von 125 leicht- bis mittelflüchtigen organischen Substanzen toxikologisch-analytischer Relevanz auf SE-30,
Wiss. Z. Wilhelm-Pieck-Univ. Rostock Math. Naturwiss. Reihe, 1984, 33, 6-9. [all data]
Winskowski, 1983
Winskowski, J.,
Gaschromatographische Identifizierung von Stoffen anhand von Indexziffem und unterschiedlichen Detektoren,
Chromatographia, 1983, 17, 3, 160-165, https://doi.org/10.1007/BF02271041
. [all data]
Goebel, 1982
Goebel, K.-J.,
Gaschromatographische Identifizierung Niedrig Siedender Substanzen Mittels Retentionsindices und Rechnerhilfe,
J. Chromatogr., 1982, 235, 1, 119-127, https://doi.org/10.1016/S0021-9673(00)95793-5
. [all data]
Bogoslovsky, Anvaer, et al., 1978
Bogoslovsky, Yu.N.; Anvaer, B.I.; Vigdergauz, M.S.,
Chromatographic constants in gas chromatography (in Russian), Standards Publ. House, Moscow, 1978, 192. [all data]
Golovnya and Garbuzov, 1974
Golovnya, R.V.; Garbuzov, V.G.,
Effect of heteroatom in aliphatic sulfur- and oxygen-containing compounds on the values of the retention indices in gas chromatography,
Izv. Akad. Nauk SSSR Ser. Khim., 1974, 7, 1519-1521. [all data]
Wehrli and Kováts, 1959
Wehrli, A.; Kováts, E.,
Gas-chromatographische Charakterisierung ogranischer Verbindungen. Teil 3: Berechnung der Retentionsindices aliphatischer, alicyclischer und aromatischer Verbindungen,
Helv. Chim. Acta, 1959, 7, 7, 2709-2736, https://doi.org/10.1002/hlca.19590420745
. [all data]
Haagen-Smit Laboratory, 1997
Haagen-Smit Laboratory,
Procedure for the detailed hydrocarbon analysis of gasolines by single column high efficiency (capillary) column gas chromatography, SOP NO. MLD 118, Revision No. 1.1, California Environmental Protection Agency, Air Resources Board, El Monte, California, 1997, 22. [all data]
Anderson, Jurel, et al., 1973
Anderson, A.; Jurel, S.; Shymanska, M.; Golender, L.,
Gas-liquid chromatography of some aliphatic and heterocyclic mono- and pollyfunctional amines. VII. Retention indices of amines in some polar and unpolar stationary phases,
Latv. PSR Zinat. Akad. Vestis Kim. Ser., 1973, 1, 51-63. [all data]
Wang and Sun, 1985
Wang, T.; Sun, Y.,
Correlation of Retention Indices obtained with Two Temperature Programmes,
J. Chromatogr., 1985, 330, 167-171, https://doi.org/10.1016/S0021-9673(01)81973-7
. [all data]
Bramston-Cook, 2013
Bramston-Cook, R.,
Kovats indices for C2-C13 hydrocarbons and selected oxygenated/halocarbons with 100 % dimethylpolysiloxane columns, 2013, retrieved from http://lotusinstruments.com/monographs/List .... [all data]
Vinogradov, 2004
Vinogradov, B.A.,
Production, composition, properties and application of essential oils, 2004, retrieved from http://viness.narod.ru. [all data]
Flanagan, Streete, et al., 1997
Flanagan, R.J.; Streete, P.J.; Ramsey, J.D.,
Volatile Substance Abuse, UNODC Technical Series, No 5, United Nations, Office on Drugs and Crime, Vienna International Centre, PO Box 500, A-1400 Vienna, Austria, 1997, 56, retrieved from http://www.odccp.org/pdf/technicalseries1997-01-011.pdf. [all data]
Zenkevich, Korolenko, et al., 1995
Zenkevich, I.G.; Korolenko, L.I.; Khralenkova, N.B.,
Desorption with solvent vapor as a method of sample preparation in the sorption preconcentration of organic-compounds from the air of a working area and from industrial-waste gases,
J. Appl. Chem. USSR (Engl. Transl.), 1995, 50, 10, 937-944. [all data]
Strete, Ruprah, et al., 1992
Strete, P.J.; Ruprah, M.; Ramsey, J.D.; Flanagan, R.J.,
Detection and identification of volatile substances by headspace capillary gas chromatography to aid the diagnosis of acute poisoning,
Analyst, 1992, 117, 7, 1111-1127, https://doi.org/10.1039/an9921701111
. [all data]
Weller and Wolf, 1989
Weller, J.-P.; Wolf, M.,
Massenspektroskopie und Headspace-GC,
Beitr. Gerichtl. Med., 1989, 47, 525-532. [all data]
Waggott and Davies, 1984
Waggott, A.; Davies, I.W.,
Identification of organic pollutants using linear temperature programmed retention indices (LTPRIs) - Part II, 1984, retrieved from http://dwi.defra.gov.uk/research/completed-research/reports/dwi0383.pdf. [all data]
Ramsey and Flanagan, 1982
Ramsey, J.D.; Flanagan, R.J.,
Detection and Identification of Volatile Organic Compounds in Blood by Headspace Gas Chromatography as an Aid to the Diagnosis of Solvent Abuse,
J. Chromatogr., 1982, 240, 2, 423-444, https://doi.org/10.1016/S0021-9673(00)99622-5
. [all data]
Tsao, 1969
Tsao, J.C.Y.,
Prelimivary reports on structural study via mercury-sensitized photolysis and gas chromatography,
J. Chin. Chem. Soc., 1969, 16, 4, 152-163. [all data]