2-Pentanamine, 4-methyl-
- Formula: C6H15N
- Molecular weight: 101.1900
- IUPAC Standard InChIKey: UNBMPKNTYKDYCG-UHFFFAOYSA-N
- CAS Registry Number: 108-09-8
- Chemical structure:
View 3d structure (requires JavaScript / HTML 5) - Other names: Butylamine, 1,3-dimethyl-; 1,3-Dimethylbutanamine; 1,3-Dimethylbutylamine; 2-Amino-4-methylpentane; 4-Methyl-2-aminopentane; 1,3-Dimethyl-n-butylamine; UN 2379

Phase change data

Data compiled as indicated in comments:
BS - Robert L. Brown and Stephen E. Stein
TRC - Thermodynamics Research Center, NIST Boulder Laboratories, Chris Muzny director
Quantity | Value | Units | Method | Reference | Comment |
---|---|---|---|---|---|
Tboil | 382.2 | K | N/A | Aldrich Chemical Company Inc., 1990 | BS |
Tboil | 351.15 | K | N/A | Schuerch and Huntress, 1949 | Uncertainty assigned by TRC = 2. K; TRC |

Gas phase ion energetics data

Data compiled by: Sharon G. Lias and Joel F. Liebman
Appearance energy determinations
Ion | AE (eV) | Other Products | Method | Reference | Comment |
---|---|---|---|---|---|
C2H6N+ | 9.09 | (CH3)2CHCH2 | EI | Holmes, Lossing, et al., 1988 |

References

Aldrich Chemical Company Inc., 1990
Aldrich Chemical Company Inc.,
Catalog Handbook of Fine Chemicals, Aldrich Chemical Company, Inc., Milwaukee WI, 1990, 1. [all data]
Schuerch and Huntress, 1949
Schuerch, C.; Huntress, E.H.,
The Schmidt Reaction II. A New Rearangement Obseved during Degradation of Triethylacetic Acid,
J. Am. Chem. Soc., 1949, 71, 2238. [all data]
Holmes, Lossing, et al., 1988
Holmes, J.L.; Lossing, F.P.; Maccoll, A.,
Heats of formation of alkyl radicals from appearance energies,
J. Am. Chem. Soc., 1988, 110, 7339. [all data]