2-Propanol, 1-methoxy-
- Formula: C4H10O2
- Molecular weight: 90.1210
- IUPAC Standard InChIKey: ARXJGSRGQADJSQ-UHFFFAOYSA-N
- CAS Registry Number: 107-98-2
- Chemical structure:
View 3d structure (requires JavaScript / HTML 5) - Other names: α-Propylene glycol monomethyl ether; Dowanol-33B; Dowtherm 209; 1-Methoxy-2-hydroxypropane; 1-Methoxy-2-propanol; 2-Methoxy-1-methylethanol; 1-Methoxypropan-2-ol; Glycol ether pm; Poly-solve MPM; Propasol solvent M; Ucar solvent lm; Icinol PM; Methoxypropanol, α isomer; PGME; Poly-solv MPM; Propylene glycol 1-methyl ether; Solvent PM; Propan-1-methoxy-2-ol; Propan-2-ol, 1-methoxy-; Closol; Methoxyisopropanol; NSC 2409

Phase change data

Data compiled as indicated in comments:
BS - Robert L. Brown and Stephen E. Stein
TRC - Thermodynamics Research Center, NIST Boulder Laboratories, Chris Muzny director
AC - William E. Acree, Jr., James S. Chickos
Quantity | Value | Units | Method | Reference | Comment |
---|---|---|---|---|---|
Tboil | 391.7 | K | N/A | Aldrich Chemical Company Inc., 1990 | BS |
Quantity | Value | Units | Method | Reference | Comment |
Tc | 579.8 | K | N/A | Wilson, Wilson, et al., 1996 | Uncertainty assigned by TRC = 0.3 K; TRC |
Quantity | Value | Units | Method | Reference | Comment |
Pc | 41.13 | bar | N/A | Wilson, Wilson, et al., 1996 | Uncertainty assigned by TRC = 0.10 bar; TRC |
Quantity | Value | Units | Method | Reference | Comment |
ΔvapH° | 46.2 | kJ/mol | EB | Antosik, Galka, et al., 2004 | Based on data from 331. to 373. K.; AC |
ΔvapH° | 46.4 | kJ/mol | EB | Chylinski, Fras, et al., 2004 | Based on data from 347. to 378. K.; AC |

Gas phase ion energetics data

Data compiled by: Sharon G. Lias and Joel F. Liebman
Appearance energy determinations
Ion | AE (eV) | Other Products | Method | Reference | Comment |
---|---|---|---|---|---|
CH3O+ | 12.0 ± 0.1 | C2H3O+CH4 | EI | Sirois, George, et al., 1994 | |
C2H7O+ | 9.54 ± 0.05 | C2H3O | EI | Sirois, George, et al., 1994 |

Normal alkane RI, non-polar column, custom temperature program

Data compiled by: NIST Mass Spectrometry Data Center, William E. Wallace, director

Column type CapillaryCapillaryCapillary
Active phase HP-5HP-5DB-5
Column length (m) 50.50.50.
Carrier gas Helium
Substrate
Column diameter (mm) 0.320.320.32
Phase thickness (μm) 1.051.051.05
Program 40 0C (10 min) 5 0C/min -> 200 0C 15 0C/min -> 250 0C (10 min)40C(10min) => 5C/min => 200C => 20C/min => 250C(5min)40C(10min) => 5C/min => 200C => 20C/min => 250C (5min)
I 649.673.673.
ReferenceVentanas, Estevez, et al., 2008Garcia-Estaban, Ansorena, et al., 2004Garcia-Estaban, Ansorena, et al., 2004, 2
Comment MSDC-RI MSDC-RI MSDC-RI

Van Den Dool and Kratz RI, non-polar column, custom temperature program

Data compiled by: NIST Mass Spectrometry Data Center, William E. Wallace, director

Column type Packed
Active phase SE-30
Column length (m) 3.05
Carrier gas
Substrate Supelcoport; Chromosorb
Column diameter (mm)
Phase thickness (μm)
Program 40C(5min) => 10C/min => 200C or 250C (60min)
I 669.
ReferencePeng, Ding, et al., 1988
Comment MSDC-RI

References

Aldrich Chemical Company Inc., 1990
Aldrich Chemical Company Inc.,
Catalog Handbook of Fine Chemicals, Aldrich Chemical Company, Inc., Milwaukee WI, 1990, 1. [all data]
Wilson, Wilson, et al., 1996
Wilson, L.C.; Wilson, H.L.; Wilding, W.V.; Wilson, G.M.,
Critical Point Measurements for Fourteen Compounds by a Static Method and a Flow Method,
J. Chem. Eng. Data, 1996, 41, 1252-4. [all data]
Antosik, Galka, et al., 2004
Antosik, Maria; Galka, Maria; Malanowski, Stanislaw K.,
Vapor-Liquid Equilibrium for Acetonitrile + Propanenitrile and 1-Pentanamine + 1-Methoxy-2-propanol «8224»,
J. Chem. Eng. Data, 2004, 49, 1, 11-17, https://doi.org/10.1021/je025660t
. [all data]
Chylinski, Fras, et al., 2004
Chylinski, Krzysztof; Fras, Zbigniew; Malanowski, Stanislaw K.,
Vapor-Liquid Equilibrium for Propylene Glycol + 2-(2-Hexyloxyethoxy)ethanol and 1-Methyl-2-pyrrolidone + 1-Methoxypropan-2-ol «8224»,
J. Chem. Eng. Data, 2004, 49, 1, 18-23, https://doi.org/10.1021/je034096z
. [all data]
Sirois, George, et al., 1994
Sirois, M.; George, M.; Holmes, J.L.,
Neutral counterparts of the C2H7O+ isomers,
Org. Mass Spectrom., 1994, 29, 11. [all data]