N-Methylglycine
- Formula: C3H7NO2
- Molecular weight: 89.0932
- IUPAC Standard InChIKey: FSYKKLYZXJSNPZ-UHFFFAOYSA-N
- CAS Registry Number: 107-97-1
- Chemical structure:
View 3d structure (requires JavaScript / HTML 5) - Other names: Sarcosine; CH3NHCH2COOH; Methylaminoacetic acid; Glycine, N-methyl-; Acetic acid, (methylamino)-; N-Methylaminoacetic acid; (Methylamino)ethanoic acid; Methylglycine; Sarcosin; Sarcosinic acid; Sar; N-Methyl-glycocoll

Gas phase thermochemistry data

Data compiled by: Hussein Y. Afeefy, Joel F. Liebman, and Stephen E. Stein
Quantity | Value | Units | Method | Reference | Comment |
---|---|---|---|---|---|
ΔfH°gas | -367.2 ± 1.0 | kJ/mol | Ccb | Sabbah and Laffitte, 1978 | see Sabbah and Laffitte, 1978, 2 |

Condensed phase thermochemistry data

Data compiled as indicated in comments:
ALS - Hussein Y. Afeefy, Joel F. Liebman, and Stephen E. Stein
DH - Eugene S. Domalski and Elizabeth D. Hearing
Quantity | Value | Units | Method | Reference | Comment |
---|---|---|---|---|---|
ΔfH°solid | -513.24 ± 0.26 | kJ/mol | Ccb | Sabbah and Laffitte, 1977 | ALS |
ΔfH°solid | -508.6 ± 1.3 | kJ/mol | Ccb | Breitenbach, Derkosch, et al., 1952 | Reanalyzed by Cox and Pilcher, 1970, Original value = -507.1 kJ/mol; ALS |
Quantity | Value | Units | Method | Reference | Comment |
ΔcH°solid | -1667.69 ± 0.15 | kJ/mol | Ccb | Sabbah and Laffitte, 1977 | ALS |
ΔcH°solid | -1672.3 ± 1.3 | kJ/mol | Ccb | Breitenbach, Derkosch, et al., 1952 | Reanalyzed by Cox and Pilcher, 1970, Original value = -1674. kJ/mol; ALS |
Constant pressure heat capacity of solid
Cp,solid (J/mol*K) | Temperature (K) | Reference | Comment |
---|---|---|---|
128.9 | 298.15 | Sabbah and Laffitte, 1977 | DH |

Phase change data

Data compiled as indicated in comments:
AC - William E. Acree, Jr., James S. Chickos
ALS - Hussein Y. Afeefy, Joel F. Liebman, and Stephen E. Stein
Quantity | Value | Units | Method | Reference | Comment |
---|---|---|---|---|---|
ΔsubH° | 146. ± 1. | kJ/mol | C | Sabbah and Laffite, 1978 | Based on data from 380. to 413. K.; AC |
ΔsubH° | 146. ± 1. | kJ/mol | C | Sabbah and Laffitte, 1978 | see Sabbah and Laffitte, 1978, 2; ALS |

Reaction thermochemistry data

Data compiled by: John E. Bartmess
Individual Reactions
C3H6NO2- + =
By formula: C3H6NO2- + H+ = C3H7NO2
Quantity | Value | Units | Method | Reference | Comment |
---|---|---|---|---|---|
ΔrH° | 1429. ± 8.8 | kJ/mol | G+TS | Locke and McIver, 1983 | gas phase |
Quantity | Value | Units | Method | Reference | Comment |
ΔrG° | 1400. ± 8.4 | kJ/mol | IMRE | Locke and McIver, 1983 | gas phase |

Gas phase ion energetics data

Data evaluated as indicated in comments:
HL - Edward P. Hunter and Sharon G. Lias
Data compiled as indicated in comments:
B - John E. Bartmess
LBLHLM - Sharon G. Lias, John E. Bartmess, Joel F. Liebman, John L. Holmes, Rhoda D. Levin, and W. Gary Mallard
Quantity | Value | Units | Method | Reference | Comment |
---|---|---|---|---|---|
Proton affinity (review) | 921.2 | kJ/mol | N/A | Hunter and Lias, 1998 | HL |
Quantity | Value | Units | Method | Reference | Comment |
Gas basicity | 888.7 | kJ/mol | N/A | Hunter and Lias, 1998 | HL |
Ionization energy determinations
IE (eV) | Method | Reference | Comment |
---|---|---|---|
8.4 | PE | Cannington and Ham, 1983 | LBLHLM |
9.2 | PE | Cannington and Ham, 1983 | Vertical value; LBLHLM |
De-protonation reactions
C3H6NO2- + =
By formula: C3H6NO2- + H+ = C3H7NO2
Quantity | Value | Units | Method | Reference | Comment |
---|---|---|---|---|---|
ΔrH° | 1429. ± 8.8 | kJ/mol | G+TS | Locke and McIver, 1983 | gas phase; B |
Quantity | Value | Units | Method | Reference | Comment |
ΔrG° | 1400. ± 8.4 | kJ/mol | IMRE | Locke and McIver, 1983 | gas phase; B |

References

Sabbah and Laffitte, 1978
Sabbah, R.; Laffitte, M.,
Thermodynamique de composes azotes. IV. Etude thermochimique de la sarcosine et de la L-proline,
Bull. Soc. Chim. Fr., 1978, 1, 50-52. [all data]
Sabbah and Laffitte, 1978, 2
Sabbah, R.; Laffitte, M.,
Enthalpy of formation of L-serine in the solid state,
Thermochim. Acta, 1978, 23, 192-195. [all data]
Sabbah and Laffitte, 1977
Sabbah, R.; Laffitte, M.,
The enthalpy of formation of sarcosine in the solid state,
J. Chem. Thermodyn., 1977, 9, 1107-1108. [all data]
Breitenbach, Derkosch, et al., 1952
Breitenbach, J.W.; Derkosch, J.; Wessely, F.,
Energetik der bildung hochmolekularer polypeptide,
Monatsh. Chem., 1952, 83, 591. [all data]
Cox and Pilcher, 1970
Cox, J.D.; Pilcher, G.,
Thermochemistry of Organic and Organometallic Compounds, Academic Press, New York, 1970, 1-636. [all data]
Sabbah and Laffite, 1978
Sabbah, R.; Laffite, M.,
Bull. Soc. Chim. Fr., 1978, 1, 50. [all data]
Locke and McIver, 1983
Locke, M.J.; McIver, R.T., Jr.,
Effect of Solvation on the Acid/Base Properties of Glycine,
J. Am. Chem. Soc., 1983, 105, 4226. [all data]
Hunter and Lias, 1998
Hunter, E.P.; Lias, S.G.,
Evaluated Gas Phase Basicities and Proton Affinities of Molecules: An Update,
J. Phys. Chem. Ref. Data, 1998, 27, 3, 413-656, https://doi.org/10.1063/1.556018
. [all data]
Cannington and Ham, 1983
Cannington, P.H.; Ham, N.S.,
He(I) and He(II) photoelectron spectra of glycine and related molecules,
J. Electron Spectrosc. Relat. Phenom., 1983, 32, 139. [all data]