Phosphinous chloride, diphenyl-
- Formula: C12H10ClP
- Molecular weight: 220.635
- IUPAC Standard InChIKey: XGRJZXREYAXTGV-UHFFFAOYSA-N
- CAS Registry Number: 1079-66-9
- Chemical structure:
View 3d structure (requires JavaScript / HTML 5) - Other names: Chlorodiphenylphosphine; Diphenylchlorophosphine; Diphenylphosphine chloride; Diphenylphosphinous chloride; Phosphine, chlorodiphenyl-; P-Chlorodiphenylphosphine

Gas phase ion energetics data

Data compiled by: Henry M. Rosenstock, Keith Draxl, Bruce W. Steiner, and John T. Herron
Ionization energy determinations
IE (eV) | Method | Reference |
---|---|---|
8.75 ± 0.05 | EI | Distefano, Innorta, et al., 1968 |

References

Distefano, Innorta, et al., 1968
Distefano, G.; Innorta, G.; Pignataro, S.; Foffani, A.,
Correlation between the ionization potentials of transition metal complexes and of the corresponding ligands,
J. Organometal. Chem., 1968, 14, 165. [all data]
Shagidullin and Chernova, 1971
Shagidullin, R.R.; Chernova, A.V.,
Izvest. Akad. Nauk S.S.S.R. (English translation), 1971, 20, 165. [all data]