Butanoic acid
- Formula: C4H8O2
- Molecular weight: 88.1051
- IUPAC Standard InChIKey: FERIUCNNQQJTOY-UHFFFAOYSA-N
- CAS Registry Number: 107-92-6
- Chemical structure:
View 3d structure (requires JavaScript / HTML 5) - Other names: Butyric acid; n-Butanoic acid; n-Butyric acid; Ethylacetic acid; Propylformic acid; 1-Butyric acid; 1-Propanecarboxylic acid; n-C3H7COOH; Propanecarboxylic acid; Butanic acid; Buttersaeure; Kyselina maselna; UN 2820; 1-Butanoic acid; NSC 8415

Gas phase thermochemistry data

Data compiled as indicated in comments:
DRB - Donald R. Burgess, Jr.
GT - Glushko Thermocenter, Russian Academy of Sciences, Moscow
Quantity | Value | Units | Method | Reference | Comment |
---|---|---|---|---|---|
ΔfH°gas | -113.7 ± 0.96 | kcal/mol | N/A | Lebedeva, 1964 | Value computed using ΔfHliquid° value of -533.92±0.59 kj/mol from Lebedeva, 1964 and ΔvapH° value of 58±4 kj/mol from missing citation.; DRB |
ΔfH°gas | -113.7 ± 0.96 | kcal/mol | Ccb | Lebedeva, 1964 | Value computed using ΔfHliquid° from Lebedeva, 1964 and ΔvapH° value of 14. kcal/mol from Konicek and Wadso, 1970.; DRB |
Quantity | Value | Units | Method | Reference | Comment |
S°gas | 84.431 | cal/mol*K | N/A | Stull D.R., 1969 | See [ Stull D.R., 1969], acrylic acid, C3H4O2.; GT |

Condensed phase thermochemistry data

Data compiled as indicated in comments:
ALS - Hussein Y. Afeefy, Joel F. Liebman, and Stephen E. Stein
DH - Eugene S. Domalski and Elizabeth D. Hearing
Quantity | Value | Units | Method | Reference | Comment |
---|---|---|---|---|---|
ΔfH°liquid | -127.61 ± 0.14 | kcal/mol | Ccb | Lebedeva, 1964 | ALS |
Quantity | Value | Units | Method | Reference | Comment |
ΔcH°liquid | -521.87 ± 0.14 | kcal/mol | Ccb | Lebedeva, 1964 | Corresponding ΔfHºliquid = -127.59 kcal/mol (simple calculation by NIST; no Washburn corrections); ALS |
Quantity | Value | Units | Method | Reference | Comment |
S°liquid | 53.85 | cal/mol*K | N/A | Martin and Andon, 1982 | DH |
S°liquid | 54.11 | cal/mol*K | N/A | Parks, Kelley, et al., 1929 | Extrapolation below 90 K, 53.6 J/mol*K. Revision of previous data.; DH |
S°liquid | 60.99 | cal/mol*K | N/A | Parks and Anderson, 1926 | Extrapolation below 90 K, 82.42 J/mol*K.; DH |
Constant pressure heat capacity of liquid
Cp,liquid (cal/mol*K) | Temperature (K) | Reference | Comment |
---|---|---|---|
42.47 | 298.15 | Martin and Andon, 1982 | T = 13 to 450 K. Data also given by equation.; DH |
42.5 | 298.15 | Konicek and Wadso, 1971 | DH |
42.09 | 290.7 | Parks and Anderson, 1926 | T = 89 to 291292 to 448 K. Value is unsmoothed experimental datum.; DH |
42.09 | 298. | von Reis, 1881 | T = 292 to 448 K.; DH |

Phase change data

Data compiled as indicated in comments:
BS - Robert L. Brown and Stephen E. Stein
TRC - Thermodynamics Research Center, NIST Boulder Laboratories, Chris Muzny director
AC - William E. Acree, Jr., James S. Chickos
ALS - Hussein Y. Afeefy, Joel F. Liebman, and Stephen E. Stein
DH - Eugene S. Domalski and Elizabeth D. Hearing
Quantity | Value | Units | Method | Reference | Comment |
---|---|---|---|---|---|
Tboil | 436. ± 2. | K | AVG | N/A | Average of 53 out of 57 values; Individual data points |
Quantity | Value | Units | Method | Reference | Comment |
Tfus | 267.6 | K | N/A | Radwan and Hanna, 1976 | Uncertainty assigned by TRC = 0.2 K; TRC |
Tfus | 267.8 | K | N/A | Costello and Bowden, 1958 | Uncertainty assigned by TRC = 0.5 K; TRC |
Tfus | 267.89 | K | N/A | Dreisbach and Martin, 1949 | Uncertainty assigned by TRC = 0.05 K; TRC |
Tfus | 267. | K | N/A | Timmermans, 1935 | Uncertainty assigned by TRC = 1.5 K; TRC |
Quantity | Value | Units | Method | Reference | Comment |
Ttriple | 267.97 | K | N/A | Wilhoit, Chao, et al., 1985 | Uncertainty assigned by TRC = 0.05 K; TRC |
Ttriple | 268.03 | K | N/A | Martin and Andon, 1982, 2 | Crystal phase 1 phase; Uncertainty assigned by TRC = 0.05 K; type of transition uncertain; TRC |
Ttriple | 267.4 | K | N/A | Parks and Anderson, 1926, 2 | Uncertainty assigned by TRC = 0.2 K; TRC |
Quantity | Value | Units | Method | Reference | Comment |
Tc | 615.2 | K | N/A | Andereya and Chase, 1990 | Uncertainty assigned by TRC = 2. K; TRC |
Tc | 624. | K | N/A | Ambrose and Ghiassee, 1987 | Uncertainty assigned by TRC = 1. K; TRC |
Tc | 631.77 | K | N/A | D'Souza and Teja, 1987 | Uncertainty assigned by TRC = 2.5 K; Ambrose's procedure; TRC |
Tc | 627.90 | K | N/A | Brown, 1906 | Uncertainty assigned by TRC = 6. K; TRC |
Quantity | Value | Units | Method | Reference | Comment |
Pc | 40.11 | atm | N/A | Andereya and Chase, 1990 | Uncertainty assigned by TRC = 0.59 atm; TRC |
Pc | 38.98 | atm | N/A | Ambrose and Ghiassee, 1987 | Uncertainty assigned by TRC = 0.49 atm; TRC |
Pc | 40.4053 | atm | N/A | D'Souza and Teja, 1987 | Uncertainty assigned by TRC = 0.89 atm; Ambrose's procedure; TRC |
Quantity | Value | Units | Method | Reference | Comment |
ΔvapH° | 14.0 ± 0.5 | kcal/mol | AVG | N/A | Average of 6 values; Individual data points |
Enthalpy of vaporization
ΔvapH (kcal/mol) | Temperature (K) | Method | Reference | Comment |
---|---|---|---|---|
12.5 | 399. | N/A | Clifford, Ramjugernath, et al., 2004 | Based on data from 384. to 435. K.; AC |
12.0 | 406. | EB | Muñoz and Krähenbühl, 2001 | Based on data from 391. to 429. K.; AC |
14.0 ± 0.07 | 293. | GS | Verevkin, 2000 | Based on data from 278. to 308. K.; AC |
11.4 | 452. | A | Stephenson and Malanowski, 1987 | Based on data from 437. to 592. K.; AC |
12.2 | 316. | A | Stephenson and Malanowski, 1987 | Based on data from 301. to 358. K.; AC |
12.7 | 370. | A | Stephenson and Malanowski, 1987 | Based on data from 355. to 453. K. See also Dykyj, 1971.; AC |
12. | 378. | N/A | Dreisbach and Shrader, 1949 | Based on data from 363. to 436. K. See also Dreisbach and Martin, 1949, 2 and Boublik, Fried, et al., 1984.; AC |
Antoine Equation Parameters
log10(P) = A − (B / (T + C))
P = vapor pressure (atm)
T = temperature (K)
View plot Requires a JavaScript / HTML 5 canvas capable browser.
Temperature (K) | A | B | C | Reference | Comment |
---|---|---|---|---|---|
293. to 423. | 6.10383 | 2634.471 | -3.471 | Jasper and Miller, 1955 | Coefficents calculated by NIST from author's data. |
364.07 to 436.40 | 4.90333 | 1793.898 | -70.564 | Dreisbach and Shrader, 1949 | Coefficents calculated by NIST from author's data. |
Enthalpy of sublimation
ΔsubH (kcal/mol) | Temperature (K) | Method | Reference | Comment |
---|---|---|---|---|
18.2 ± 0.36 | 248. | TE,ME | Calis-Van Ginkel, Calis, et al., 1978 | Based on data from 238. to 255. K.; AC |
Enthalpy of fusion
ΔfusH (kcal/mol) | Temperature (K) | Reference | Comment |
---|---|---|---|
2.646 | 264.7 | Acree, 1991 | AC |
2.770 | 268. | Martin and Andon, 1982 | AC |
2.6460 | 267.4 | Parks and Anderson, 1926 | DH |
Entropy of fusion
ΔfusS (cal/mol*K) | Temperature (K) | Reference | Comment |
---|---|---|---|
9.895 | 267.4 | Parks and Anderson, 1926 | DH |
Enthalpy of phase transition
ΔHtrs (kcal/mol) | Temperature (K) | Initial Phase | Final Phase | Reference | Comment |
---|---|---|---|---|---|
0.2486 | 155. to 230. | crystaline, II | crystaline, I | Martin and Andon, 1982 | DH |
2.7701 | 268.03 | crystaline, I | liquid | Martin and Andon, 1982 | DH |
Entropy of phase transition
ΔStrs (cal/mol*K) | Temperature (K) | Initial Phase | Final Phase | Reference | Comment |
---|---|---|---|---|---|
1.21 | 155. to 230. | crystaline, II | crystaline, I | Martin and Andon, 1982 | DH |
10.33 | 268.03 | crystaline, I | liquid | Martin and Andon, 1982 | DH |

Reaction thermochemistry data

Data compiled as indicated in comments:
B - John E. Bartmess
ALS - Hussein Y. Afeefy, Joel F. Liebman, and Stephen E. Stein
Individual Reactions
C4H7O2- + =
By formula: C4H7O2- + H+ = C4H8O2
Quantity | Value | Units | Method | Reference | Comment |
---|---|---|---|---|---|
ΔrH° | 346.8 ± 2.0 | kcal/mol | TDEq | Norrman and McMahon, 1999 | gas phase; B |
ΔrH° | 346.5 ± 2.2 | kcal/mol | G+TS | Caldwell, Renneboog, et al., 1989 | gas phase; B |
ΔrH° | 346.5 ± 2.2 | kcal/mol | G+TS | Cumming and Kebarle, 1978 | gas phase; B |
Quantity | Value | Units | Method | Reference | Comment |
ΔrG° | 339.5 ± 2.0 | kcal/mol | IMRE | Caldwell, Renneboog, et al., 1989 | gas phase; B |
ΔrG° | 339.5 ± 2.0 | kcal/mol | IMRE | Cumming and Kebarle, 1978 | gas phase; B |
By formula: 2H2 + C4H4O2 = C4H8O2
Quantity | Value | Units | Method | Reference | Comment |
---|---|---|---|---|---|
ΔrH° | -69.80 ± 0.20 | kcal/mol | Chyd | Flitcroft and Skinner, 1958 | solid phase; Reanalyzed by Cox and Pilcher, 1970, Original value = -72.4 ± 1.1 kcal/mol; ALS |
+
+
= C4H10NO6-
By formula: NO3- + H2O + C4H8O2 = C4H10NO6-
Quantity | Value | Units | Method | Reference | Comment |
---|---|---|---|---|---|
ΔrG° | 3.80 ± 0.20 | kcal/mol | IMRE | Viidanoja, Reiner, et al., 2000 | gas phase; B |
By formula: CO3 + H2O + C4H8O2 = C5H10O6-
Quantity | Value | Units | Method | Reference | Comment |
---|---|---|---|---|---|
ΔrG° | 3.60 ± 0.20 | kcal/mol | IMRE | Viidanoja, Reiner, et al., 2000 | gas phase; B |
+
= C4H8NO5-
By formula: NO3- + C4H8O2 = C4H8NO5-
Quantity | Value | Units | Method | Reference | Comment |
---|---|---|---|---|---|
ΔrG° | 12.80 ± 0.20 | kcal/mol | IMRE | Viidanoja, Reiner, et al., 2000 | gas phase; B |
+
= C4H8NO4-
By formula: NO2- + C4H8O2 = C4H8NO4-
Quantity | Value | Units | Method | Reference | Comment |
---|---|---|---|---|---|
ΔrG° | 13.30 ± 0.20 | kcal/mol | IMRE | Viidanoja, Reiner, et al., 2000 | gas phase; B |

Henry's Law data

Data compiled by: Rolf Sander
Henry's Law constant (water solution)
kH(T) = k°H exp(d(ln(kH))/d(1/T) ((1/T) - 1/(298.15 K)))
k°H = Henry's law constant for solubility in water at 298.15 K (mol/(kg*bar))
d(ln(kH))/d(1/T) = Temperature dependence constant (K)
k°H (mol/(kg*bar)) | d(ln(kH))/d(1/T) (K) | Method | Reference |
---|---|---|---|
4700. | M | N/A | |
1900. | Q | N/A | |
1900. | M | N/A |

Gas phase ion energetics data

Data evaluated as indicated in comments:
L - Sharon G. Lias
Data compiled as indicated in comments:
B - John E. Bartmess
LBLHLM - Sharon G. Lias, John E. Bartmess, Joel F. Liebman, John L. Holmes, Rhoda D. Levin, and W. Gary Mallard
LLK - Sharon G. Lias, Rhoda D. Levin, and Sherif A. Kafafi
RDSH - Henry M. Rosenstock, Keith Draxl, Bruce W. Steiner, and John T. Herron
Quantity | Value | Units | Method | Reference | Comment |
---|---|---|---|---|---|
IE (evaluated) | 10.17 ± 0.05 | eV | N/A | N/A | L |
Ionization energy determinations
IE (eV) | Method | Reference | Comment |
---|---|---|---|
10.17 ± 0.05 | PIPECO | Butler, Fraser-Monteiro, et al., 1982 | LBLHLM |
10.24 | EI | Holmes, Fingas, et al., 1981 | LLK |
10.24 | EI | Holmes and Lossing, 1980 | LLK |
10.46 | PE | Watanabe, Yokoyama, et al., 1973 | LLK |
10.16 ± 0.05 | PI | Watanabe, Nakayama, et al., 1962 | RDSH |
10.38 | PE | Benoit and Harrison, 1977 | Vertical value; LLK |
10.22 | PE | Sustmann and Trill, 1972 | Vertical value; LLK |
Appearance energy determinations
Ion | AE (eV) | Other Products | Method | Reference | Comment |
---|---|---|---|---|---|
C2H4+ | 11.5 ± 0.1 | C2H4O2 | PIPECO | Butler, Fraser-Monteiro, et al., 1982 | T = 298K; LBLHLM |
C2H4O2+ | 10.42 ± 0.05 | C2H4 | PIPECO | Butler, Fraser-Monteiro, et al., 1982 | T = 298K; LBLHLM |
C2H4O2+ | 10.60 | C2H4 | EI | Holmes and Lossing, 1980 | LLK |
C2H5+ | 11.6 ± 0.1 | C2H3O2 | PIPECO | Butler, Fraser-Monteiro, et al., 1982 | T = 298K; LBLHLM |
C2H402+ | 10.60 ± 0.05 | C2H4 | EI | Holmes and Lossing, 1980, 2 | LLK |
C3H5O2+ | 10.5 ± 0.1 | CH3 | PIPECO | Butler, Fraser-Monteiro, et al., 1982 | T = 298K; LBLHLM |
C3H6+ | 11.4 ± 0.1 | CH2O2 | PIPECO | Butler, Fraser-Monteiro, et al., 1982 | T = 298K; LBLHLM |
C3H7+ | 10.96 ± 0.05 | COOH | PIPECO | Butler, Fraser-Monteiro, et al., 1982 | T = 298K; LBLHLM |
C4H7O+ | 11.8 ± 0.1 | OH | PIPECO | Butler, Fraser-Monteiro, et al., 1982 | T = 298K; LBLHLM |
De-protonation reactions
C4H7O2- + =
By formula: C4H7O2- + H+ = C4H8O2
Quantity | Value | Units | Method | Reference | Comment |
---|---|---|---|---|---|
ΔrH° | 346.8 ± 2.0 | kcal/mol | TDEq | Norrman and McMahon, 1999 | gas phase; B |
ΔrH° | 346.5 ± 2.2 | kcal/mol | G+TS | Caldwell, Renneboog, et al., 1989 | gas phase; B |
ΔrH° | 346.5 ± 2.2 | kcal/mol | G+TS | Cumming and Kebarle, 1978 | gas phase; B |
Quantity | Value | Units | Method | Reference | Comment |
ΔrG° | 339.5 ± 2.0 | kcal/mol | IMRE | Caldwell, Renneboog, et al., 1989 | gas phase; B |
ΔrG° | 339.5 ± 2.0 | kcal/mol | IMRE | Cumming and Kebarle, 1978 | gas phase; B |

Ion clustering data

Data compiled by: John E. Bartmess
Clustering reactions
+
= C4H8NO4-
By formula: NO2- + C4H8O2 = C4H8NO4-
Quantity | Value | Units | Method | Reference | Comment |
---|---|---|---|---|---|
ΔrG° | 13.30 ± 0.20 | kcal/mol | IMRE | Viidanoja, Reiner, et al., 2000 | gas phase |
+
= C4H8NO5-
By formula: NO3- + C4H8O2 = C4H8NO5-
Quantity | Value | Units | Method | Reference | Comment |
---|---|---|---|---|---|
ΔrG° | 12.80 ± 0.20 | kcal/mol | IMRE | Viidanoja, Reiner, et al., 2000 | gas phase |
+
+
= C4H10NO6-
By formula: NO3- + H2O + C4H8O2 = C4H10NO6-
Quantity | Value | Units | Method | Reference | Comment |
---|---|---|---|---|---|
ΔrG° | 3.80 ± 0.20 | kcal/mol | IMRE | Viidanoja, Reiner, et al., 2000 | gas phase |

Kovats' RI, non-polar column, temperature ramp

Data compiled by: NIST Mass Spectrometry Data Center, William E. Wallace, director

Column type CapillaryCapillary
Active phase OV-101OV-101
Column length (m) 80.80.
Carrier gas N2N2
Substrate
Column diameter (mm) 0.280.28
Phase thickness (μm)
Tstart (C) 80.80.
Tend (C) 200.200.
Heat rate (K/min) 1.1.
Initial hold (min)
Final hold (min)
I 828.834.
ReferenceShibamoto, Kamiya, et al., 1981Shibamoto, Kamiya, et al., 1981
Comment MSDC-RI MSDC-RI

Normal alkane RI, non-polar column, temperature ramp

Data compiled by: NIST Mass Spectrometry Data Center, William E. Wallace, director

Column type CapillaryCapillaryCapillaryCapillaryCapillary
Active phase DB-5VF-5 MSVF-5 MSDB-5 MSHP-5 MS
Column length (m) 25.60.60.25.30.
Carrier gas HeliumHeliumHeliumHeliumHelium
Substrate
Column diameter (mm) 0.200.320.320.200.32
Phase thickness (μm) 0.330.250.250.330.25
Tstart (C) 50.30.30.40.50.
Tend (C) 240.260.260.250.240.
Heat rate (K/min) 20.2.2.10.4.
Initial hold (min) 1.  1.2.
Final hold (min)  28.28. 10.
I 784.803.803.793.793.
ReferenceCais-Sokolinska, Majcher, et al., 2011Leffingwell and Alford, 2011Leffingwell and Alford, 2011Majcher, Lawrowski, et al., 2010Pino, Marquez, et al., 2010
Comment MSDC-RI MSDC-RI MSDC-RI MSDC-RI MSDC-RI
Column type CapillaryCapillaryCapillaryCapillaryCapillary
Active phase SE-54DB-5HP-5 MSHP-5RTX-5
Column length (m) 30.60.30.10.60.
Carrier gas  HeliumHeliumHelium
Substrate
Column diameter (mm) 0.320.320.250.100.32
Phase thickness (μm) 0.250.250.250.401.
Tstart (C) 0. 70.40.40.
Tend (C) 200.240.290.280.205.
Heat rate (K/min) 6.6.5.20.4.
Initial hold (min) 2.  1.5.
Final hold (min)  5.10.1.5.
I 821.856.763.786.791.
ReferenceLaselan, Buettner, et al., 2009Mallia, Escher, et al., 2009Radulovic, Blagojevic, et al., 2009Mildner-Szkudlarz and Jelen, 2008Berdague, Tournayre, et al., 2007
Comment MSDC-RI MSDC-RI MSDC-RI MSDC-RI MSDC-RI
Column type CapillaryCapillaryCapillaryCapillaryCapillary
Active phase 5 % Phenyl methyl siloxaneDB-5DB-5MDN-5OV-101
Column length (m) 30.30.30.60.25.
Carrier gas HeHeN2HeN2/He
Substrate
Column diameter (mm) 0.250.320.320.250.20
Phase thickness (μm) 1.0.250.250.250.10
Tstart (C) 40.40.40.40.50.
Tend (C) 250.250.250.270.250.
Heat rate (K/min) 7.4.4.4.6.
Initial hold (min) 10.2.2.4.
Final hold (min) 5.5.5.5.
I 779.804.795.805.824.
ReferenceRamirez R. and Cava R., 2007Xu, Fan, et al., 2007Fan and Qian, 2005van Loon, Linssen, et al., 2005Zenkevich, 2005
Comment MSDC-RI MSDC-RI MSDC-RI MSDC-RI MSDC-RI
Column type CapillaryCapillaryCapillaryCapillaryCapillary
Active phase SPB-5SPB-1RSL-200SPB-5AT-1
Column length (m) 60.30.30.60.
Carrier gas HeliumHeH2 He
Substrate
Column diameter (mm) 0.320.250.320.32
Phase thickness (μm) 1.00.250.251.
Tstart (C) 30.40.40.40.50.
Tend (C) 230.200.280.200.300.
Heat rate (K/min) 3.3.6.3.10.
Initial hold (min)  10.5.5.2.
Final hold (min)   5.5.
I 769.802.779.775.809.
ReferenceSebastian, Viallon-Fernandez, et al., 2003Vichi, Castellote, et al., 2003Jirovetz, Buchbauer, et al., 2002Pérès, Begnaud, et al., 2002Kelling, 2001
Comment MSDC-RI MSDC-RI MSDC-RI MSDC-RI MSDC-RI
Column type CapillaryCapillaryCapillaryCapillaryCapillary
Active phase RSL-200DB-5MSDB-5HP-5DB-5
Column length (m) 30.30.30.60.30.
Carrier gas H2HeHeHeH2
Substrate
Column diameter (mm) 0.320.320.320.320.32
Phase thickness (μm) 0.250.250.251.0.5
Tstart (C) 40.40.40.40.60.
Tend (C) 280.195.230.240.245.
Heat rate (K/min) 6.5.6.3.3.
Initial hold (min) 5.5.2. 3.
Final hold (min) 5.40.5. 20.
I 778.825.821.784.829.
ReferenceNgassoum, Jirovetz, et al., 2001Suriyaphan, Drake, et al., 2001Czerny and Grosch, 2000García, Martín, et al., 2000Kotseridis and Baumes, 2000
Comment MSDC-RI MSDC-RI MSDC-RI MSDC-RI MSDC-RI
Column type CapillaryCapillaryCapillaryCapillaryCapillary
Active phase DB-5OV-101BP-5DB-5Ultra 1
Column length (m) 30.50.50.30.50.
Carrier gas H2NitrogenHe Helium
Substrate
Column diameter (mm) 0.320.250.320.320.20
Phase thickness (μm) 0.5 1.1.0.33
Tstart (C) 60.40.40.40.30.
Tend (C) 245.200.190.200.250.
Heat rate (K/min) 3.2.2.3.1.7
Initial hold (min) 3.10.5.5.1.
Final hold (min) 20.
I 829.803.796.783.780.
ReferenceKotseridis and Baumes, 2000Tamura, Boonbumrung, et al., 2000Lopez, Ferreira, et al., 1999Meynier, Novelli, et al., 1999Farkas, Sádecká, et al., 1997
Comment MSDC-RI MSDC-RI MSDC-RI MSDC-RI MSDC-RI
Column type CapillaryCapillaryCapillaryCapillaryCapillary
Active phase DB-5DB-5Ultra-2Ultra-2DB-1
Column length (m) 60.60.50.50.50.
Carrier gas   HeHe
Substrate
Column diameter (mm) 0.320.320.320.320.32
Phase thickness (μm) 1.1.0.520.52
Tstart (C) 40.40.40.40.0.
Tend (C) 200.200.250.250.250.
Heat rate (K/min) 3.3.4.4.3.
Initial hold (min) 5.5.3.3.
Final hold (min) 2.2.30.30.
I 779.784.783.803.795.
ReferenceKondjoyan, Viallon, et al., 1997Kondjoyan, Viallon, et al., 1997King, Matthews, et al., 1995King, Hamilton, et al., 1993Habu, Flath, et al., 1985
Comment MSDC-RI MSDC-RI MSDC-RI MSDC-RI MSDC-RI

Van Den Dool and Kratz RI, non-polar column, temperature ramp

Data compiled by: NIST Mass Spectrometry Data Center, William E. Wallace, director

Column type CapillaryCapillaryCapillaryCapillaryCapillary
Active phase SPB-5HP-5SE-54DB-5MSDB-5MS
Column length (m) 60.30.50.30.30.
Carrier gas  HeHeH2He
Substrate
Column diameter (mm) 0.320.250.320.250.25
Phase thickness (μm) 1.0.25 0.250.25
Tstart (C) 40.50.40.30.40.
Tend (C) 230.250.240.250.200.
Heat rate (K/min) 3.4.8.2.5.
Initial hold (min) 2.4.2.2.5.
Final hold (min) 10.10.5.2.45.
I 789.790.823.822.850.
ReferenceEngel and Ratel, 2007Quijano, Salamanca, et al., 2007Schlutt B., Moran N., et al., 2007Schwambach and Peterson, 2006Whetstine M.E.C., Drake M.A., et al., 2006
Comment MSDC-RI MSDC-RI MSDC-RI MSDC-RI MSDC-RI
Column type CapillaryCapillaryCapillaryCapillaryCapillary
Active phase DB-5MSDB-5HP-5HP-5HP-5
Column length (m) 30.30.30.30.30.
Carrier gas  N2HeHeHe
Substrate
Column diameter (mm) 0.250.250.250.250.25
Phase thickness (μm) 0.250.250.250.250.25
Tstart (C) 40.40.50.50.50.
Tend (C) 200.230.250.250.250.
Heat rate (K/min) 10.5.4.4.4.
Initial hold (min) 3.2.5.5.5.
Final hold (min) 20.6.15.15.15.
I 840.824.831.848.841.
ReferenceCarunchia Whetstine, Croissant, et al., 2005Colahan-Sederstrom and Peterson, 2005Mahattanatawee, Goodner, et al., 2005Mahattanatawee, Goodner, et al., 2005Mahattanatawee, Goodner, et al., 2005
Comment MSDC-RI MSDC-RI MSDC-RI MSDC-RI MSDC-RI
Column type CapillaryCapillaryCapillaryCapillaryCapillary
Active phase HP-5MSDB-5ZB-5ZB-5CP-Sil 8CB-MS
Column length (m) 30.30.30.0.60.
Carrier gas He Helium
Substrate
Column diameter (mm) 0.250.250.320.320.25
Phase thickness (μm) 0.250.250.500.50.25
Tstart (C) 60.40.40.40.40.
Tend (C) 250.200.265.265.280.
Heat rate (K/min) 4.10.7.7.4.
Initial hold (min) 2.5.  2.
Final hold (min) 20.15.5.5.5.
I 790.844.820.823.818.
ReferencePino, Mesa, et al., 2005Avsar, Karagul-Yuceer, et al., 2004Bell, 2004Gocmen, Gurbuz, et al., 2004Hierro, de la Hoz, et al., 2004
Comment MSDC-RI MSDC-RI MSDC-RI MSDC-RI MSDC-RI
Column type CapillaryCapillaryCapillaryCapillaryCapillary
Active phase SPB-5DB-5MSDB-5DB-5SPB-5
Column length (m) 30.30.30.30.30.
Carrier gas HeHe  He
Substrate
Column diameter (mm) 0.250.250.250.250.25
Phase thickness (μm) 0.250.250.250.250.25
Tstart (C) 60.35.35.35.60.
Tend (C) 250.200.250.250.250.
Heat rate (K/min) 4.10.4.4.4.
Initial hold (min) 2.5.2.2.2.
Final hold (min) 20.30.4.4.20.
I 780.804.818.818.780.
ReferencePíno, Marbot, et al., 2004Karagül-Yüceer, Vlahovich, et al., 2003Peterson and Reineccius, 2003Peterson and Reineccius, 2003, 2Pino, Marbot, et al., 2003
Comment MSDC-RI MSDC-RI MSDC-RI MSDC-RI MSDC-RI
Column type CapillaryCapillaryCapillaryCapillaryCapillary
Active phase DB-5DB-5CP Sil 5 CBCP-Sil 8CB-MSDB-5
Column length (m) 60.30.30.60.30.
Carrier gas He H2
Substrate
Column diameter (mm) 0.250.320.250.250.32
Phase thickness (μm) 0.250.250.250.250.25
Tstart (C) 40.35.60.40.35.
Tend (C) 275.200.280.280.200.
Heat rate (K/min) 7.10.2.4.10.
Initial hold (min)  5.10.2.5.
Final hold (min)  30.40. 30.
I 834.826.856.820.802.
ReferenceValim, Rouseff, et al., 2003Karagül-Yüceer, Cadwallader, et al., 2002Pino, Marbot, et al., 2002Bruna, Hierro, et al., 2001Karagül-Yüceer, Drake, et al., 2001
Comment MSDC-RI MSDC-RI MSDC-RI MSDC-RI MSDC-RI
Column type CapillaryCapillary
Active phase SPB-5DB-1
Column length (m) 60.60.
Carrier gas He
Substrate
Column diameter (mm) 0.320.25
Phase thickness (μm) 1.0.25
Tstart (C) 40.35.
Tend (C) 200.280.
Heat rate (K/min) 3.2.
Initial hold (min) 5.10.
Final hold (min) 2.10.
I 795.778.
ReferenceVerdier-Metz., Coulon, et al., 1998Specht and Baltes, 1994
Comment MSDC-RI MSDC-RI

Van Den Dool and Kratz RI, non-polar column, custom temperature program

Data compiled by: NIST Mass Spectrometry Data Center, William E. Wallace, director

Column type CapillaryCapillaryCapillaryCapillaryCapillary
Active phase DB-5SE-54DB-5DB-5DB-5
Column length (m)  30.30.30.30.
Carrier gas   HeHeHe
Substrate
Column diameter (mm)  0.320.320.320.32
Phase thickness (μm)  0.251.1.1.
Program not specified40C(2min) => 6C/min => 150C => 20C/min => 230C40C(2min) => 5C/min => 100C => 4C/min => 230C (10min)40C(2min) => 5C/min => 100C => 4C/min => 230C (10min)40C (2min) => 5C/min => 100C => 4C/min => 230C (10min)
I 822.821.815.817.812.
ReferenceEscudero, Campo, et al., 2007Schuh and Schieberle, 2006Wang, Finn, et al., 2005Wang, Finn, et al., 2005Klesk, Qian, et al., 2004
Comment MSDC-RI MSDC-RI MSDC-RI MSDC-RI MSDC-RI
Column type CapillaryCapillaryCapillaryCapillaryCapillary
Active phase DB-5DB-1DB-5DB-5DB-5MS
Column length (m) 30.60.30.30.30.
Carrier gas HeHeHeHeH2
Substrate
Column diameter (mm) 0.250.320.320.250.25
Phase thickness (μm) 0.251.0.250.250.25
Program 40C(2min) => 5C/min => 100C => 4C/min => 230C(10min)35C(5min) => 10C/min => 45C (5min) => 5C/min => 250C (10min)40C(1min) => 40C/min => 50C(2min) => 6C/min => 240C35 C (2 min) 40 C/min -> 50 C (2 min) 4 C/min -> 230 C40C (5min) => 2C/min => 200C => 5C/min => 250C (15min)
I 808.780.815.821.790.
ReferenceKlesk and Qian, 2003Place, Imhof, et al., 2003Jezussek, Juliano, et al., 2002Zehentbauer and Reineccius, 2002Boulanger and Crouzet, 2001
Comment MSDC-RI MSDC-RI MSDC-RI MSDC-RI MSDC-RI
Column type CapillaryCapillaryCapillaryCapillaryCapillary
Active phase DB-1DB-1DB-5DB-1SE-54
Column length (m) 60.60.30.15.30.
Carrier gas HeHe HeHe
Substrate
Column diameter (mm) 0.250.250.320.530.32
Phase thickness (μm) 0.250.250.251.0.25
Program -20C (5min) => 10C/min => 100C => 4C/min => 200C => 10C/min => 280C-20C (5min) => 10C/min => 100C => 4C/min => 200C => 10C/min => 280C40C(2min) => 40C/min => 50C (1min) => 6C/min => 180C => 10C/min => 240C (5min)40C(3min) => 8C/min => 200(1min) => 5C/min => 300C(25min)35C (2min) => 40C/min => 60C (2min) => 6C/min => 180C (5min) => 10C/min => 230C (5min)
I 826.830.829.814.821.
ReferenceEri, Khoo, et al., 2000Eri, Khoo, et al., 2000Munk, Munch, et al., 2000Peng, 2000Tairu, Hofmann, et al., 2000
Comment MSDC-RI MSDC-RI MSDC-RI MSDC-RI MSDC-RI
Column type CapillaryCapillaryCapillaryCapillaryCapillary
Active phase SE-54SE-54SE-54RTX-5SE-54
Column length (m) 30.30.30.30.30.
Carrier gas HeHeHe He
Substrate
Column diameter (mm) 0.250.320.320.530.32
Phase thickness (μm) 0.250.250.251.0.25
Program 35C(2min) => 40C/min => 60C => 6C/min => 180C 20C/min => 240C(10min)35C (2min) => 40C/min => 50C (2min) => 6C/min => 180C => 10C/min => 230C (10min)35C (2min) => 40C/min => 50C => 4C/min => 230C (10min)not specified40C (2min) => 40C/min => 50C (2min) => 240C (10min)
I 835.821.820.785.821.
ReferenceZimmermann and Schieberle, 2000Buettner and Schieberle, 1999Derail, Hofmann, et al., 1999Heiler and Schieberle, 1997Münch, Hofmann, et al., 1997
Comment MSDC-RI MSDC-RI MSDC-RI MSDC-RI MSDC-RI
Column type CapillaryPacked
Active phase Methyl SiliconeSE-30
Column length (m)  3.05
Carrier gas
Substrate  Supelcoport; Chromosorb
Column diameter (mm)
Phase thickness (μm)
Program not specified40C(5min) => 10C/min => 200C or 250C (60min)
I 823.823.
ReferencePeng, Yang, et al., 1991Peng, Ding, et al., 1988
Comment MSDC-RI MSDC-RI

References

Lebedeva, 1964
Lebedeva, N.D.,
Heats of combustion of monocarboxylic acids,
Russ. J. Phys. Chem. (Engl. Transl.), 1964, 38, 1435-1437. [all data]
Konicek and Wadso, 1970
Konicek, J.; Wadso, I.,
Enthalpies of vaporization of organic compounds. VII. Some carboxylic acids,
Acta Chem. Scand., 1970, 24, 2612-26. [all data]
Stull D.R., 1969
Stull D.R., Jr.,
The Chemical Thermodynamics of Organic Compounds. Wiley, New York, 1969. [all data]
Martin and Andon, 1982
Martin, J.F.; Andon, R.J.L.,
Thermodynamic properties of organic oxygen compounds. Part LII. Molar heat capacity of ethanoic, propanoic, and butanoic acids,
J. Chem. Thermodynam., 1982, 14, 679-688. [all data]
Parks, Kelley, et al., 1929
Parks, G.S.; Kelley, K.K.; Huffman, H.M.,
Thermal data on organic compounds. V. A revision of the entropies and free energies of nineteen organic compounds,
J. Am. Chem. Soc., 1929, 51, 1969-1973. [all data]
Parks and Anderson, 1926
Parks, G.S.; Anderson, C.T.,
Thermal data on organic compounds. III. The heat capacities, entropies and free energies of tertiary butyl alcohol, mannitol, erythritol and normal butyric acid,
J. Am. Chem. Soc., 1926, 48, 1506-1512. [all data]
Konicek and Wadso, 1971
Konicek, J.; Wadso, I.,
Thermochemical properties of some carboxylic acids, amines and N-substituted amides in aqueous solution,
Acta Chem. Scand., 1971, 25, 1541-1551. [all data]
von Reis, 1881
von Reis, M.A.,
Die specifische Wärme flüssiger organischer Verbindungen und ihre Beziehung zu deren Moleculargewicht,
Ann. Physik [3], 1881, 13, 447-464. [all data]
Radwan and Hanna, 1976
Radwan, M.H.; Hanna, A.A.,
Binary Azeotropes Containing Butyric Acid,
J. Chem. Eng. Data, 1976, 21, 285-8. [all data]
Costello and Bowden, 1958
Costello, J.M.; Bowden, S.T.,
The temperature variation of orthobaric density difference in liquid- vapour systems: IV fatty acids,
Recl. Trav. Chim. Pays-Bas, 1958, 77, 803. [all data]
Dreisbach and Martin, 1949
Dreisbach, R.R.; Martin, R.A.,
Physical Data on Some Organic Compounds,
Ind. Eng. Chem., 1949, 41, 2875-8. [all data]
Timmermans, 1935
Timmermans, J.,
Researches in Stoichiometry. I. The Heat of Fusion of Organic Compounds.,
Bull. Soc. Chim. Belg., 1935, 44, 17-40. [all data]
Wilhoit, Chao, et al., 1985
Wilhoit, R.C.; Chao, J.; Hall, K.R.,
Thermodynamic Properties of Key Organic Compounds in the Carbon Range C1 to C4. Part 1. Properties of Condensed Phases,
J. Phys. Chem. Ref. Data, 1985, 14, 1. [all data]
Martin and Andon, 1982, 2
Martin, J.F.; Andon, R.J.L.,
Thermodynamic properties of organic oxygen compounds. Part LII. Molar heat capacity of ethanoic, propanoic, and butanoic acids.,
J. Chem. Thermodyn., 1982, 14, 679-88. [all data]
Parks and Anderson, 1926, 2
Parks, G.S.; Anderson, C.T.,
Thermal data on organic compounds. III. The heat capacities, entropies and free energies of tertiary butyl alcohol, mannitol, erythritol and normal butyric acid,
J. Am. Chem. Soc., 1926, 48, 1506-12. [all data]
Andereya and Chase, 1990
Andereya, E.; Chase, J.D.,
Chem. Eng. Technol., 1990, 13, 304-12. [all data]
Ambrose and Ghiassee, 1987
Ambrose, D.; Ghiassee, N.B.,
Vapor Pressures and Critical Temperatures and Critical Pressures of Some Alkanoic Acids: C1 to C10,
J. Chem. Thermodyn., 1987, 19, 505. [all data]
D'Souza and Teja, 1987
D'Souza, R.; Teja, A.S.,
The prediction of the vapor pressures of carboxylic acids,
Chem. Eng. Commun., 1987, 61, 13. [all data]
Brown, 1906
Brown, J.C.,
The critical temperature and value of ml/theta of some carbon compounds,
J. Chem. Soc., Trans., 1906, 89, 311. [all data]
Clifford, Ramjugernath, et al., 2004
Clifford, Scott L.; Ramjugernath, Deresh; Raal, J. David,
Subatmospheric Vapor Pressure Curves for Propionic Acid, Butyric Acid, Isobutyric Acid, Valeric Acid, Isovaleric Acid, Hexanoic Acid, and Heptanoic Acid,
J. Chem. Eng. Data, 2004, 49, 5, 1189-1192, https://doi.org/10.1021/je034180e
. [all data]
Muñoz and Krähenbühl, 2001
Muñoz, Laura A.L.; Krähenbühl, M. Alvina,
Isobaric Vapor Liquid Equilibrium (VLE) Data of the Systems n -Butanol + Butyric Acid and n -Butanol + Acetic Acid,
J. Chem. Eng. Data, 2001, 46, 1, 120-124, https://doi.org/10.1021/je000033u
. [all data]
Verevkin, 2000
Verevkin, S.P.,
Measurement and Prediction of the Monocarboxylic Acids Thermochemical Properties,
J. Chem. Eng. Data, 2000, 45, 5, 953-960, https://doi.org/10.1021/je990282m
. [all data]
Stephenson and Malanowski, 1987
Stephenson, Richard M.; Malanowski, Stanislaw,
Handbook of the Thermodynamics of Organic Compounds, 1987, https://doi.org/10.1007/978-94-009-3173-2
. [all data]
Dykyj, 1971
Dykyj, J.,
Petrochemia, 1971, 11, 2, 27. [all data]
Dreisbach and Shrader, 1949
Dreisbach, R.R.; Shrader, S.A.,
Vapor Pressure--Temperature Data on Some Organic Compounds,
Ind. Eng. Chem., 1949, 41, 12, 2879-2880, https://doi.org/10.1021/ie50480a054
. [all data]
Dreisbach and Martin, 1949, 2
Dreisbach, R.R.; Martin, R.A.,
Physical Data on Some Organic Compounds,
Ind. Eng. Chem., 1949, 41, 12, 2875-2878, https://doi.org/10.1021/ie50480a053
. [all data]
Boublik, Fried, et al., 1984
Boublik, T.; Fried, V.; Hala, E.,
The Vapour Pressures of Pure Substances: Selected Values of the Temperature Dependence of the Vapour Pressures of Some Pure Substances in the Normal and Low Pressure Region, 2nd ed., Elsevier, New York, 1984, 972. [all data]
Jasper and Miller, 1955
Jasper, Joseph J.; Miller, George B.,
The Vapor Pressure of Monofluoroacetic Acid,
J. Phys. Chem., 1955, 59, 5, 441-442, https://doi.org/10.1021/j150527a015
. [all data]
Calis-Van Ginkel, Calis, et al., 1978
Calis-Van Ginkel, C.H.D.; Calis, G.H.M.; Timmermans, C.W.M.; de Kruif, C.G.; Oonk, H.A.J.,
Enthalpies of sublimation and dimerization in the vapour phase of formic, acetic, propanoic, and butanoic acids,
The Journal of Chemical Thermodynamics, 1978, 10, 11, 1083-1088, https://doi.org/10.1016/0021-9614(78)90082-4
. [all data]
Acree, 1991
Acree, William E.,
Thermodynamic properties of organic compounds: enthalpy of fusion and melting point temperature compilation,
Thermochimica Acta, 1991, 189, 1, 37-56, https://doi.org/10.1016/0040-6031(91)87098-H
. [all data]
Norrman and McMahon, 1999
Norrman, K.; McMahon, T.B.,
Intramolecular solvation of carboxylate anions in the gas phase,
J. Phys. Chem. A, 1999, 103, 35, 7008-7016, https://doi.org/10.1021/jp9908202
. [all data]
Caldwell, Renneboog, et al., 1989
Caldwell, G.; Renneboog, R.; Kebarle, P.,
Gas Phase Acidities of Aliphatic Carboxylic Acids, Based on Measurements of Proton Transfer Equilibria,
Can. J. Chem., 1989, 67, 4, 661, https://doi.org/10.1139/v89-092
. [all data]
Cumming and Kebarle, 1978
Cumming, J.B.; Kebarle, P.,
Summary of gas phase measurements involving acids AH. Entropy changes in proton transfer reactions involving negative ions. Bond dissociation energies D(A-H) and electron affinities EA(A),
Can. J. Chem., 1978, 56, 1. [all data]
Flitcroft and Skinner, 1958
Flitcroft, T.L.; Skinner, H.A.,
Heats of hydrogenation Part 2.-Acetylene derivatives,
Trans. Faraday Soc., 1958, 54, 47-53. [all data]
Cox and Pilcher, 1970
Cox, J.D.; Pilcher, G.,
Thermochemistry of Organic and Organometallic Compounds, Academic Press, New York, 1970, 1-636. [all data]
Viidanoja, Reiner, et al., 2000
Viidanoja, J.; Reiner, T.; Kiendler, A.; Grimm, F.; Arnold, F.,
Laboratory investigations of negative ion molecule reactions of propionic, butyric, glyoxylic, pyruvic, and pinonic acids,
Int. J. Mass Spectrom., 2000, 194, 1, 53-68, https://doi.org/10.1016/S1387-3806(99)00172-4
. [all data]
Butler, Fraser-Monteiro, et al., 1982
Butler, J.J.; Fraser-Monteiro, M.L.; Fraser-Monteiro, L.; Baer, T.; Hass, J.R.,
Thermochemistry and dissociation dynamics of state-selected C4H8O2+ Ions. 2. Butanoic acid,
J. Phys. Chem., 1982, 86, 747. [all data]
Holmes, Fingas, et al., 1981
Holmes, J.L.; Fingas, M.; Lossing, F.P.,
Towards a general scheme for estimating the heats of formation of organic ions in the gas phase. Part I. Odd-electron cations,
Can. J. Chem., 1981, 59, 80. [all data]
Holmes and Lossing, 1980
Holmes, J.L.; Lossing, F.P.,
Gas-phase heats of formation of keto and enol ions of carbonyl compounds.,
J. Am. Chem. Soc., 1980, 102, 1591. [all data]
Watanabe, Yokoyama, et al., 1973
Watanabe, I.; Yokoyama, Y.; Ikeda, S.,
Lone pair ionization potentials of carboxylic acids determined by He(I) photoelectron spectroscopy,
Bull. Chem. Soc. Jpn., 1973, 46, 1959. [all data]
Watanabe, Nakayama, et al., 1962
Watanabe, K.; Nakayama, T.; Mottl, J.,
Ionization potentials of some molecules,
J. Quant. Spectry. Radiative Transfer, 1962, 2, 369. [all data]
Benoit and Harrison, 1977
Benoit, F.M.; Harrison, A.G.,
Predictive value of proton affinity. Ionization energy correlations involving oxygenated molecules,
J. Am. Chem. Soc., 1977, 99, 3980. [all data]
Sustmann and Trill, 1972
Sustmann, R.; Trill, H.,
Photoelektronenspektroskopische Bestimmung von Substituenten-Effekten. II. α,β-ungesattigte Carbonester,
Tetrahedron Lett., 1972, 42, 4271. [all data]
Holmes and Lossing, 1980, 2
Holmes, J.L.; Lossing, F.P.,
Thermochemistry and unimolecular reactions of ionized acetic acid and its enol in the gas phase.,
J. Am. Chem. Soc., 1980, 102, 3732. [all data]