2-Pentanone
- Formula: C5H10O
- Molecular weight: 86.1323
- IUPAC Standard InChIKey: XNLICIUVMPYHGG-UHFFFAOYSA-N
- CAS Registry Number: 107-87-9
- Chemical structure:
View 3d structure (requires JavaScript / HTML 5) - Other names: Ethyl acetone; Methyl n-propyl ketone; Methyl propyl ketone; Propyl methyl ketone; n-C3H7COCH3; Pentan-2-one; Metylopropyloketon; UN 1249; n-Propyl methyl ketone; Pentanone-2; NSC 5350

Gas phase thermochemistry data

Data compiled as indicated in comments:
ALS - Hussein Y. Afeefy, Joel F. Liebman, and Stephen E. Stein
GT - Glushko Thermocenter, Russian Academy of Sciences, Moscow
Quantity | Value | Units | Method | Reference | Comment |
---|---|---|---|---|---|
ΔfH°gas | -259.1 ± 1.1 | kJ/mol | Ccb | Harrop, Head, et al., 1970 | ALS |
Quantity | Value | Units | Method | Reference | Comment |
ΔcH°gas | -3156. | kJ/mol | Ccb | Guinchant, 1918 | Corresponding ΔfHºgas = -241. kJ/mol (simple calculation by NIST; no Washburn corrections); ALS |
Constant pressure heat capacity of gas
Cp,gas (J/mol*K) | Temperature (K) | Reference | Comment |
---|---|---|---|
142.97 ± 0.43 | 369.0 | Nickerson J.K., 1961 | GT |
150.62 ± 0.45 | 394.0 | ||
156.40 ± 0.47 | 414.0 | ||
162.00 ± 0.49 | 434.0 | ||
167.15 ± 0.50 | 454.0 |

Condensed phase thermochemistry data

Data compiled as indicated in comments:
ALS - Hussein Y. Afeefy, Joel F. Liebman, and Stephen E. Stein
DH - Eugene S. Domalski and Elizabeth D. Hearing
Quantity | Value | Units | Method | Reference | Comment |
---|---|---|---|---|---|
ΔfH°liquid | -297.3 ± 1.1 | kJ/mol | Ccb | Harrop, Head, et al., 1970 | ALS |
Quantity | Value | Units | Method | Reference | Comment |
ΔcH°liquid | -3099.4 ± 0.8 | kJ/mol | Ccb | Harrop, Head, et al., 1970 | Corresponding ΔfHºliquid = -297.29 kJ/mol (simple calculation by NIST; no Washburn corrections); ALS |
Quantity | Value | Units | Method | Reference | Comment |
S°liquid | 274.1 | J/mol*K | N/A | Andon, Counsell, et al., 1968 | DH |
S°liquid | 272.42 | J/mol*K | N/A | Oetting, 1965 | DH |
Constant pressure heat capacity of liquid
Cp,liquid (J/mol*K) | Temperature (K) | Reference | Comment |
---|---|---|---|
185.4 | 298.15 | Saluja, Peacock, et al., 1979 | DH |
185.1 | 298.15 | Grolier, Benson, et al., 1975 | DH |
184.3 | 298.15 | Harrop, Head, et al., 1970 | DH |
184.2 | 298.15 | Andon, Counsell, et al., 1968 | T = 10 to 360 K.; DH |
184.35 | 298.15 | Oetting, 1965 | T = 12 to 330 K.; DH |

Phase change data

Data compiled as indicated in comments:
BS - Robert L. Brown and Stephen E. Stein
TRC - Thermodynamics Research Center, NIST Boulder Laboratories, Chris Muzny director
ALS - Hussein Y. Afeefy, Joel F. Liebman, and Stephen E. Stein
AC - William E. Acree, Jr., James S. Chickos
DH - Eugene S. Domalski and Elizabeth D. Hearing
Quantity | Value | Units | Method | Reference | Comment |
---|---|---|---|---|---|
Tboil | 375. ± 1. | K | AVG | N/A | Average of 55 out of 57 values; Individual data points |
Quantity | Value | Units | Method | Reference | Comment |
Tfus | 196.27 | K | N/A | Collerson, Counsell, et al., 1965 | Uncertainty assigned by TRC = 0.02 K; TRC |
Tfus | 196.29 | K | N/A | Collerson, Counsell, et al., 1965 | Uncertainty assigned by TRC = 0.01 K; TRC |
Tfus | 195.4 | K | N/A | Timmermans, 1952 | Uncertainty assigned by TRC = 0.25 K; TRC |
Tfus | 194.0 | K | N/A | Van de Vloed, 1939 | Uncertainty assigned by TRC = 0.7 K; TRC |
Tfus | 195.4 | K | N/A | Timmermans, 1921 | Uncertainty assigned by TRC = 0.2 K; TRC |
Quantity | Value | Units | Method | Reference | Comment |
Ttriple | 196.31 | K | N/A | Andon, Counsell, et al., 1968, 2 | Crystal phase 1 phase; Uncertainty assigned by TRC = 0.04 K; TRC |
Ttriple | 196.29 | K | N/A | Oetting, 1965, 2 | Uncertainty assigned by TRC = 0.07 K; TRC |
Ttriple | 196.35 | K | N/A | Oetting, 1965, 2 | Uncertainty assigned by TRC = 0.06 K; TRC |
Quantity | Value | Units | Method | Reference | Comment |
Tc | 561.1 | K | N/A | Majer and Svoboda, 1985 | |
Tc | 561.08 | K | N/A | Ambrose, Broderick, et al., 1974 | Uncertainty assigned by TRC = 0.2 K; TRC |
Tc | 564.0 | K | N/A | Kobe, Crawford, et al., 1955 | Uncertainty assigned by TRC = 0.56 K; TRC |
Quantity | Value | Units | Method | Reference | Comment |
Pc | 36.94 | bar | N/A | Ambrose, Broderick, et al., 1974 | Uncertainty assigned by TRC = 0.20 bar; TRC |
Pc | 38.90 | bar | N/A | Kobe, Crawford, et al., 1955 | Uncertainty assigned by TRC = 0.483 bar; TRC |
Quantity | Value | Units | Method | Reference | Comment |
ρc | 3.32 | mol/l | N/A | Kobe, Crawford, et al., 1955 | Uncertainty assigned by TRC = 0.09 mol/l; TRC |
Quantity | Value | Units | Method | Reference | Comment |
ΔvapH° | 38.46 | kJ/mol | N/A | Majer and Svoboda, 1985 | |
ΔvapH° | 38.43 | kJ/mol | V | Uchytilova, Majer, et al., 1983 | ALS |
ΔvapH° | 38.4 | kJ/mol | C | Uchytilova, Majer, et al., 1983 | AC |
ΔvapH° | 38.3 ± 0.3 | kJ/mol | GCC | Saluja, Peacock, et al., 1979 | AC |
ΔvapH° | 38.4 | kJ/mol | N/A | Ambrose, Ellender, et al., 1975 | AC |
Enthalpy of vaporization
ΔvapH (kJ/mol) | Temperature (K) | Method | Reference | Comment |
---|---|---|---|---|
33.44 | 375.4 | N/A | Majer and Svoboda, 1985 | |
36.1 | 351. | A | Stephenson and Malanowski, 1987 | Based on data from 336. to 422. K.; AC |
33.7 | 431. | A | Stephenson and Malanowski, 1987 | Based on data from 416. to 501. K.; AC |
33.3 | 502. | A | Stephenson and Malanowski, 1987 | Based on data from 487. to 561. K.; AC |
36.5 | 344. | A,GS,EB | Stephenson and Malanowski, 1987 | Based on data from 329. to 385. K. See also Ambrose, Ellender, et al., 1975, Collerson, Counsell, et al., 1965, and Dykyj, 1972.; AC |
39.5 | 283. | EB | Meyer and Wagner, 1966 | Based on data from 268. to 373. K.; AC |
36.1 ± 0.1 | 335. | C | Nickerson, Kobe, et al., 1961 | AC |
34.4 ± 0.1 | 360. | C | Nickerson, Kobe, et al., 1961 | AC |
33.4 ± 0.1 | 375. | C | Nickerson, Kobe, et al., 1961 | AC |
32.8 ± 0.1 | 386. | C | Nickerson, Kobe, et al., 1961 | AC |
32.2 ± 0.1 | 394. | C | Nickerson, Kobe, et al., 1961 | AC |
Enthalpy of vaporization
ΔvapH =
A exp(-βTr) (1 − Tr)β
ΔvapH =
Enthalpy of vaporization (at saturation pressure)
(kJ/mol)
Tr = reduced temperature (T / Tc)
View plot Requires a JavaScript / HTML 5 canvas capable browser.
Temperature (K) | A (kJ/mol) | β | Tc (K) | Reference | Comment |
---|---|---|---|---|---|
298. to 395. | 55.41 | 0.2844 | 561.1 | Majer and Svoboda, 1985 |
Antoine Equation Parameters
log10(P) = A − (B / (T + C))
P = vapor pressure (bar)
T = temperature (K)
View plot Requires a JavaScript / HTML 5 canvas capable browser.
Temperature (K) | A | B | C | Reference | Comment |
---|---|---|---|---|---|
329.80 to 384.80 | 4.14243 | 1311.145 | -58.457 | Collerson, Counsell, et al., 1965, 2 | |
334.87 to 394.57 | 4.14899 | 1311.315 | -58.934 | Nickerson, Kobe, et al., 1961 | Coefficents calculated by NIST from author's data. |
Enthalpy of fusion
ΔfusH (kJ/mol) | Temperature (K) | Reference | Comment |
---|---|---|---|
10.623 | 196.35 | Oetting, 1965 | DH |
Entropy of fusion
ΔfusS (J/mol*K) | Temperature (K) | Reference | Comment |
---|---|---|---|
54.10 | 196.35 | Oetting, 1965 | DH |
Enthalpy of phase transition
ΔHtrs (kJ/mol) | Temperature (K) | Initial Phase | Final Phase | Reference | Comment |
---|---|---|---|---|---|
0.2377 | 110. | crystaline, II | crystaline, I | Andon, Counsell, et al., 1968 | Apparently a typographic error in H in paper; given as 137.7 J/mol.; DH |
10.632 | 196.31 | crystaline, I | liquid | Andon, Counsell, et al., 1968 | DH |
Entropy of phase transition
ΔStrs (J/mol*K) | Temperature (K) | Initial Phase | Final Phase | Reference | Comment |
---|---|---|---|---|---|
2.18 | 110. | crystaline, II | crystaline, I | Andon, Counsell, et al., 1968 | Apparently; DH |
54.16 | 196.31 | crystaline, I | liquid | Andon, Counsell, et al., 1968 | DH |

Reaction thermochemistry data

Data compiled as indicated in comments:
B - John E. Bartmess
ALS - Hussein Y. Afeefy, Joel F. Liebman, and Stephen E. Stein
RCD - Robert C. Dunbar
Individual Reactions
C5H9O- + =
By formula: C5H9O- + H+ = C5H10O
Quantity | Value | Units | Method | Reference | Comment |
---|---|---|---|---|---|
ΔrH° | 1536. ± 8.8 | kJ/mol | TDEq | Burkell, Fridgen, et al., 2003 | gas phase; B |
Quantity | Value | Units | Method | Reference | Comment |
ΔrG° | 1505. ± 8.4 | kJ/mol | TDEq | Burkell, Fridgen, et al., 2003 | gas phase; B |
(CAS Reg. No. 117951-43-6 • 4294967295) +
= CAS Reg. No. 117951-43-6
By formula: (CAS Reg. No. 117951-43-6 • 4294967295C5H10O) + C5H10O = CAS Reg. No. 117951-43-6
Quantity | Value | Units | Method | Reference | Comment |
---|---|---|---|---|---|
ΔrH° | 167. ± 8.8 | kJ/mol | N/A | Haas and Harrison, 1993 | gas phase; Both metastable and 50 eV collision energy.; B |
By formula: C7H16O2 + H2O = C5H10O + 2CH4O
Quantity | Value | Units | Method | Reference | Comment |
---|---|---|---|---|---|
ΔrH° | 19.52 ± 0.059 | kJ/mol | Cm | Wiberg and Squires, 1979 | liquid phase; Heat of hydrolysis; ALS |
By formula: Na+ + C5H10O = (Na+ • C5H10O)
Free energy of reaction
ΔrG° (kJ/mol) | T (K) | Method | Reference | Comment |
---|---|---|---|---|
104. | 298. | IMRE | McMahon and Ohanessian, 2000 | Anchor alanine=39.89; RCD |
By formula: C5H12O = C5H10O + H2
Quantity | Value | Units | Method | Reference | Comment |
---|---|---|---|---|---|
ΔrH° | 54.7 ± 0.3 | kJ/mol | Eqk | Connett, 1970 | liquid phase; ALS |

Henry's Law data

Data compiled by: Rolf Sander
Henry's Law constant (water solution)
kH(T) = k°H exp(d(ln(kH))/d(1/T) ((1/T) - 1/(298.15 K)))
k°H = Henry's law constant for solubility in water at 298.15 K (mol/(kg*bar))
d(ln(kH))/d(1/T) = Temperature dependence constant (K)
k°H (mol/(kg*bar)) | d(ln(kH))/d(1/T) (K) | Method | Reference |
---|---|---|---|
12. | X | N/A | |
9.1 | 4600. | X | N/A |
16. | M | Buttery, Ling, et al., 1969 |

Gas phase ion energetics data

Data evaluated as indicated in comments:
HL - Edward P. Hunter and Sharon G. Lias
L - Sharon G. Lias
Data compiled as indicated in comments:
B - John E. Bartmess
LBLHLM - Sharon G. Lias, John E. Bartmess, Joel F. Liebman, John L. Holmes, Rhoda D. Levin, and W. Gary Mallard
LLK - Sharon G. Lias, Rhoda D. Levin, and Sherif A. Kafafi
RDSH - Henry M. Rosenstock, Keith Draxl, Bruce W. Steiner, and John T. Herron
Quantity | Value | Units | Method | Reference | Comment |
---|---|---|---|---|---|
IE (evaluated) | 9.38 ± 0.06 | eV | N/A | N/A | L |
Quantity | Value | Units | Method | Reference | Comment |
Proton affinity (review) | 832.7 | kJ/mol | N/A | Hunter and Lias, 1998 | HL |
Quantity | Value | Units | Method | Reference | Comment |
Gas basicity | 800.9 | kJ/mol | N/A | Hunter and Lias, 1998 | HL |
Ionization energy determinations
IE (eV) | Method | Reference | Comment |
---|---|---|---|
9.28 ± 0.02 | PE | Ashmore and Burgess, 1978 | LLK |
9.383 ± 0.005 | PE | Hernandez, Masclet, et al., 1977 | LLK |
9.40 ± 0.01 | PE | Cocksey, Eland, et al., 1971 | LLK |
9.37 ± 0.02 | PI | Murad and Inghram, 1964 | RDSH |
9.39 ± 0.02 | PI | Watanabe, Nakayama, et al., 1962 | RDSH |
9.47 ± 0.03 | PI | Vilesov, 1960 | RDSH |
9.46 | PE | Olivato, Guerrero, et al., 1984 | Vertical value; LBLHLM |
9.44 | PE | Benoit and Harrison, 1977 | Vertical value; LLK |
Appearance energy determinations
Ion | AE (eV) | Other Products | Method | Reference | Comment |
---|---|---|---|---|---|
CH3+ | 15.13 | ? | EI | Potzinger and Bunau, 1969 | RDSH |
C2H3O+ | 11.54 | C3H7 | EI | Potzinger and Bunau, 1969 | RDSH |
C3H5O+ | 10.58 | C2H5 | EI | Potzinger and Bunau, 1969 | RDSH |
C3H6O+ | 10.08 | C2H4 | EI | Holmes and Lossing, 1980 | LLK |
C3H6O+ | 10.07 | C2H4 | PI | Murad and Inghram, 1964 | RDSH |
C4H7O+ | 10.03 | CH3 | PI | Murad and Inghram, 1964 | RDSH |
De-protonation reactions
C5H9O- + =
By formula: C5H9O- + H+ = C5H10O
Quantity | Value | Units | Method | Reference | Comment |
---|---|---|---|---|---|
ΔrH° | 1536. ± 8.8 | kJ/mol | TDEq | Burkell, Fridgen, et al., 2003 | gas phase; B |
Quantity | Value | Units | Method | Reference | Comment |
ΔrG° | 1505. ± 8.4 | kJ/mol | TDEq | Burkell, Fridgen, et al., 2003 | gas phase; B |

Ion clustering data

Data compiled by: Robert C. Dunbar
Clustering reactions
By formula: Na+ + C5H10O = (Na+ • C5H10O)
Free energy of reaction
ΔrG° (kJ/mol) | T (K) | Method | Reference | Comment |
---|---|---|---|---|
104. | 298. | IMRE | McMahon and Ohanessian, 2000 | Anchor alanine=39.89 |

Kovats' RI, non-polar column, isothermal

Column type | Active phase | Temperature (C) | I | Reference | Comment |
---|---|---|---|---|---|
Capillary | OV-1 | 333. | 663.3 | Hu, Lu, et al., 2006 | |
Capillary | DB-1 | 313. | 667.09 | Ciaznska-Halarewicz and Kowalska, 2003 | 30. m/0.32 mm/1. μm |
Capillary | DB-1 | 323. | 666.82 | Ciaznska-Halarewicz and Kowalska, 2003 | 30. m/0.32 mm/1. μm |
Capillary | DB-1 | 333. | 666.11 | Ciaznska-Halarewicz and Kowalska, 2003 | 30. m/0.32 mm/1. μm |
Capillary | DB-1 | 343. | 665.42 | Ciaznska-Halarewicz and Kowalska, 2003 | 30. m/0.32 mm/1. μm |
Capillary | DB-1 | 353. | 666.63 | Ciaznska-Halarewicz and Kowalska, 2003 | 30. m/0.32 mm/1. μm |
Capillary | DB-1 | 363. | 667.23 | Ciaznska-Halarewicz and Kowalska, 2003 | 30. m/0.32 mm/1. μm |
Capillary | DB-1 | 373. | 668.17 | Ciaznska-Halarewicz and Kowalska, 2003 | 30. m/0.32 mm/1. μm |
Capillary | DB-1 | 383. | 668.33 | Ciaznska-Halarewicz and Kowalska, 2003 | 30. m/0.32 mm/1. μm |
Capillary | DB-1 | 393. | 669.68 | Ciaznska-Halarewicz and Kowalska, 2003 | 30. m/0.32 mm/1. μm |
Capillary | DB-1 | 403. | 670.44 | Ciaznska-Halarewicz and Kowalska, 2003 | 30. m/0.32 mm/1. μm |
Capillary | DB-1 | 413. | 672.02 | Ciaznska-Halarewicz and Kowalska, 2003 | 30. m/0.32 mm/1. μm |
Capillary | DB-1 | 423. | 674.86 | Ciaznska-Halarewicz and Kowalska, 2003 | 30. m/0.32 mm/1. μm |
Capillary | DB-5 | 313. | 693.14 | Ciaznska-Halarewicz and Kowalska, 2003 | 30. m/0.32 mm/1. μm |
Capillary | DB-5 | 323. | 692.22 | Ciaznska-Halarewicz and Kowalska, 2003 | 30. m/0.32 mm/1. μm |
Capillary | DB-5 | 333. | 691.63 | Ciaznska-Halarewicz and Kowalska, 2003 | 30. m/0.32 mm/1. μm |
Capillary | DB-5 | 343. | 691.20 | Ciaznska-Halarewicz and Kowalska, 2003 | 30. m/0.32 mm/1. μm |
Capillary | DB-5 | 353. | 690.53 | Ciaznska-Halarewicz and Kowalska, 2003 | 30. m/0.32 mm/1. μm |
Capillary | DB-5 | 363. | 691.40 | Ciaznska-Halarewicz and Kowalska, 2003 | 30. m/0.32 mm/1. μm |
Capillary | DB-5 | 373. | 691.57 | Ciaznska-Halarewicz and Kowalska, 2003 | 30. m/0.32 mm/1. μm |
Capillary | DB-5 | 383. | 691.79 | Ciaznska-Halarewicz and Kowalska, 2003 | 30. m/0.32 mm/1. μm |
Capillary | DB-5 | 393. | 692.92 | Ciaznska-Halarewicz and Kowalska, 2003 | 30. m/0.32 mm/1. μm |
Capillary | DB-5 | 403. | 694.09 | Ciaznska-Halarewicz and Kowalska, 2003 | 30. m/0.32 mm/1. μm |
Capillary | DB-5 | 413. | 696.34 | Ciaznska-Halarewicz and Kowalska, 2003 | 30. m/0.32 mm/1. μm |
Capillary | DB-5 | 423. | 697.44 | Ciaznska-Halarewicz and Kowalska, 2003 | 30. m/0.32 mm/1. μm |
Capillary | DB-1 | 50. | 672.20 | Ciazynska-Halarewicz, Borucka, et al., 2002 | 30. m/0.32 mm/1. μm, He |
Capillary | DB-1 | 75. | 673.99 | Ciazynska-Halarewicz, Borucka, et al., 2002 | 30. m/0.32 mm/1. μm, He |
Capillary | DB-1 | 100. | 671.87 | Ciazynska-Halarewicz, Borucka, et al., 2002 | 30. m/0.32 mm/1. μm, He |
Capillary | DB-1 | 125. | 652.20 | Ciazynska-Halarewicz, Borucka, et al., 2002 | 30. m/0.32 mm/1. μm, He |
Capillary | DB-1 | 150. | 638.93 | Ciazynska-Halarewicz, Borucka, et al., 2002 | 30. m/0.32 mm/1. μm, He |
Capillary | HP-1 | 110. | 666.9 | Héberger, Görgényi, et al., 2002 | 50. m/0.32 mm/1.05 μm |
Capillary | HP-1 | 30. | 665.4 | Héberger, Görgényi, et al., 2002 | 50. m/0.32 mm/1.05 μm |
Capillary | HP-1 | 40. | 665.4 | Héberger, Görgényi, et al., 2002 | 50. m/0.32 mm/1.05 μm |
Capillary | HP-1 | 50. | 665.40 | Héberger, Görgényi, et al., 2002 | 50. m/0.32 mm/1.05 μm |
Capillary | HP-1 | 60. | 665.4 | Héberger, Görgényi, et al., 2002 | 50. m/0.32 mm/1.05 μm |
Capillary | HP-1 | 70. | 665.69 | Héberger, Görgényi, et al., 2002 | 50. m/0.32 mm/1.05 μm |
Capillary | HP-1 | 90. | 666.07 | Héberger, Görgényi, et al., 2002 | 50. m/0.32 mm/1.05 μm |
Capillary | Squalane | 200. | 631. | Castello, Vezzani, et al., 1999 | |
Capillary | Apolane | 200. | 636. | Castello, Vezzani, et al., 1999 | |
Capillary | HP-1 | 110. | 667. | Héberger and Görgényi, 1999 | 50. m/0.32 mm/1.05 μm, N2 |
Capillary | HP-1 | 50. | 665. | Héberger and Görgényi, 1999 | 50. m/0.32 mm/1.05 μm, N2 |
Capillary | HP-1 | 70. | 666. | Héberger and Görgényi, 1999 | 50. m/0.32 mm/1.05 μm, N2 |
Capillary | HP-1 | 90. | 666. | Héberger and Görgényi, 1999 | 50. m/0.32 mm/1.05 μm, N2 |
Capillary | SE-30 | 100. | 674. | Golovnya, Syomina, et al., 1997 | 25. m/0.32 mm/1. μm, He |
Capillary | SE-30 | 110. | 676. | Golovnya, Syomina, et al., 1997 | 25. m/0.32 mm/1. μm, He |
Capillary | SE-30 | 80. | 672. | Golovnya, Syomina, et al., 1997 | 25. m/0.32 mm/1. μm, He |
Capillary | SE-30 | 90. | 673. | Golovnya, Syomina, et al., 1997 | 25. m/0.32 mm/1. μm, He |
Capillary | SPB-1 | 60. | 649. | Castello, Vezzani, et al., 1994 | 30. m/0.32 mm/0.25 μm, He |
Capillary | OV-101 | 150. | 669.2 | Cha and Lee, 1994 | Column length: 20. m; Column diameter: 0.5 mm |
Capillary | OV-101 | 180. | 675.3 | Cha and Lee, 1994 | Column length: 20. m; Column diameter: 0.5 mm |
Packed | Porapack Q | 200. | 663. | Gawdzik and Matynia, 1994 | H2; Column length: 1. m |
Packed | SE-30 | 120. | 682. | Kowalski, 1992 | He, Gas Chrom Q (100-120 mesh); Column length: 0.25 m |
Packed | C78, Branched paraffin | 130. | 629.6 | Reddy, Dutoit, et al., 1992 | Chromosorb G HP; Column length: 3.3 m |
Capillary | SE-54 | 110. | 688.5 | Grigor'eva, Vasil'ev, et al., 1989 | 15. m/0.28 mm/2.5 μm, Ar |
Capillary | SE-54 | 130. | 690. | Grigor'eva, Vasil'ev, et al., 1989 | 15. m/0.28 mm/2.5 μm, Ar |
Capillary | SE-54 | 150. | 691.2 | Grigor'eva, Vasil'ev, et al., 1989 | 15. m/0.28 mm/2.5 μm, Ar |
Packed | OV-101 | 150. | 685.6 | Maeck, Touabet, et al., 1989 | N2, Chromosorb G HP; Column length: 2. m |
Packed | OV-101 | 120. | 685. | Fernández-Sánchez, Fernández-Torres, et al., 1987 | N2, Chromosorb W AW DMCS (80-100 mesh); Column length: 2. m |
Capillary | Apiezon L + KF | 60. | 668. | Svetlova, Samusenko, et al., 1986 | 30. m/0.25 mm/0.06 μm |
Capillary | OV-101 | 80. | 668. | Wang and Sun, 1985 | Column length: 50. m; Column diameter: 0.27 mm |
Packed | SE-30 | 120. | 672. | Stolyarov and Kartsova, 1984 | N2; Column length: 200. m |
Packed | SE-30 | 150. | 675. | Tiess, 1984 | Ar, Gas Chrom Q (80-100 mesh); Column length: 3. m |
Packed | OV-1 | 120. | 671. | Valko, Papp, et al., 1984 | Gas Chrom Q; Column length: 2. m |
Packed | Apolane | 100. | 630. | Castello and D'Amato, 1983 | He, Chromosorb G; Column length: 3. m |
Packed | Apolane | 200. | 636. | Castello and D'Amato, 1983 | He, Chromosorb G; Column length: 3. m |
Packed | Squalane | 100. | 624. | Castello and D'Amato, 1983 | He, Chromosorb G; Column length: 3. m |
Packed | Squalane | 120. | 627. | Castello and D'Amato, 1983 | He, Chromosorb G; Column length: 3. m |
Packed | Squalane | 125. | 626. | Castello and D'Amato, 1983 | He, Chromosorb G; Column length: 3. m |
Packed | Squalane | 200. | 631. | Castello and D'Amato, 1983 | He, Chromosorb G; Column length: 3. m |
Packed | SE-30 | 100. | 671. | Winskowski, 1983 | Gaschrom Q; Column length: 2. m |
Packed | SE-30 | 150. | 666. | Haken, Nguyen, et al., 1979 | Celatom AW silanized; Column length: 3.7 m |
Packed | Apiezon L | 120. | 646. | Bogoslovsky, Anvaer, et al., 1978 | Celite 545 |
Packed | Apiezon L | 160. | 653. | Bogoslovsky, Anvaer, et al., 1978 | Celite 545 |
Packed | Apiezon L | 130. | 644. | Bogoslovsky, Anvaer, et al., 1978 | |
Capillary | Apiezon M | 120. | 642. | Golovnya and Misharina, 1977 | |
Packed | Apolane | 190. | 634.8 | Riedo, Fritz, et al., 1976 | He, Chromosorb; Column length: 2.4 m |
Packed | SE-30 | 150. | 673. | Haken, Ho, et al., 1975 | Column length: 3.7 m |
Packed | SE-30 | 150. | 674. | Ashes and Haken, 1974 | Celaton (62-72 mesh); Column length: 3.7 m |
Packed | Squalane | 50. | 624. | Mira and Sanchez, 1970 | Chromosorb G |
Packed | Squalane | 70. | 623. | Mira and Sanchez, 1970 | Chromosorb G |
Packed | Apiezon L | 100. | 642. | Brown, Chapman, et al., 1968 | N2, DCMS-treated Chromosorb W; Column length: 2.3 m |
Packed | Apiezon L | 150. | 654. | Brown, Chapman, et al., 1968 | N2, DCMS-treated Chromosorb W; Column length: 2.3 m |
Packed | Apiezon L | 130. | 644. | Wehrli and Kováts, 1959 | Celite; Column length: 2.25 m |
Packed | Apiezon L | 70. | 638. | Wehrli and Kováts, 1959 | Celite; Column length: 2.25 m |

Kovats' RI, non-polar column, temperature ramp

Column type | Active phase | I | Reference | Comment |
---|---|---|---|---|
Capillary | SE-54 | 687. | Rembold, Wallner, et al., 1989 | 30. m/0.25 mm/0.25 μm, He, 0. C @ 12. min, 12. K/min; Tend: 250. C |
Capillary | OV-101 | 703. | Ohnishi and Shibamoto, 1984 | 2. K/min; Column length: 50. m; Column diameter: 0.23 mm; Tstart: 80. C; Tend: 200. C |
Capillary | OV-101 | 705. | Ohnishi and Shibamoto, 1984 | 2. K/min; Column length: 50. m; Column diameter: 0.23 mm; Tstart: 80. C; Tend: 200. C |

Kovats' RI, non-polar column, custom temperature program

Column type | Active phase | I | Reference | Comment |
---|---|---|---|---|
Capillary | BP-1 | 666. | SGE, 2005 | Program: not specified |
Capillary | BP-5 | 692. | SGE, 2005 | Program: not specified |
Capillary | BPX-5 | 697. | SGE, 2005 | Program: not specified |
Capillary | SPB-1 | 664.8 | Castello, Timossi, et al., 1988 | N2; Column length: 60. m; Column diameter: 0.75 mm; Program: not specified |
Packed | SE-30 | 680. | Moffat, Stead, et al., 1974 | Chromosrb G; Column length: 2. m; Program: not specified |

Kovats' RI, polar column, isothermal

Column type | Active phase | Temperature (C) | I | Reference | Comment |
---|---|---|---|---|---|
Capillary | DB-Wax | 40. | 1003.89 | Ciaznska-Halarewicz and Kowalska, 2003 | Column length: 30. m; Column diameter: 0.32 mm |
Capillary | DB-Wax | 50. | 1005.72 | Ciaznska-Halarewicz and Kowalska, 2003 | Column length: 30. m; Column diameter: 0.32 mm |
Capillary | DB-Wax | 60. | 1007.52 | Ciaznska-Halarewicz and Kowalska, 2003 | Column length: 30. m; Column diameter: 0.32 mm |
Capillary | DB-Wax | 70. | 1009.73 | Ciaznska-Halarewicz and Kowalska, 2003 | Column length: 30. m; Column diameter: 0.32 mm |
Capillary | DB-Wax | 80. | 1011.09 | Ciaznska-Halarewicz and Kowalska, 2003 | Column length: 30. m; Column diameter: 0.32 mm |
Capillary | DB-Wax | 90. | 1012.78 | Ciaznska-Halarewicz and Kowalska, 2003 | Column length: 30. m; Column diameter: 0.32 mm |
Capillary | DB-Wax | 100. | 1014.87 | Ciaznska-Halarewicz and Kowalska, 2003 | Column length: 30. m; Column diameter: 0.32 mm |
Capillary | DB-Wax | 110. | 1016.30 | Ciaznska-Halarewicz and Kowalska, 2003 | Column length: 30. m; Column diameter: 0.32 mm |
Capillary | DB-Wax | 120. | 1018.39 | Ciaznska-Halarewicz and Kowalska, 2003 | Column length: 30. m; Column diameter: 0.32 mm |
Capillary | DB-Wax | 130. | 1020.31 | Ciaznska-Halarewicz and Kowalska, 2003 | Column length: 30. m; Column diameter: 0.32 mm |
Capillary | DB-Wax | 140. | 1022.25 | Ciaznska-Halarewicz and Kowalska, 2003 | Column length: 30. m; Column diameter: 0.32 mm |
Capillary | DB-Wax | 150. | 1023.72 | Ciaznska-Halarewicz and Kowalska, 2003 | Column length: 30. m; Column diameter: 0.32 mm |
Capillary | DB-Wax | 75. | 986.78 | Ciazynska-Halarewicz, Borucka, et al., 2002 | 30. m/0.32 mm/1. μm, He |
Capillary | DB-Wax | 100. | 1015.63 | Ciazynska-Halarewicz, Borucka, et al., 2002 | 30. m/0.32 mm/1. μm, He |
Capillary | DB-Wax | 125. | 1021.54 | Ciazynska-Halarewicz, Borucka, et al., 2002 | 30. m/0.32 mm/1. μm, He |
Capillary | HP-Innowax | 110. | 1010.7 | Héberger and Görgényi, 1999 | 30. m/0.32 mm/0.5 μm |
Capillary | HP-Innowax | 50. | 996.2 | Héberger and Görgényi, 1999 | 30. m/0.32 mm/0.5 μm |
Capillary | HP-Innowax | 70. | 1000.7 | Héberger and Görgényi, 1999 | 30. m/0.32 mm/0.5 μm |
Capillary | HP-Innowax | 90. | 1005.6 | Héberger and Görgényi, 1999 | 30. m/0.32 mm/0.5 μm |
Capillary | Supelcowax-10 | 60. | 990.2 | Castello, Vezzani, et al., 1994 | 30. m/0.32 mm/0.25 μm, He |
Capillary | PEG-20M | 80. | 979.4 | Orav, Kuningas, et al., 1994 | 50. m/0.2 mm/0.13 μm, He |
Capillary | PEG-20M | 80. | 992.6 | Orav, Kuningas, et al., 1994 | 50. m/0.2 mm/0.19 μm, He |
Capillary | PEG-20M | 80. | 994.6 | Orav, Kuningas, et al., 1994 | 50. m/0.2 mm/0.22 μm, He |
Packed | Carbowax 20M | 80. | 979. | Kersten and Poole, 1987 | N2, Chromosorb W-AW; Column length: 3.5 m |
Packed | PEG-20M | 120. | 996. | Stolyarov and Kartsova, 1984 | N2, Chromaton N AW HMDS; Column length: 2. m |

Kovats' RI, polar column, temperature ramp

Column type | Active phase | I | Reference | Comment |
---|---|---|---|---|
Capillary | DB-Wax | 974. | Tatsuka, Suekane, et al., 1990 | 60. m/0.25 mm/0.25 μm, He, 40. C @ 5. min, 3. K/min; Tend: 200. C |
Capillary | DB-Wax | 978. | Tatsuka, Suekane, et al., 1990 | 60. m/0.25 mm/0.25 μm, He, 40. C @ 5. min, 3. K/min; Tend: 200. C |
Packed | PEG-20M | 969. | Galt and MacLeod, 1984 | N2, Celite, 70. C @ 9. min, 10. K/min; Column length: 5.5 m; Tend: 175. C |
Capillary | Carbowax 20M | 990. | Tressl, Friese, et al., 1978 | He, 2. K/min; Column length: 50. m; Column diameter: 0.28 mm; Tstart: 70. C; Tend: 190. C |

Kovats' RI, polar column, custom temperature program

Column type | Active phase | I | Reference | Comment |
---|---|---|---|---|
Capillary | BP-20 | 998. | SGE, 2005 | Program: not specified |
Capillary | PEG-20M | 969. | Slizhov and Gavrilenko, 2001 | He; Column length: 10. m; Column diameter: 0.2 mm; Program: not specified |
Capillary | Supelcowax-10 | 997.6 | Castello, Timossi, et al., 1988 | N2; Column length: 60. m; Column diameter: 0.75 mm; Program: not specified |

Van Den Dool and Kratz RI, non-polar column, temperature ramp

Column type | Active phase | I | Reference | Comment |
---|---|---|---|---|
Capillary | DB-5 | 686. | Methven L., Tsoukka M., et al., 2007 | 60. m/0.32 mm/1. μm, 40. C @ 2. min, 4. K/min, 260. C @ 10. min |
Capillary | DB-5 | 695. | Bylaite and Meyer, 2006 | 30. m/0.25 mm/1. μm, 50. C @ 1. min, 10. K/min, 290. C @ 10. min |
Capillary | DB-1 | 651. | Osorio, Alarcon, et al., 2006 | 25. m/0.2 mm/0.33 μm, 4. K/min; Tstart: 50. C; Tend: 300. C |
Capillary | HP-5 | 699. | Solina, Baumgartner, et al., 2005 | 25. m/0.2 mm/1. μm, He, 5. K/min, 280. C @ 5. min; Tstart: 40. C |
Capillary | CP-Sil 8CB-MS | 683. | Hierro, de la Hoz, et al., 2004 | 60. m/0.25 mm/0.25 μm, 40. C @ 2. min, 4. K/min, 280. C @ 5. min |
Capillary | SPB-5 | 689. | Píno, Marbot, et al., 2004 | 30. m/0.25 mm/0.25 μm, He, 60. C @ 2. min, 4. K/min, 250. C @ 20. min |
Capillary | HP-5 | 685. | Siegmund and Murkovic, 2004 | 30. m/0.25 mm/0.1 μm, -30. C @ 1. min, 10. K/min, 250. C @ 5. min |
Capillary | CP-Sil 8CB-MS | 710. | Bruna, Hierro, et al., 2003 | 60. m/0.25 mm/0.25 μm, 40. C @ 2. min, 4. K/min, 280. C @ 5. min |
Capillary | Petrocol DH | 673.9 | Censullo, Jones, et al., 2003 | 50. m/0.25 mm/0.5 μm, He, 35. C @ 10. min, 3. K/min, 200. C @ 10. min |
Capillary | CP Sil 5 CB | 653. | Pino, Almora, et al., 2003 | 60. m/0.32 mm/0.25 μm, He, 60. C @ 10. min, 3. K/min, 280. C @ 60. min |
Capillary | SPB-5 | 689. | Pino, Marbot, et al., 2003 | 30. m/0.25 mm/0.25 μm, He, 60. C @ 2. min, 4. K/min, 250. C @ 20. min |
Capillary | DB-5 | 681.8 | Xu, van Stee, et al., 2003 | 30. m/0.25 mm/1. μm, He, 2.5 K/min; Tstart: 50. C; Tend: 200. C |
Capillary | CP Sil 8 CB | 692. | Elmore, Campo, et al., 2002 | 60. m/0.25 mm/0.25 μm, He, 40. C @ 2. min, 4. K/min; Tend: 280. C |
Capillary | CP Sil 5 CB | 653. | Pino, Marbot, et al., 2002 | 30. m/0.25 mm/0.25 μm, H2, 60. C @ 10. min, 2. K/min, 280. C @ 40. min |
Capillary | CP Sil 5 CB | 653. | Pino, Marbot, et al., 2002, 2 | 50. m/0.32 mm/0.4 μm, He, 60. C @ 10. min, 3. K/min, 280. C @ 60. min |
Capillary | BPX-5 | 680. | Ames, Guy, et al., 2001 | 50. m/0.32 mm/0.5 μm, He, 60. C @ 5. min, 4. K/min, 250. C @ 10. min |
Capillary | BPX-5 | 680. | Ames, Guy, et al., 2001 | 50. m/0.32 mm/0.5 μm, He, 60. C @ 5. min, 4. K/min, 250. C @ 10. min |
Capillary | CP-Sil 8CB-MS | 692. | Bruna, Hierro, et al., 2001 | 60. m/0.25 mm/0.25 μm, 40. C @ 2. min, 4. K/min; Tend: 280. C |
Capillary | SPB-1 | 673. | Larráyoz, Addis, et al., 2001 | 30. m/0.32 mm/4. μm, He, 45. C @ 13. min, 5. K/min, 240. C @ 5. min |
Capillary | CP Sil 5 CB | 653. | Pino and Marbot, 2001 | 50. m/0.32 mm/0.4 μm, He, 60. C @ 10. min, 3. K/min, 280. C @ 60. min |
Capillary | CP Sil 5 CB | 653. | Pino, Marbot, et al., 2001 | 50. m/0.32 mm/0.4 μm, He, 60. C @ 10. min, 3. K/min, 280. C @ 60. min |
Capillary | CP Sil 8 CB | 693. | Elmore, Mottram, et al., 2000 | 60. m/0.25 mm/0.25 μm, He, 40. C @ 2. min, 4. K/min; Tend: 280. C |
Capillary | DB-5 | 715. | Moio, Piombino, et al., 2000 | 30. m/0.32 mm/1. μm, H2, 3. K/min; Tstart: 40. C; Tend: 210. C |
Capillary | OV-1 | 680. | Valero, Sanz, et al., 1999 | 20. m/0.32 mm/0.3 μm, He, 45. C @ 5. min, 10. K/min, 220. C @ 10. min |
Capillary | BPX-5 | 698. | Aaslyng, Elmore, et al., 1998 | 50. m/0.32 mm/0.50 μm, He, 4. K/min; Tstart: 40. C; Tend: 280. C |
Capillary | SPB-5 | 684. | Verdier-Metz., Coulon, et al., 1998 | 60. m/0.32 mm/1. μm, He, 40. C @ 5. min, 3. K/min, 200. C @ 2. min |
Capillary | SE-54 | 682. | Li, Wang, et al., 1998 | H2, 35. C @ 3. min, 4. K/min; Column length: 25. m; Column diameter: 0.31 mm; Tend: 250. C |
Capillary | SE-54 | 684. | Li, Wang, et al., 1998 | H2, 35. C @ 3. min, 4. K/min; Column length: 25. m; Column diameter: 0.31 mm; Tend: 250. C |
Capillary | DB-5 | 689. | Madruga and Mottram, 1998 | 30. m/0.32 mm/1. μm, 60. C @ 5. min, 4. K/min, 250. C @ 20. min |
Capillary | DB-5 | 715. | Moio and Addeo, 1998 | 30. m/0.32 mm/1. μm, H2, 3. K/min; Tstart: 40. C; Tend: 210. C |
Capillary | DB-5 | 715. | Moio and Addeo, 1998 | 30. m/0.32 mm/1. μm, H2, 3. K/min; Tstart: 40. C; Tend: 210. C |
Capillary | DB-1 | 666.00 | Bartelt, 1997 | 30. m/0.32 mm/5. μm, He, 35. C @ 1. min, 10. K/min; Tend: 270. C |
Capillary | OV-101 | 682. | Misharina, Golovnya, et al., 1992 | 50. m/0.31 mm/0.5 μm, He, 4. K/min; Tstart: 50. C; Tend: 250. C |
Capillary | OV-101 | 630. | Misharina, Aerove, et al., 1991 | 50. m/0.32 mm/0.50 μm, He, 2. K/min; Tstart: 50. C; Tend: 250. C |
Capillary | DB-1 | 666. | Wu, Kuo, et al., 1991 | 50. m/0.32 mm/1.05 μm, He, 2. K/min, 260. C @ 40. min; Tstart: 40. C |
Capillary | DB-5 | 700. | Guichard and Souty, 1988 | H2, 30. C @ 5. min, 1.5 K/min; Column length: 0.32 m; Column diameter: 1. mm; Tend: 180. C |
Capillary | OV-101 | 663. | Wang and Sun, 1985 | 2. K/min; Column length: 50. m; Column diameter: 0.27 mm; Tstart: 110. C |
Capillary | OV-101 | 664. | Wang and Sun, 1985 | 2. K/min; Column length: 50. m; Column diameter: 0.27 mm; Tstart: 125. C |
Capillary | OV-101 | 661. | Wang and Sun, 1985 | 2. K/min; Column length: 50. m; Column diameter: 0.27 mm; Tstart: 80. C |
Capillary | OV-101 | 662. | Wang and Sun, 1985 | 3. K/min; Column length: 50. m; Column diameter: 0.27 mm; Tstart: 80. C |
Capillary | OV-101 | 662. | Wang and Sun, 1985 | 4. K/min; Column length: 50. m; Column diameter: 0.27 mm; Tstart: 80. C |
Capillary | OV-101 | 662. | Wang and Sun, 1985 | 2. K/min; Column length: 50. m; Column diameter: 0.27 mm; Tstart: 95. C |
Capillary | CP Sil 5 CB | 645. | Hendriks and Bruins, 1983 | 4. K/min; Column length: 25. m; Column diameter: 0.22 mm; Tstart: 70. C; Tend: 205. C |

Van Den Dool and Kratz RI, non-polar column, custom temperature program

Column type | Active phase | I | Reference | Comment |
---|---|---|---|---|
Capillary | HP-5MS | 686. | Bonaiti, Irlinger, et al., 2005 | 30. m/0.25 mm/0.25 μm, He; Program: 5C(8min) => 3C/min => 20C => 10C/min => 150C(10min) |
Capillary | DB-5 | 711. | Boscaini, van Ruth, et al., 2003 | 60. m/0.32 mm/1. μm, He; Program: 40C(4min) => 2C/min => 90C => 4C/min => 130C 8C/min => 250C |
Capillary | HP-5 | 700. | Carrapiso, Ventanas, et al., 2002 | 50. m/0.32 mm/1.05 μm; Program: 35C(5min) => 10C/min => 150C => 20C/min => 250C(10 min) |
Capillary | CP-Sil 8CB-MS | 680. | Elmore, Mottram, et al., 2000, 2 | 60. m/0.25 mm/0.25 μm, He; Program: 0C(5min) => 40C/min => 40C (2min) => 4C/min => 280C |
Capillary | BPX-5 | 716. | Elmore, Mottram, et al., 1999 | 50. m/0.32 mm/0.5 μm, He; Program: 0C(5min) => 40C/min => 40C(2min) => 4C/min => 280C |
Capillary | BPX-5 | 705. | Owens J.D., Allagheny N., et al., 1997 | 50. m/0.32 mm/0.5 μm, He; Program: OC => 60C/min => 60C(5min) => 4C/min => 250C(20min) |
Capillary | HP-PONA | 677. | Maignial, Pibarot, et al., 1992 | 50. m/0.2 mm/0.5 μm; Program: 20C(0.5min) => fast => 60C => 4C/min => 250C |

Van Den Dool and Kratz RI, polar column, temperature ramp

Column type | Active phase | I | Reference | Comment |
---|---|---|---|---|
Capillary | ZB-Wax | 983. | Wu, Zorn, et al., 2007 | 30. m/0.32 mm/0.25 μm, He, 40. C @ 2. min, 5. K/min, 250. C @ 5. min |
Capillary | CP-Wax 52CB | 968. | Mahadevan and Farmer, 2006 | 60. C @ 5. min, 4. K/min, 220. C @ 30. min; Column length: 50. m; Column diameter: 0.32 mm |
Capillary | DB-Wax | 945. | Osorio, Alarcon, et al., 2006 | 30. m/0.25 mm/0.25 μm, He, 50. C @ 4. min, 4. K/min, 220. C @ 20. min |
Capillary | CP-Wax 52CB | 971. | Alasalvar, Taylor, et al., 2005 | 60. m/0.25 mm/0.25 μm, 35. C @ 4. min, 3. K/min; Tend: 203. C |
Capillary | Supelcowax-10 | 978. | Elmore, Nisyrios, et al., 2005 | 60. m/0.25 mm/0.25 μm, He, 40. C @ 2. min, 4. K/min; Tend: 280. C |
Capillary | DB-Wax | 1005. | Malliaa, Fernandez-Garcia, et al., 2005 | 60. m/0.32 mm/1. μm, He, 45. C @ 1. min, 5. K/min, 250. C @ 12. min |
Capillary | DB-Wax Etr | 985. | Ménager, Jost, et al., 2004 | 30. m/0.25 mm/0.25 μm, He, 40. C @ 3. min, 3. K/min, 245. C @ 20. min |
Capillary | Carbowax | 991.1 | Censullo, Jones, et al., 2003 | 60. m/0.25 mm/0.5 μm, He, 50. C @ 10. min, 5. K/min, 250. C @ 10. min |
Capillary | AT-Wax | 945. | Pino, Almora, et al., 2003 | 60. m/0.32 mm/0.25 μm, He, 65. C @ 10. min, 2. K/min, 250. C @ 60. min |
Capillary | AT-Wax | 944. | Pino, Marbot, et al., 2002, 2 | 60. m/0.32 mm/0.25 μm, He, 65. C @ 10. min, 2. K/min, 250. C @ 60. min |
Capillary | AT-Wax | 943. | Pino and Marbot, 2001 | 60. m/0.32 mm/0.25 μm, He, 65. C @ 10. min, 2. K/min, 250. C @ 60. min |
Capillary | AT-Wax | 944. | Pino, Marbot, et al., 2001 | 60. m/0.32 mm/0.25 μm, He, 65. C @ 10. min, 2. K/min, 250. C @ 60. min |
Capillary | DB-Wax | 996. | Shimoda, Yoshimura, et al., 2001 | 60. m/0.25 mm/0.25 μm, He, 2. K/min, 230. C @ 60. min; Tstart: 50. C |
Capillary | FFAP | 988. | Ott, Fay, et al., 1997 | 30. m/0.25 mm/0.25 μm, He, 20. C @ 1. min, 4. K/min, 200. C @ 1. min |
Capillary | DB-Wax | 980. | Shimoda, Peralta, et al., 1996 | 60. m/0.25 mm/0.25 μm, He, 3. K/min; Tstart: 50. C; Tend: 230. C |
Capillary | DB-Wax | 975. | Shimoda, Wu, et al., 1996 | 60. m/0.25 mm/0.25 μm, He, 3. K/min; Tstart: 50. C; Tend: 230. C |
Capillary | DB-Wax | 975. | Iwaoka, Hagi, et al., 1994 | He, 40. C @ 5. min, 2. K/min; Column length: 30. m; Column diameter: 0.25 mm; Tend: 200. C |
Capillary | DB-Wax | 993. | Shiratsuchi, Shimoda, et al., 1994 | 60. m/0.25 mm/0.25 μm, He, 2. K/min, 230. C @ 60. min; Tstart: 50. C |
Capillary | DB-Wax | 978. | Sumitani, Suekane, et al., 1994 | He, 40. C @ 5. min, 3. K/min; Column length: 60. m; Column diameter: 0.25 mm; Tend: 200. C |
Capillary | DB-Wax | 938. | Frohlich and Schreier, 1990 | 30. m/0.32 mm/0.25 μm, He, 40. C @ 3. min, 5. K/min; Tend: 220. C |
Capillary | Supelcowax-10 | 977. | Matiella and Hsieh, 1990 | 60. m/0.25 mm/0.25 μm, 40. C @ 5. min, 2. K/min, 175. C @ 20. min |
Capillary | DB-Wax | 938. | Fröhlich, Duque, et al., 1989 | 30. m/0.25 mm/0.25 μm, He, 50. C @ 3. min, 4. K/min; Tend: 250. C |
Capillary | DB-Wax | 943. | Fröhlich, Duque, et al., 1989 | 30. m/0.25 mm/0.25 μm, He, 50. C @ 3. min, 4. K/min; Tend: 250. C |
Capillary | Supelcowax-10 | 978. | Tanchotikul and Hsieh, 1989 | 60. m/0.25 mm/0.25 μm, 40. C @ 5. min, 2. K/min, 175. C @ 20. min |
Capillary | Supelcowax-10 | 979. | Tanchotikul and Hsieh, 1989 | 60. m/0.25 mm/0.25 μm, 40. C @ 5. min, 2. K/min, 175. C @ 20. min |
Capillary | PEG-20M | 983.4 | Wang and Sun, 1985 | 3. K/min; Column length: 62. m; Column diameter: 0.27 mm; Tstart: 70. C |
Capillary | PEG-20M | 984.3 | Wang and Sun, 1985 | 4. K/min; Column length: 62. m; Column diameter: 0.27 mm; Tstart: 70. C |
Capillary | PEG-20M | 984.4 | Wang and Sun, 1985 | 2. K/min; Column length: 62. m; Column diameter: 0.27 mm; Tstart: 80. C |
Capillary | PEG-20M | 987.0 | Wang and Sun, 1985 | 2. K/min; Column length: 62. m; Column diameter: 0.27 mm; Tstart: 90. C |
Capillary | Carbowax 20M | 971. | Chen, Kuo, et al., 1982 | He, 50. C @ 10. min, 1. K/min; Tend: 160. C |

Van Den Dool and Kratz RI, polar column, custom temperature program

Column type | Active phase | I | Reference | Comment |
---|---|---|---|---|
Capillary | Supelcowax-10 | 980. | Bianchi, Cantoni, et al., 2007 | 30. m/0.25 mm/0.25 μm; Program: 35C(8min) => 4C/min => 60C => 6C/min => 160C => 20C/min => 220C(1min) |
Capillary | Supelcowax-10 | 980. | Bianchi, Careri, et al., 2007 | 30. m/0.25 mm/0.25 μm, He; Program: 35C(8min) => 4C/min => 60C => 6C/min => 160C => 20C/min => 200C(1min) |
Capillary | Supelcowax-10 | 982. | Bianchi, Careri, et al., 2007 | 30. m/0.25 mm/0.25 μm, He; Program: 40C(1min) => 10C/min => 120C => 15C/min => 200C (1min) |
Capillary | Supelcowax-10 | 979. | Bianchi, Careri, et al., 2007 | 30. m/0.25 mm/0.25 μm, He; Program: 35C(8min) => 4C/min => 60C => 6C/min => 160C => 20C/min => 200C(1min) |
Capillary | Supelcowax-10 | 980. | Bianchi, Careri, et al., 2007 | 30. m/0.25 mm/0.25 μm, He; Program: 35C(8min) => 4C/min => 60C => 6C/min => 160C => 20C/min => 200C(1min) |
Capillary | Supelcowax-10 | 984. | Bianchi, Careri, et al., 2007 | 30. m/0.25 mm/0.25 μm, He; Program: 35C(8min) => 4C/min => 60C => 6C/min => 160C => 20C/min => 200C(1min) |
Capillary | CP-Wax 52CB | 983. | Verzera, Ziino, et al., 2004 | 60. m/0.25 mm/0.25 μm, He; Program: 45C(5min) => 10C/min => 80C => 2C/min => 240C |
Capillary | CP-Wax 52CB | 968. | Alasalvar, Shahidi, et al., 2003 | 60. m/0.25 mm/0.25 μm, He; Program: 40C => 5C/min => 60C => 2.5C/min => 155C |
Capillary | HP-FFAP | 944. | Carrapiso, Ventanas, et al., 2002 | 30. m/0.32 mm/0.25 μm; Program: 35C(5min) => 10C/min => 150C => 20C/min => 250C(10 min) |
Capillary | Innowax | 971. | Larráyoz, Addis, et al., 2001 | 60. m/0.22 mm/0.25 μm, He; Program: 35C (1min) => 3C/min => 170C => 4C/min => 200C (20min) |
Capillary | DB-Wax | 970. | Radovic, Careri, et al., 2001 | 30. m/0.25 mm/0.25 μm; Program: 30C(8min) => 4C/min => 60C => 6C/min => 160C => 20C/min => 200C(1min) |
Capillary | CP-Wax 52CB | 974. | Madruga and Mottram, 1998 | 50. m/0.32 mm/0.21 μm; Program: 0C(5min) => fast => 60C(5min) => 4C/min => 220C(20min) |
Capillary | Supelcowax-10 | 976. | Baek and Cadwallader, 1996 | 60. m/0.25 mm/0.25 μm; Program: 40C => (6C/min) => 80C(6min) => (15C/min) => 200C(10min) |

Normal alkane RI, non-polar column, isothermal

Column type | Active phase | Temperature (C) | I | Reference | Comment |
---|---|---|---|---|---|
Capillary | Polydimethyl siloxane | 105. | 667. | Tello, Lebron-Aguilar, et al., 2009 | |
Capillary | Polydimethyl siloxane | 75. | 666. | Tello, Lebron-Aguilar, et al., 2009 | |
Capillary | Polydimethyl siloxane | 90. | 667. | Tello, Lebron-Aguilar, et al., 2009 | |
Packed | Polydimethyl siloxane | 120. | 668. | Tello, Lebron-Aguilar, et al., 2009 | |
Packed | Polydimethyl siloxane | 120. | 669. | Tello, Lebron-Aguilar, et al., 2009 | |
Packed | Polydimethyl siloxane | 120. | 669. | Tello, Lebron-Aguilar, et al., 2009 | |
Capillary | Methyl Silicone | 100. | 667. | Lebrón-Aguilar, Quintanilla-López, et al., 2007 | |
Capillary | Methyl Silicone | 120. | 670. | Lebrón-Aguilar, Quintanilla-López, et al., 2007 | |
Capillary | Methyl Silicone | 140. | 669. | Lebrón-Aguilar, Quintanilla-López, et al., 2007 | |
Capillary | Methyl Silicone | 80. | 666. | Lebrón-Aguilar, Quintanilla-López, et al., 2007 | |
Capillary | Methyl Silicone | 120. | 668. | Lebrón-Aguilar, Quintanilla-López, et al., 2007 | |
Capillary | Methyl Silicone | 120. | 668. | Lebrón-Aguilar, Quintanilla-López, et al., 2007 | |
Capillary | Methyl Silicone | 120. | 670. | Lebrón-Aguilar, Quintanilla-López, et al., 2007 | |
Capillary | OV-1 | 60. | 665. | Amboni, Junkes, et al., 2002 | |
Packed | Apieson L | 120. | 655. | Kurdina, Markovich, et al., 1969 | not specified, not specified |
Packed | DC-400 | 150. | 640. | Anderson, 1968 | Helium, Gas-Pak (60-80 mesh); Column length: 3.0 m |

Normal alkane RI, non-polar column, temperature ramp

Column type | Active phase | I | Reference | Comment |
---|---|---|---|---|
Capillary | Optima-5 MS | 671. | Goeminne, Vandendriessche, et al., 2012 | 30. m/0.25 mm/0.25 μm, Helium, 35. C @ 3. min, 10. K/min, 250. C @ 5. min |
Capillary | DB-5 | 668. | Cais-Sokolinska, Majcher, et al., 2011 | 25. m/0.20 mm/0.33 μm, Helium, 50. C @ 1. min, 20. K/min; Tend: 240. C |
Capillary | VF-5 MS | 678. | Leffingwell and Alford, 2011 | 60. m/0.32 mm/0.25 μm, Helium, 2. K/min, 260. C @ 28. min; Tstart: 30. C |
Capillary | VF-5 MS | 680. | Leffingwell and Alford, 2011 | 60. m/0.32 mm/0.25 μm, Helium, 2. K/min, 260. C @ 28. min; Tstart: 30. C |
Capillary | OV-101 | 670. | Zenkevich, Eliseenkov, et al., 2011 | 25. m/0.20 mm/0.25 μm, Nitrogen, 6. K/min; Tstart: 40. C; Tend: 240. C |
Capillary | DB-1 | 661. | Kumazawa, Itobe, et al., 2008 | 30. m/0.25 mm/0.25 μm, He, 5. K/min; Tstart: 30. C; Tend: 210. C |
Capillary | HP-5 | 703. | Mildner-Szkudlarz and Jelen, 2008 | 10. m/0.10 mm/0.40 μm, Helium, 40. C @ 1. min, 20. K/min, 280. C @ 1. min |
Capillary | 5 % Phenyl methyl siloxane | 685. | Ramirez R. and Cava R., 2007 | 30. m/0.25 mm/1. μm, He, 40. C @ 10. min, 7. K/min, 250. C @ 5. min |
Capillary | SPB-5 | 685. | Vasta, Ratel, et al., 2007 | 60. m/0.32 mm/1. μm, 40. C @ 5. min, 3. K/min, 230. C @ 5. min |
Capillary | HP-1 | 662. | Berlioz, Cordella, et al., 2006 | 50. m/0.2 mm/0.33 μm, N2, 2. K/min, 250. C @ 20. min; Tstart: 60. C |
Capillary | DB-5 | 698. | Fadel, Mageed, et al., 2006 | He, 60. C @ 5. min, 4. K/min; Column length: 60. m; Column diameter: 0.32 mm; Tend: 250. C |
Capillary | DB-5 | 698. | Fadel, Mageed, et al., 2006, 2 | He, 50. C @ 5. min, 4. K/min; Column length: 60. m; Column diameter: 0.32 mm; Tend: 250. C |
Capillary | HP-5 | 688. | Isidorov, Purzynska, et al., 2006 | 30. m/0.25 mm/0.25 μm, He, 35. C @ 5. min, 3. K/min; Tend: 200. C |
Capillary | SPB-5 | 689. | Pino, Marquez, et al., 2006 | 30. m/0.25 mm/0.25 μm, Helium, 60. C @ 2. min, 4. K/min, 250. C @ 20. min |
Capillary | DB-5 | 671. | Fan and Qian, 2005 | 30. m/0.32 mm/0.25 μm, N2, 40. C @ 2. min, 4. K/min, 250. C @ 5. min |
Capillary | HP-5MS | 687. | Krist, Stuebiger, et al., 2005 | 30. m/0.25 mm/0.25 μm, 38. C @ 1. min, 5. K/min, 220. C @ 2. min |
Capillary | MDN-5 | 685. | van Loon, Linssen, et al., 2005 | 60. m/0.25 mm/0.25 μm, He, 40. C @ 4. min, 4. K/min, 270. C @ 5. min |
Capillary | HP-1 | 659. | Cavalli, Fernandez, et al., 2004 | 50. m/0.2 mm/0.33 μm, N2, 2. K/min, 250. C @ 20. min; Tstart: 60. C |
Capillary | SPB-1 | 655. | Vichi, Pizzale, et al., 2003 | 30. m/0.25 mm/0.25 μm, He, 40. C @ 10. min, 3. K/min; Tend: 200. C |
Capillary | SPB-5 | 681. | Pérès, Begnaud, et al., 2002 | 60. m/0.32 mm/1. μm, 40. C @ 5. min, 3. K/min, 200. C @ 5. min |
Capillary | DB-5 | 684. | Joffraud, Leroi, et al., 2001 | 60. m/0.32 mm/1. μm, He, 40. C @ 5. min, 3. K/min; Tend: 200. C |
Capillary | HP-5 | 686. | García, Martín, et al., 2000 | 60. m/0.32 mm/1. μm, He, 3. K/min; Tstart: 40. C; Tend: 240. C |
Capillary | OV-101 | 664. | Tamura, Boonbumrung, et al., 2000 | Nitrogen, 40. C @ 10. min, 2. K/min; Column length: 50. m; Column diameter: 0.25 mm; Tend: 200. C |
Capillary | Methyl Silicone | 674. | Vendramini and Trugo, 2000 | 50. m/0.25 mm/0.5 μm, H2, 40. C @ 0.5 min, 4. K/min; Tend: 260. C |
Capillary | DB-5 | 685. | Meynier, Novelli, et al., 1999 | 30. m/0.32 mm/1. μm, 40. C @ 5. min, 3. K/min; Tend: 200. C |
Capillary | SE-54 | 681. | Ding, Deng, et al., 1998 | 35. C @ 3. min, 4. K/min; Column length: 25. m; Column diameter: 0.31 mm; Tend: 250. C |
Capillary | DB-1 | 680. | Tai and Ho, 1998 | 60. m/0.32 mm/1.0 μm, He, 2. K/min; Tstart: 40. C; Tend: 280. C |
Capillary | DB-1 | 693. | Tai and Ho, 1998 | 60. m/0.32 mm/1.0 μm, He, 2. K/min; Tstart: 40. C; Tend: 280. C |
Capillary | DB-1 | 666. | Robacker and Bartelt, 1997 | 30. m/0.32 mm/0.5 μm, He, 35. C @ 1. min, 10. K/min; Tend: 200. C |
Capillary | HP-5 | 690. | Larsen and Frisvad, 1995 | 35. C @ 2. min, 6. K/min; Tend: 200. C |
Capillary | Ultra-2 | 682. | King, Hamilton, et al., 1993 | 50. m/0.32 mm/0.52 μm, He, 40. C @ 3. min, 4. K/min, 250. C @ 30. min |
Capillary | DB-1 | 652. | Shiota, 1993 | 30. m/0.25 mm/0.25 μm, He, 50. C @ 5. min, 3. K/min; Tend: 240. C |
Capillary | DB-1 | 655. | Shiota, 1993 | 30. m/0.25 mm/0.25 μm, He, 50. C @ 5. min, 3. K/min; Tend: 240. C |
Capillary | DB-1 | 652. | Shiota, 1993 | 30. m/0.25 mm/0.25 μm, He, 50. C @ 3. min, 5. K/min; Tend: 240. C |
Capillary | DB-1 | 658. | Shiota, 1993 | 30. m/0.25 mm/0.25 μm, He, 50. C @ 3. min, 5. K/min; Tend: 240. C |
Capillary | DB-5 | 688. | Lee, Macku, et al., 1991 | 60. m/0.25 mm/0.25 μm, 40. C @ 5. min, 2. K/min; Tend: 250. C |
Capillary | DB-5 | 691. | Macku and Shibamoto, 1991 | He, 40. C @ 5. min, 2. K/min; Column length: 60. m; Column diameter: 0.25 mm; Tend: 160. C |
Capillary | DB-5 | 690. | Macku and Shibamoto, 1991, 2 | He, 40. C @ 5. min, 2. K/min; Column length: 60. m; Column diameter: 0.25 mm; Tend: 160. C |
Capillary | OV-101 | 672. | Anker, Jurs, et al., 1990 | 2. K/min; Column length: 50. m; Column diameter: 0.28 mm; Tstart: 80. C; Tend: 200. C |
Capillary | DB-1 | 658. | Binder, Turner, et al., 1990 | 4. K/min, 230. C @ 10. min; Tstart: 50. C |
Capillary | HP-5 | 672. | Spadone, Takeoka, et al., 1990 | H2, 16. K/min; Column length: 50. m; Column diameter: 0.3 mm; Tstart: 80. C; Tend: 250. C |
Capillary | HP-5 | 679. | Spadone, Takeoka, et al., 1990 | H2, 16. K/min; Column length: 50. m; Column diameter: 0.3 mm; Tstart: 80. C; Tend: 250. C |
Capillary | OV-3 | 705. | Buttery, Xu, et al., 1985 | 1. K/min; Column length: 150. m; Column diameter: 0.66 mm; Tstart: 20. C; Tend: 170. C |
Capillary | DB-1 | 664. | Habu, Flath, et al., 1985 | 3. K/min; Column length: 50. m; Column diameter: 0.32 mm; Tstart: 0. C; Tend: 250. C |
Capillary | OV-101 | 665. | del Rosario, de Lumen, et al., 1984 | He, 0. C @ 1. min, 3. K/min; Column length: 50. m; Column diameter: 0.31 mm; Tend: 225. C |
Capillary | SP 2100 | 660. | Labropoulos, Palmer, et al., 1982 | Helium, 10. K/min; Column length: 40. m; Column diameter: 0.20 mm; Tstart: 40. C; Tend: 200. C |
Capillary | SE-30 | 677. | Alves and Jennings, 1979 | Helium, 2. K/min; Tstart: 70. C; Tend: 170. C |
Capillary | SF-96 | 673. | Donetzhuber, Johansson, et al., 1976 | Nitrogen, 3. K/min, 130. C @ 40. min; Column length: 111. m; Column diameter: 0.76 mm; Initial hold: 8. min |

Normal alkane RI, non-polar column, custom temperature program

Column type | Active phase | I | Reference | Comment |
---|---|---|---|---|
Capillary | HP-5 | 695. | Fang, Pu, et al., 2012 | 30. m/0.25 mm/0.25 μm, Helium; Program: 30 0C (1 min) 2 0C/min -> 100 0C (5 min) 5 0C/min -> 170 0C |
Capillary | Siloxane, 5 % Ph | 699. | VOC BinBase, 2012 | Program: not specified |
Capillary | DB-5 | 674. | Miyazaki, Plotto, et al., 2011 | 60. m/0.25 mm/1.00 μm, Helium; Program: 40 0C 4 0C/min -> 230 0C 100 0C/min -> 260 0C (11.7 min) |
Capillary | Polydimethyl siloxane, 5 % phenyl | 699. | Skogerson, Wohlgemuth, et al., 2011 | Program: not specified |
Capillary | HP-5 | 684. | Pugliese, Sirtori, et al., 2009 | 50. m/0.32 mm/1.05 μm, Helium; Program: not specified |
Capillary | HP-5 | 690. | Rotsatschakul, Visesanguan, et al., 2009 | 60. m/0.25 mm/0.25 μm, Helium; Program: 30 0C (2 min) 2 0Cmin -> 60 0C 10 0C/min -> 100 0C 20 0C/min -> 140 0C 10 0C/min -> 200 0C (10 min) |
Capillary | Squalane | 673. | Chen, 2008 | Program: not specified |
Capillary | HP-5 | 660. | Ventanas, Estevez, et al., 2008 | 50. m/0.32 mm/1.05 μm, Helium; Program: 40 0C (10 min) 5 0C/min -> 200 0C 15 0C/min -> 250 0C (10 min) |
Capillary | HP-5 | 671. | Zhao, Li, et al., 2008 | 30. m/0.25 mm/0.25 μm; Program: not specified |
Capillary | HP-5 | 700. | Carrapiso and Garsia, 2007 | 50. m/0.32 mm/1.05 μm; Program: 35 0C (10 min) 10 0C/min -> 150 0C 20 0C/min -> 250 0C (10 min) |
Capillary | Methyl Silicone | 654. | Chen and Feng, 2007 | Program: not specified |
Capillary | Methyl Silicone | 666. | Feng and Mu, 2007 | Program: not specified |
Capillary | DB-5 MS | 682. | Liu, Xu, et al., 2007 | 60. m/0.32 mm/1.0 μm, Helium; Program: 40 0C (2 min) 6 0C/min -> 100 0C 4 0C/min -> 180 0C 8 0C/min -> 250 0C (12 min) |
Capillary | DB-5 | 684. | Pellicer, 2007 | 30. m/0.32 mm/0.25 μm, Helium; Program: not specified |
Capillary | DB-5 | 689. | Pellicer, 2007 | 30. m/0.32 mm/0.25 μm, Helium; Program: not specified |
Capillary | DB-5 | 689. | Pellicer, 2007 | 30. m/0.32 mm/0.25 μm, Helium; Program: not specified |
Capillary | DB-5 | 689. | Pellicer, 2007 | 30. m/0.32 mm/0.25 μm, Helium; Program: not specified |
Capillary | HP-5 | 700. | Splivallo, Bossi, et al., 2007 | He; Program: 50C => 3C/min => 200C(10min) => 10C/min => 290C(10min) |
Capillary | DB-1 | 649. | Cramer, Mattinson, et al., 2005 | 60. m/0.32 mm/0.25 μm, He; Program: 33C(5min) => 2C/min => 50c => 5C/min => 225C |
Capillary | HP-5 | 680. | Thierry, Maillard, et al., 2005 | 60. m/0.32 mm/1. μm; Program: not specified |
Capillary | HP-5 | 686. | Garcia-Estaban, Ansorena, et al., 2004 | 50. m/0.32 mm/1.05 μm; Program: 40C(10min) => 5C/min => 200C => 20C/min => 250C(5min) |
Capillary | DB-5 | 686. | Garcia-Estaban, Ansorena, et al., 2004, 2 | 50. m/0.32 mm/1.05 μm; Program: 40C(10min) => 5C/min => 200C => 20C/min => 250C (5min) |
Capillary | HP-1 | 665. | Junkes, Amboni, et al., 2004 | Program: not specified |
Capillary | SE-30 | 672. | Vinogradov, 2004 | Program: not specified |
Capillary | SPB-5 | 678. | Begnaud, Pérès, et al., 2003 | 60. m/0.32 mm/1. μm; Program: not specified |
Capillary | HP-5 | 653. | Jordán, Margaría, et al., 2003 | 30. m/0.25 mm/0.25 μm; Program: 40C(6min) => 2.5C/min => 150C => 90C/min => 250C |
Capillary | Polydimethyl siloxane | 665. | Junkes, Castanho, et al., 2003 | Program: not specified |
Capillary | BPX-5 | 685. | Machiels, van Ruth, et al., 2003 | 60. m/0.32 mm/1. μm, He; Program: 40C (4min) => 2C/min => 90C => 4C/min => 130C => 8C/min => 250 C (10min) |
Capillary | HP-5 | 687. | Jordán, Goodner, et al., 2002 | 30. m/0.25 mm/0.25 μm; Program: not specified |
Capillary | HP-5 | 679. | Jordán, Goodner, et al., 2002 | 30. m/0.25 mm/0.25 μm; Program: not specified |
Capillary | Methyl phenyl siloxane (not specified) | 684. | Poligne, Collignan, et al., 2002 | Program: not specified |
Capillary | Methyl Silicone | 644. | N/A | Program: not specified |
Capillary | HP-1 | 629. | Teai, Claude-Lafontaine, et al., 2001 | 50. m/0.32 mm/0.52 μm, N2; Program: 40C => 2C/min => 130C => 4C/min => 250C |
Capillary | Methyl Silicone | 663. | Estrada and Gutierrez, 1999 | Program: not specified |
Capillary | SE-54 | 684. | Ding, Deng, et al., 1998 | Column length: 25. m; Column diameter: 0.31 mm; Program: not specified |
Capillary | SPB-1 | 669. | Flanagan, Streete, et al., 1997 | 60. m/0.53 mm/5. μm, He; Program: 40C(6min) => 5C/min => 80C => 10C/min => 200C |
Capillary | Polydimethyl siloxanes | 670. | Zenkevich and Chupalov, 1996 | Program: not specified |
Capillary | Methyl Silicone | 676. | Misharina, 1995 | Program: not specified |
Capillary | DB-1 | 663. | Ciccioli, Cecinato, et al., 1994 | 60. m/0.32 mm/0.25 μm; Program: not specified |
Capillary | DB-1 | 663. | Ciccioli, Brancaleoni, et al., 1993 | 60. m/0.32 mm/0.25 μm; Program: 3 min at 5 C; 5 - 50 C at 3 deg/min; 50 - 220 C at 5 deg/min |
Capillary | SPB-1 | 669. | Strete, Ruprah, et al., 1992 | 60. m/0.53 mm/5.0 μm, Helium; Program: 40 0C (6 min) 5 0C/min -> 80 0C 10 0C/min -> 200 0C |
Capillary | SPB-1 | 680. | Strete, Ruprah, et al., 1992 | 60. m/0.53 mm/5.0 μm, Helium; Program: not specified |
Capillary | DB-1 | 658. | Binder and Flath, 1989 | Column length: 60. m; Column diameter: 0.32 mm; Program: not specified |
Capillary | DB-1 | 672. | MacLeod and Snyder, 1988 | Program: not specified |
Capillary | methyl silicone oil with 5% Igepal | 664. | Schultz, Flath, et al., 1988 | Column length: 150. m; Column diameter: 0.75 mm; Program: not specified |
Capillary | methyl silicone oil with 5% Igepal | 666. | Schultz, Flath, et al., 1988 | Column length: 150. m; Column diameter: 0.75 mm; Program: not specified |
Capillary | OV-1 | 674. | Waggott and Davies, 1984 | Hydrogen; Column length: 50. m; Column diameter: 0.32 mm; Program: not specified |
Capillary | OV-1, SE-30, Methyl silicone, SP-2100, OV-101, DB-1, etc. | 639. | Waggott and Davies, 1984 | Hydrogen; Column length: 50. m; Column diameter: 0.32 mm; Program: not specified |
Capillary | OV-1 | 680. | Ramsey and Flanagan, 1982 | Program: not specified |

Normal alkane RI, polar column, temperature ramp

Column type | Active phase | I | Reference | Comment |
---|---|---|---|---|
Capillary | CP-Wax CB | 965. | Alves, da Penha, et al., 2012 | 30. m/0.25 mm/0.25 μm, Helium, 2. K/min, 150. C @ 5. min; Tstart: 50. C |
Capillary | DB-Wax | 990. | Kumazawa, Itobe, et al., 2008 | 30. m/0.25 mm/0.25 μm, He, 5. K/min; Tstart: 30. C; Tend: 210. C |
Capillary | FFAP | 1001. | Nebesny, Budryn, et al., 2007 | 30. m/0.32 mm/0.5 μm, N2, 35. C @ 5. min, 4. K/min, 320. C @ 45. min |
Capillary | CP-Wax 52CB | 981. | Povolo, Contarini, et al., 2007 | 60. m/0.32 mm/0.5 μm, He, 40. C @ 8. min, 4. K/min, 220. C @ 20. min |
Capillary | CP-Wax 52CB | 971. | Povolo, Contarini, et al., 2007 | 60. m/0.32 mm/0.5 μm, He, 40. C @ 8. min, 4. K/min, 220. C @ 20. min |
Capillary | CP-Wax 52CB | 984. | Povolo, Contarini, et al., 2007 | 60. m/0.32 mm/0.5 μm, He, 40. C @ 8. min, 4. K/min, 220. C @ 20. min |
Capillary | CP-Wax 52CB | 982. | Povolo, Contarini, et al., 2007 | 60. m/0.32 mm/0.5 μm, He, 40. C @ 8. min, 4. K/min, 220. C @ 20. min |
Capillary | DB-Wax | 972. | Fan and Qian, 2006 | 30. m/0.32 mm/0.25 μm, He, 40. C @ 2. min, 4. K/min, 230. C @ 15. min |
Capillary | DB-Wax | 970. | Fan and Qian, 2006, 2 | 30. m/0.32 mm/0.25 μm, N2, 40. C @ 2. min, 6. K/min, 230. C @ 15. min |
Capillary | DB-Wax | 992. | Qian and Wang, 2005 | 60. m/0.32 mm/0.50 μm, Nitrogen, 35. C @ 4. min, 2. K/min, 235. C @ 30. min |
Capillary | Supelcowax-10 | 1015. | Rochat and Chaintreau, 2005 | 60. m/0.53 mm/1. μm, He, 40. C @ 2. min, 4. K/min, 240. C @ 20. min |
Capillary | Supelcowax-10 | 1018. | Rochat and Chaintreau, 2005 | 60. m/0.53 mm/1. μm, He, 40. C @ 2. min, 4. K/min, 240. C @ 20. min |
Capillary | ZB-Wax | 983. | N/A | 30. m/0.32 mm/0.25 μm, Helium, 40. C @ 2. min, 5. K/min, 250. C @ 5. min |
Capillary | ZB-Wax | 990. | N/A | 30. m/0.32 mm/0.25 μm, Helium, 40. C @ 2. min, 5. K/min, 250. C @ 5. min |
Capillary | DB-Wax | 1025. | Chida, Sone, et al., 2004 | 60. m/0.25 mm/0.5 μm, 35. C @ 5. min, 4. K/min, 240. C @ 10. min |
Capillary | PEG-20M | 980. | Narain, Almeida, et al., 2004 | 50. m/0.20 mm/0.20 μm, 40. C @ 5. min, 3. K/min, 180. C @ 30. min |
Capillary | DB-Wax | 992. | Alves and Franco, 2003 | 30. m/0.25 mm/0.5 μm, H2, 50. C @ 10. min, 3. K/min, 200. C @ 10. min |
Capillary | DB-Wax | 960. | Lee and Noble, 2003 | 30. m/0.25 mm/0.25 μm, He, 40. C @ 4. min, 4. K/min, 185. C @ 20. min |
Capillary | DB-Wax | 975. | Tanaka, Yamauchi, et al., 2003 | 30. m/0.25 mm/0.25 μm, 30. C @ 1. min, 4. K/min; Tend: 250. C |
Capillary | DB-Wax | 975. | Tanaka, Yamauchi, et al., 2003 | 30. m/0.25 mm/0.25 μm, 30. C @ 1. min, 4. K/min; Tend: 250. C |
Capillary | Supelcowax-10 | 969. | Vichi, Pizzale, et al., 2003 | 30. m/0.25 mm/0.25 μm, He, 40. C @ 10. min, 3. K/min; Tend: 200. C |
Capillary | TC-Wax | 957. | Fukami, Ishiyama, et al., 2002 | 60. m/0.25 mm/0.25 μm, He, 2. K/min; Tstart: 50. C; Tend: 230. C |
Capillary | FFAP | 969. | Lecanu, Ducruet, et al., 2002 | 30. m/0.32 mm/1. μm, He, 35. C @ 3. min, 5. K/min; Tend: 240. C |
Capillary | TC-Wax | 975. | Suhardi, Suzuki, et al., 2002 | 60. m/0.25 mm/0.25 μm, He, 40. C @ 10. min, 3. K/min, 230. C @ 10. min |
Capillary | DB-Wax | 940. | Duque, Bonilla, et al., 2001 | 30. m/0.25 mm/0.25 μm, Helium, 4. K/min, 220. C @ 30. min; Tstart: 25. C |
Capillary | DB-Wax | 990. | Tamura, Boonbumrung, et al., 2000 | Nitrogen, 40. C @ 10. min, 2. K/min; Column length: 60. m; Column diameter: 0.25 mm; Tend: 200. C |
Capillary | DB-Wax | 1000. | Iwatsuki, Mizota, et al., 1999 | 4. K/min; Column length: 30. m; Column diameter: 0.53 mm; Tstart: 60. C; Tend: 210. C |
Capillary | Supelcowax-10 | 989. | Campeanu, Burcea, et al., 1998 | 60. m/0.32 mm/0.5 μm, H2, 35. C @ 5. min, 5. K/min, 250. C @ 20. min |
Capillary | DB-Wax | 971. | Horiuchi, Umano, et al., 1998 | 60. m/0.25 mm/1. μm, He, 3. K/min, 200. C @ 40. min; Tstart: 50. C |
Capillary | DB-Wax | 976. | Molleken U., Sinnwell V., et al., 1998 | 30. m/0.25 mm/0.25 μm, N2, 3. K/min; Tstart: 45. C; Tend: 220. C |
Capillary | DB-Wax | 966. | Sekiwa, Kubota, et al., 1997 | He, 2. K/min; Column length: 60. m; Column diameter: 0.25 mm; Tstart: 60. C; Tend: 180. C |
Capillary | HP-Innowax | 940. | Ulrich, Hoberg, et al., 1997 | 60. m/0.32 mm/0.5 μm, H2, 1.5 K/min; Tstart: 50. C; Tend: 180. C |
Capillary | DB-Wax | 975. | Umano, Hagi, et al., 1995 | He, 40. C @ 2. min, 2. K/min; Column length: 60. m; Column diameter: 0.25 mm; Tend: 200. C |
Capillary | Carbowax 20M | 969. | Anker, Jurs, et al., 1990 | 2. K/min; Column length: 80. m; Column diameter: 0.2 mm; Tstart: 70. C; Tend: 170. C |
Capillary | DB-Wax | 975. | Binder, Turner, et al., 1990 | 4. K/min, 230. C @ 10. min; Column length: 60. m; Column diameter: 0.32 mm; Tstart: 50. C |
Capillary | SP-1000 | 1025. | De Llano D.G., Ramos M., et al., 1990 | 25. m/0.2 mm/0.43 μm, N2, 4. K/min, 190. C @ 30. min; Tstart: 60. C |
Capillary | DB-Wax | 971. | Binder and Flath, 1989 | 50. C @ 0.1 min, 4. K/min, 250. C @ 5. min; Column length: 60. m; Column diameter: 0.32 mm |
Capillary | Carbowax 20M | 990. | Buttery, Xu, et al., 1985 | 60. C @ 40. min, 1. K/min; Column length: 150. m; Column diameter: 0.66 mm; Tend: 170. C |
Capillary | Carbowax 20M | 981. | Labropoulos, Palmer, et al., 1982 | Helium, 10. K/min; Column length: 31. m; Column diameter: 0.50 mm; Tstart: 40. C; Tend: 200. C |

Normal alkane RI, polar column, custom temperature program

Column type | Active phase | I | Reference | Comment |
---|---|---|---|---|
Capillary | DB-Wax | 966. | Gyawali and Kim, 2012 | 60. m/0.20 mm/0.25 μm, Helium; Program: 40 0C (3 min) 2 0C/min -> 150 0C 4 0C/min -> 220 0C (20 min) 5 0C/min -> 230 0C |
Capillary | DB-Wax | 1005. | Miyazaki, Plotto, et al., 2011 | 60. m/0.25 mm/0.50 μm, Helium; Program: 40 0C 4 0C/min -> 230 0C 100 0C/min -> 260 0C (11.7 min) |
Capillary | CP-Wax 52 CB | 982. | Povolo, Cabassi, et al., 2011 | Program: not specified |
Capillary | DB-Wax | 969. | Gyawali and Kim, 2009 | 60. m/0.25 mm/0.25 μm, Helium; Program: 40 0C (3 min) 2 0C/min -> 150 0C 4 0C/min -> 220 0C (20 min) |
Capillary | Supelcowax-10 | 979. | Berard, Bianchi, et al., 2007 | 30. m/0.25 mm/0.25 μm, He; Program: 35C(8min) => 6C/min => 60C => 4C/min => 160C => 20C/min => 200C(1min) |
Capillary | Supelcowax-10 | 980. | Berard, Bianchi, et al., 2007 | 30. m/0.25 mm/0.25 μm, He; Program: 35C(8min) => 6C/min => 60C => 4C/min => 160C => 20C/min => 200C(1min) |
Capillary | HP-FFAP | 944. | Carrapiso and Garsia, 2007 | 30. m/0.32 mm/0.25 μm; Program: 35 0C (10 min) 10 0C/min -> 150 0C 20 0C/min -> 250 0C (10 min) |
Capillary | HP-Innowax | 983. | Narain, Galvao, et al., 2007 | 30. m/0.25 mm/0.25 μm, He; Program: 30C(5min) => 7C/min => 100C(5min) => 1C/min => 130C => 10C/min => 195C(45min) |
Capillary | HP-Innowax | 983. | Narain, Galvao, et al., 2007 | 30. m/0.25 mm/0.25 μm, He; Program: 30C(5min) => 7C/min => 100C(5min) => 1C/min => 130C => 10C/min => 195C(45min) |
Capillary | Supelcowax-10 | 942. | Kourkoutas, Kandylis, et al., 2006 | 60. m/0.32 mm/0.25 μm, He; Program: 35C(3min) => 5C/min => 110C => 10C/min => 240C (10min) |
Capillary | HP-Innowax | 975. | Quijano and Pino, 2006 | 60. m/0.25 mm/0.25 μm, Nitrogen; Program: 50 0C (4 min) -> 40 0C 4 0C/min -> 220 0C |
Capillary | CP-Wax 52CB | 1009. | Jales, Maia, et al., 2005 | Hydrogen; Program: not specified |
Capillary | Innowax | 996. | Junkes, Amboni, et al., 2004 | Program: not specified |
Capillary | DB-Wax | 970. | Kim. J.H., Ahn, et al., 2004 | 60. m/0.25 mm/0.25 μm, Helium; Program: 60 0C (3 min) 2 0C/min -> 150 0C 4 0C/min -> 200 0C |
Capillary | Carbowax 20M | 969. | Vinogradov, 2004 | Program: not specified |
Capillary | DB-Wax | 966. | Miranda, Nogueira, et al., 2001 | 30. m/0.25 mm/0.25 μm, He; Program: 25 0C (0.5 min) 50 K/min -> 50 0C 3.5 K/min -> 150 0C 7.5 K/min -> 240 0C |
Capillary | CP-Wax 52CB | 986. | Muresan, Eillebrecht, et al., 2000 | 50. m/0.32 mm/1.2 μm; Program: 40C(10min) => 3C/min => 190C => 10C/min => 250C(5min) |
Capillary | DB-Wax | 992. | Peng, Yang, et al., 1991 | Program: not specified |
Capillary | DB-Wax | 975. | Binder and Flath, 1989 | Column length: 60. m; Column diameter: 0.32 mm; Program: not specified |
Capillary | Carbowax 400, Carbowax 20M, Carbowax 1540, Carbowax 4000, Superox 06, PEG 20M, etc. | 983. | Waggott and Davies, 1984 | Hydrogen; Column length: 50. m; Column diameter: 0.32 mm; Program: not specified |
Capillary | Carbowax 400, Carbowax 20M, Carbowax 1540, Carbowax 4000, Superox 06, PEG 20M, etc. | 984. | Waggott and Davies, 1984 | Hydrogen; Column length: 50. m; Column diameter: 0.32 mm; Program: not specified |

References

Harrop, Head, et al., 1970
Harrop, D.; Head, A.J.; Lewis, G.B.,
Thermodynamic properties of organic oxygen compounds. 22. Enthalpies of combustion of some aliphatic ketones,
J. Chem. Thermodyn., 1970, 2, 203-210. [all data]
Guinchant, 1918
Guinchant, M.J.,
Etude sur la fonction acide dans les derives metheniques et methiniques,
Ann. Chem., 1918, 10, 30-84. [all data]
Nickerson J.K., 1961
Nickerson J.K.,
The thermodynamic properties of the methyl ketone series,
J. Phys. Chem., 1961, 65, 1037-1043. [all data]
Andon, Counsell, et al., 1968
Andon, R.J.L.; Counsell, J.F.; Martin, J.F.,
Thermodynamic properties of organic oxygen compounds. Part XX. The low-temperature heat capacity and entropy of C4 and C5 ketones,
J. Chem. Soc. A, 1968, 1894-1897. [all data]
Oetting, 1965
Oetting, F.L.,
Absolute entropies of the methyl alkyl ketones at 298.15 K,
J. Chem. Eng. Data, 1965, 10, 122-125. [all data]
Saluja, Peacock, et al., 1979
Saluja, P.P.S.; Peacock, L.A.; Fuchs, R.,
Enthalpies of interaction of aliphatic ketones with polar and nonpolar solvents,
J. Am. Chem. Soc., 1979, 101, 1958-1962. [all data]
Grolier, Benson, et al., 1975
Grolier, J-P.E.; Benson, G.C.; Picker, P.,
Simultaneous measurements of heat capacities and densities of organic liquid mixtures-systems containing ketones,
J. Chem. Eng. Data, 1975, 20, 243-246. [all data]
Collerson, Counsell, et al., 1965
Collerson, R.R.; Counsell, J.F.; Handley, R.; Martin, J.F.; Sprake, C.H.S.,
677. Thermodynamic properties of organic oxygen compounds. Part XV. Purification and vapour pressures of some ketones and ethers,
J. Chem. Soc., 1965, 3697, https://doi.org/10.1039/jr9650003697
. [all data]
Timmermans, 1952
Timmermans, J.,
Freezing points of organic compounds. VVI New determinations.,
Bull. Soc. Chim. Belg., 1952, 61, 393. [all data]
Van de Vloed, 1939
Van de Vloed, A.,
Bull. Soc. Chim. Belg., 1939, 48, 229. [all data]
Timmermans, 1921
Timmermans, J.,
The Freezing Points of Organic Substances IV. New Exp. Determinations,
Bull. Soc. Chim. Belg., 1921, 30, 62. [all data]
Andon, Counsell, et al., 1968, 2
Andon, R.J.L.; Counsell, J.F.; Martin, J.F.,
Thermodynamic properties of organic oxygen compounds. Part XX. The low- temperature heat capacity and entropy of C4 and C5 ketones.,
J. Chem. Soc. A, 1968, 1968, 1894-7. [all data]
Oetting, 1965, 2
Oetting, F.L.,
Absolute Entropies of the Methyl Alkyl Ketones 1t 298.15 K,
J. Chem. Eng. Data, 1965, 10, 122-5. [all data]
Majer and Svoboda, 1985
Majer, V.; Svoboda, V.,
Enthalpies of Vaporization of Organic Compounds: A Critical Review and Data Compilation, Blackwell Scientific Publications, Oxford, 1985, 300. [all data]
Ambrose, Broderick, et al., 1974
Ambrose, D.; Broderick, B.E.; Townsend, R.,
The Critical Temperatures and Pressures of Thirty Organic Compounds,
J. Appl. Chem. Biotechnol., 1974, 24, 359. [all data]
Kobe, Crawford, et al., 1955
Kobe, K.A.; Crawford, H.R.; Stephenson, R.W.,
Critical Properties and Vapor Pressures of Some Ketones,
Ind. Eng. Chem., 1955, 47, 1767-72. [all data]
Uchytilova, Majer, et al., 1983
Uchytilova, V.; Majer, V.; Svoboda, V.; Hynek, V.,
Enthalpies of vaporization and cohesive enrgies for seven aliphatic ketones,
J. Chem. Thermodyn., 1983, 15, 853-858. [all data]
Ambrose, Ellender, et al., 1975
Ambrose, D.; Ellender, J.H.; Lees, E.B.; Sprake, C.H.S.; Townsend, R.,
Thermodynamic properties of organic oxygen compounds XXXVIII. Vapour pressures of some aliphatic ketones,
The Journal of Chemical Thermodynamics, 1975, 7, 5, 453-472, https://doi.org/10.1016/0021-9614(75)90275-X
. [all data]
Stephenson and Malanowski, 1987
Stephenson, Richard M.; Malanowski, Stanislaw,
Handbook of the Thermodynamics of Organic Compounds, 1987, https://doi.org/10.1007/978-94-009-3173-2
. [all data]
Dykyj, 1972
Dykyj, J.,
Petrochemia, 1972, 12, 1, 13. [all data]
Meyer and Wagner, 1966
Meyer, Edwin F.; Wagner, Robert E.,
Cohesive Energies in Polar Organic Liquids,
J. Phys. Chem., 1966, 70, 10, 3162-3168, https://doi.org/10.1021/j100882a025
. [all data]
Nickerson, Kobe, et al., 1961
Nickerson, J.K.; Kobe, K.A.; McKetta, John J.,
THE THERMODYNAMIC PROPERTIES OF THE METHYL KETONE SERIES,
J. Phys. Chem., 1961, 65, 6, 1037-1043, https://doi.org/10.1021/j100824a038
. [all data]
Collerson, Counsell, et al., 1965, 2
Collerson, R.R.; Counsell, J.F.; Handley, R.; Martin, J.F.; Sprake, C.H.S.,
Thermodynamic Properties of Organic Oxygen Compounds. Part XV. Purification and Vapour Pressures of Some Ketones and Ethers,
J. Chem. Soc., 1965, 3697-3700, https://doi.org/10.1039/jr9650003697
. [all data]
Burkell, Fridgen, et al., 2003
Burkell, J.L.; Fridgen, T.D.; McMahon, T.B.,
Gas-phase acidities and sites of deprotonation of 2-ketones and structures of the corresponding enolates,
Int. J. Mass Spectrom., 2003, 227, 3, 497-508, https://doi.org/10.1016/S1387-3806(03)00102-7
. [all data]
Haas and Harrison, 1993
Haas, M.J.; Harrison, A.G.,
The Fragmentation of Proton-Bound Cluster Ions and the Gas-Phase Acidities of Alcohols,
Int. J. Mass Spectrom. Ion Proc., 1993, 124, 2, 115, https://doi.org/10.1016/0168-1176(93)80003-W
. [all data]
Wiberg and Squires, 1979
Wiberg, K.B.; Squires, R.R.,
Thermodynamics of hydrolysis aliphatic ketals. An entropy component of steric effects,
J. Am. Chem. Soc., 1979, 101, 5512-5515. [all data]
McMahon and Ohanessian, 2000
McMahon, T.B.; Ohanessian, G.,
An Experimental and Ab Initio Study of the Nature of the Binding in Gas-Phase Complexes of Sodium Ions,
Chem. Eur. J., 2000, 6, 16, 2931, https://doi.org/10.1002/1521-3765(20000818)6:16<2931::AID-CHEM2931>3.0.CO;2-7
. [all data]
Connett, 1970
Connett, J.E.,
Chemical equilibria. Part III. Dehydrogenation of pentan-1-ol, pentan-2-ol, and 3-methylbutan-2-ol,
J. Chem. Soc. A, 1970, 1284-1286. [all data]
Buttery, Ling, et al., 1969
Buttery, R.G.; Ling, L.C.; Guadagni, D.G.,
Volatilities Aldehydes, Ketones, and Esters in Dilute Water Solution,
J. Agric. Food Chem., 1969, 17, 385-389. [all data]
Hunter and Lias, 1998
Hunter, E.P.; Lias, S.G.,
Evaluated Gas Phase Basicities and Proton Affinities of Molecules: An Update,
J. Phys. Chem. Ref. Data, 1998, 27, 3, 413-656, https://doi.org/10.1063/1.556018
. [all data]
Ashmore and Burgess, 1978
Ashmore, F.S.; Burgess, A.R.,
Photoelectron spectra of the unbranched C5-C7 alkenes, aldehydes and ketones,
J. Chem. Soc. Faraday Trans. 2, 1978, 74, 734. [all data]
Hernandez, Masclet, et al., 1977
Hernandez, R.; Masclet, P.; Mouvier, G.,
Spectroscopie de photoelectrons d'aldehydes et de cetones aliphatiques,
J. Electron Spectrosc. Relat. Phenom., 1977, 10, 333. [all data]
Cocksey, Eland, et al., 1971
Cocksey, B.J.; Eland, J.H.D.; Danby, C.J.,
The effect of alkyl substitution on ionisation potential,
J. Chem. Soc., 1971, (B), 790. [all data]
Murad and Inghram, 1964
Murad, E.; Inghram, M.G.,
Photoionization of aliphatic ketones,
J. Chem. Phys., 1964, 40, 3263. [all data]
Watanabe, Nakayama, et al., 1962
Watanabe, K.; Nakayama, T.; Mottl, J.,
Ionization potentials of some molecules,
J. Quant. Spectry. Radiative Transfer, 1962, 2, 369. [all data]
Vilesov, 1960
Vilesov, F.I.,
The photoionization of vapors of compounds whose molecules contain carbonyl groups,
Dokl. Phys. Chem., 1960, 132, 521, In original 1332. [all data]
Olivato, Guerrero, et al., 1984
Olivato, P.R.; Guerrero, S.A.; Modelli, A.; Granozzi, G.; Jones, D.; Distefano, G.,
Electronic interaction in heterosubstituted acetones studied by means of ultraviolet photoelectron and electron transmission spectroscopy,
J. Chem. Soc. Perkin Trans. 2, 1984, 1505. [all data]
Benoit and Harrison, 1977
Benoit, F.M.; Harrison, A.G.,
Predictive value of proton affinity. Ionization energy correlations involving oxygenated molecules,
J. Am. Chem. Soc., 1977, 99, 3980. [all data]
Potzinger and Bunau, 1969
Potzinger, P.; Bunau, G.v.,
Empirische Beruksichtigung von Uberschussenergien bei der Auftrittspotentialbestimmung,
Ber. Bunsen-Ges. Phys. Chem., 1969, 73, 466. [all data]
Holmes and Lossing, 1980
Holmes, J.L.; Lossing, F.P.,
Gas-phase heats of formation of keto and enol ions of carbonyl compounds.,
J. Am. Chem. Soc., 1980, 102, 1591. [all data]
Hu, Lu, et al., 2006
Hu, X.-F.; Lu, C.-H.; Yin, C.-S.,
Modeling Gas Chromatographic Retention Indices of Oxygen-containing Compounds by Novel Atom-type Topological Indices,
Chinese Journal of Chemical Physics, 2006, 19, 3, 243-247, https://doi.org/10.1360/cjcp2006.19(3).243.5
. [all data]
Ciaznska-Halarewicz and Kowalska, 2003
Ciaznska-Halarewicz, K.; Kowalska, T.,
A study of the dependence of the Kováts retention index on the temperature of analysis on stationary phases of different polarity,
Acta Chromatogr., 2003, 13, 69-80. [all data]
Ciazynska-Halarewicz, Borucka, et al., 2002
Ciazynska-Halarewicz, K.; Borucka, H.E.; Kowalska, T.,
Temperature dependence of Kováts indices in gas chromatography. Statistical and thermodynamic verification of a 'kinetic' model,
Acta Chromatogr., 2002, 12, 65-79. [all data]
Héberger, Görgényi, et al., 2002
Héberger, K.; Görgényi, M.; Kowalska, T.,
Temperature dependence of Kováts indices in gas chromatography revisited,
J. Chromatogr. A, 2002, 973, 1-2, 135-142, https://doi.org/10.1016/S0021-9673(02)01198-6
. [all data]
Castello, Vezzani, et al., 1999
Castello, G.; Vezzani, S.; Gardella, L.,
Influence of temperature on the polarity of porous polymer beads stationary phases for gas chromatography,
J. Chromatogr. A, 1999, 837, 1-2, 153-170, https://doi.org/10.1016/S0021-9673(99)00058-8
. [all data]
Héberger and Görgényi, 1999
Héberger, K.; Görgényi, M.,
Principal component analysis of Kováts indices for carbonyl compounds in capillary gas chromatography,
J. Chromatogr., 1999, 845, 1-2, 21-31, https://doi.org/10.1016/S0021-9673(99)00323-4
. [all data]
Golovnya, Syomina, et al., 1997
Golovnya, R.V.; Syomina, L.A.; Samusenko, A.L.,
Temperature changes of sorption parameters of di-n-alkylketones and methylcyclohexanones in capillary gas chromatography,
Russ. Chem. Bull. (Engl. Transl.), 1997, 46, 2, 314-318, https://doi.org/10.1007/BF02494370
. [all data]
Castello, Vezzani, et al., 1994
Castello, G.; Vezzani, S.; Moretti, P.,
The selectivity and polarity of carbon layer open tubular capillary columns modified with a polar liquid phase,
J. Hi. Res. Chromatogr., 1994, 17, 1, 31-36, https://doi.org/10.1002/jhrc.1240170108
. [all data]
Cha and Lee, 1994
Cha, K.-W.; Lee, D.-J.,
Prediction of retention indices of various compounds in gas-liquid chromatography,
J. Korean Chem. Soc., 1994, 38, 2, 108-120, retrieved from http://journal.kcsnet.or.kr/publi/dh/dh94n2/108.pdf. [all data]
Gawdzik and Matynia, 1994
Gawdzik, B.; Matynia, T.,
Characterization of methacrylic ester of p,p'-dihydroxydiphenylpropane diglicydyl ether - divinylbenzene porous copolymers for GC,
Chromatographia, 1994, 38, 9/10, 643-648, https://doi.org/10.1007/BF02277169
. [all data]
Kowalski, 1992
Kowalski, W.J.,
Free radical crosslinking of the gas chromatographic stationary phase containing europium chelates,
Chromatographia, 1992, 34, 5-8, 266-268, https://doi.org/10.1007/BF02268356
. [all data]
Reddy, Dutoit, et al., 1992
Reddy, K.S.; Dutoit, J.-Cl.; Kovats, E. sz.,
Pair-wise interactions by gas chromatography. I. Interaction free enthalpies of solutes with non-associated primary alcohol groups,
J. Chromatogr., 1992, 609, 1-2, 229-259, https://doi.org/10.1016/0021-9673(92)80167-S
. [all data]
Grigor'eva, Vasil'ev, et al., 1989
Grigor'eva, D.N.; Vasil'ev, A.V.; Golovnya, R.V.,
Variation in retention indices and equivalent chain lengths of homologous series of n-alkyl acetates, n-alkyl methyl ketones, and methyl esters of aliphatic carboxylic acids as a function of homolog number and analysis temperature,
Zh. Anal. Khim., 1989, 44, 1, 68-73. [all data]
Maeck, Touabet, et al., 1989
Maeck, M.; Touabet, A.; Badjah Hadj Ahmed, A.Y.; Meklati, B.Y.,
A numerical interpolation of Kováts indices without dead time correction,
Chromatographia, 1989, 27, 5/6, 205-208, https://doi.org/10.1007/BF02260447
. [all data]
Fernández-Sánchez, Fernández-Torres, et al., 1987
Fernández-Sánchez, E.; Fernández-Torres, A.; García-Domínguez, J.A.; García-Muñoz, J.; Menéndez, V.; Molera, M.J.; Santiuste, J.M.; Pertierra-Rimada, E.,
Mixed stationary phases in gas-liquid chromatography. Partition coefficients and retention indices in OV-101-OV-25, OV-101-Carbowax 20M and OV-225-SP-2340 mixtures,
J. Chromatogr., 1987, 410, 13-29, https://doi.org/10.1016/S0021-9673(00)90031-1
. [all data]
Svetlova, Samusenko, et al., 1986
Svetlova, N.I.; Samusenko, A.L.; Golovnya, R.V.,
Advantage of the universal equation over the linear equation for the calculation of retention parameters of homologous series in capillary chromatography,
J. Hi. Res. Chromatogr. Chromatogr. Comm., 1986, 9, 12, 737-740, https://doi.org/10.1002/jhrc.1240091205
. [all data]
Wang and Sun, 1985
Wang, T.; Sun, Y.,
Correlation of Retention Indices obtained with Two Temperature Programmes,
J. Chromatogr., 1985, 330, 167-171, https://doi.org/10.1016/S0021-9673(01)81973-7
. [all data]
Stolyarov and Kartsova, 1984
Stolyarov, B.V.; Kartsova, L.A.,
Comparative experimental estimation of polarity and selectivity of stationary phases in gas chromatography by means of Forschneider-McReynolds constants and on the basis of thermodynamic characteristics,
Zh. Anal. Khim., 1984, 39, 5, 883-889. [all data]
Tiess, 1984
Tiess, D.,
Gaschromatographische Retentionsindices von 125 leicht- bis mittelflüchtigen organischen Substanzen toxikologisch-analytischer Relevanz auf SE-30,
Wiss. Z. Wilhelm-Pieck-Univ. Rostock Math. Naturwiss. Reihe, 1984, 33, 6-9. [all data]
Valko, Papp, et al., 1984
Valko, K.; Papp, O.; Darvas, F.,
Selection of Gas Chromatographic Stationary Phase Pairs for Characterization of the 1-Octanol-Water Partition Coefficient,
J. Chromatogr., 1984, 301, 355-364, https://doi.org/10.1016/S0021-9673(01)89210-4
. [all data]
Castello and D'Amato, 1983
Castello, G.; D'Amato, G.,
Classification of the Polarity of porous polymer bead stationary phases by comparison with squalane and apolane standard liquid phases,
J. Chromatogr., 1983, 269, 153-160, https://doi.org/10.1016/S0021-9673(01)90798-8
. [all data]
Winskowski, 1983
Winskowski, J.,
Gaschromatographische Identifizierung von Stoffen anhand von Indexziffem und unterschiedlichen Detektoren,
Chromatographia, 1983, 17, 3, 160-165, https://doi.org/10.1007/BF02271041
. [all data]
Haken, Nguyen, et al., 1979
Haken, J.K.; Nguyen, A.; Wainwright, M.S.,
Application of linear extrathermodynamic relationships to alcohols, aldehydes, ketones, amd ethoxy alcohols,
J. Chromatogr., 1979, 179, 1, 75-85, https://doi.org/10.1016/S0021-9673(00)80658-5
. [all data]
Bogoslovsky, Anvaer, et al., 1978
Bogoslovsky, Yu.N.; Anvaer, B.I.; Vigdergauz, M.S.,
Chromatographic constants in gas chromatography (in Russian), Standards Publ. House, Moscow, 1978, 192. [all data]
Golovnya and Misharina, 1977
Golovnya, R.V.; Misharina, T.A.,
Characterization of the selectivity of stationary phases from the partial molar free energies of solution of standards,
Chromatographia, 1977, 10, 11, 658-660, https://doi.org/10.1007/BF02268893
. [all data]
Riedo, Fritz, et al., 1976
Riedo, F.; Fritz, D.; Tarján, G.; Kováts, E.Sz.,
A tailor-made C87 hydrocarbon as a possible non-polar standard stationary phase for gas chromatography,
J. Chromatogr., 1976, 126, 63-83, https://doi.org/10.1016/S0021-9673(01)84063-2
. [all data]
Haken, Ho, et al., 1975
Haken, J.K.; Ho, D.K.M.; Vaughan, C.E.,
Gas chromatography of homologous esters. VII. The retention behaviour of pyruvate esters and related carbonyl and carboxyl compounds,
J. Chromatogr., 1975, 106, 2, 317-325, https://doi.org/10.1016/S0021-9673(00)93839-1
. [all data]
Ashes and Haken, 1974
Ashes, J.R.; Haken, J.K.,
Gas chromatography of homologous esters. VI. Structure-retention increments of aliphatic esters,
J. Chromatogr., 1974, 101, 1, 103-123, https://doi.org/10.1016/S0021-9673(01)94737-5
. [all data]
Mira and Sanchez, 1970
Mira, J.M.; Sanchez, L.G.,
Polarity of the Gas Chromatographic Stationary Phases and Retention Indices of Aliphatic Esters, Ketones and Alcohols,
Anal. Chim. Acta., 1970, 50, 2, 315-321, https://doi.org/10.1016/0003-2670(70)80071-X
. [all data]
Brown, Chapman, et al., 1968
Brown, I.; Chapman, I.L.; Nicholson, G.J.,
Gas chromatography of polar solutes in electron acceptor stationary phases,
Aust. J. Chem., 1968, 21, 5, 1125-1141, https://doi.org/10.1071/CH9681125
. [all data]
Wehrli and Kováts, 1959
Wehrli, A.; Kováts, E.,
Gas-chromatographische Charakterisierung ogranischer Verbindungen. Teil 3: Berechnung der Retentionsindices aliphatischer, alicyclischer und aromatischer Verbindungen,
Helv. Chim. Acta, 1959, 7, 7, 2709-2736, https://doi.org/10.1002/hlca.19590420745
. [all data]
Rembold, Wallner, et al., 1989
Rembold, H.; Wallner, P.; Nitz, S.; Kollmannsberger, H.; Drawert, F.,
Volatile components of chickpea (Cicer arietinum L.) seed,
J. Agric. Food Chem., 1989, 37, 3, 659-662, https://doi.org/10.1021/jf00087a018
. [all data]
Ohnishi and Shibamoto, 1984
Ohnishi, S.; Shibamoto, T.,
Volatile compounds from heated beef fat and beef fat with glycine,
J. Agric. Food Chem., 1984, 32, 5, 987-992, https://doi.org/10.1021/jf00125a008
. [all data]
SGE, 2005
SGE,
Guide to GC column selection, 2005, retrieved from http://www.sge.com/htm/support/productselection/prodselgc.asp. [all data]
Castello, Timossi, et al., 1988
Castello, G.; Timossi, A.; Gerbino, T.C.,
Gas Chromatographic Separation of Halogenated Compounds on Non-Polar and Polar Wide Bore Capillary Columns,
J. Chromatogr., 1988, 454, 129-143, https://doi.org/10.1016/S0021-9673(00)88608-2
. [all data]
Moffat, Stead, et al., 1974
Moffat, A.C.; Stead, A.H.; Smalldon, K.W.,
Optimum use of paper, thin-layer and gas-liquid chromatography for the identification of basic drugs. III. Gas-liquid chromatography,
J. Chromatogr., 1974, 90, 1, 19-33, https://doi.org/10.1016/S0021-9673(01)94770-3
. [all data]
Orav, Kuningas, et al., 1994
Orav, A.; Kuningas, K.; Kailas, T.; Koplimets, E.; Rang, S.,
Effect of adsorption on the retention values in capillary columns coated with OV-225 and PEG 20M,
J. Chromatogr. A, 1994, 659, 1, 143-150, https://doi.org/10.1016/0021-9673(94)85016-X
. [all data]
Kersten and Poole, 1987
Kersten, B.R.; Poole, C.F.,
Influence of concurrent retention mechanisms on the determination of stationary phase selectivity in gas chromatography,
J. Chromatogr., 1987, 399, 1-31, https://doi.org/10.1016/S0021-9673(00)96108-9
. [all data]
Tatsuka, Suekane, et al., 1990
Tatsuka, K.; Suekane, S.; Sakai, Y.; Sumitani, H.,
Volatile constituents of kiwi fruit flowers: simultaneous distillation and extraction versus headspace sampling,
J. Agric. Food Chem., 1990, 38, 12, 2176-2180, https://doi.org/10.1021/jf00102a015
. [all data]
Galt and MacLeod, 1984
Galt, A.M.; MacLeod, G.,
Headspace sampling of cooked beef aroma using Tenax GC,
J. Agric. Food Chem., 1984, 32, 1, 59-64, https://doi.org/10.1021/jf00121a016
. [all data]
Tressl, Friese, et al., 1978
Tressl, R.; Friese, L.; Fendesack, F.; Köppler, H.,
Gas chromatographic--mass spectrometric investigation of hop aroma constituents in beer,
J. Agric. Food Chem., 1978, 26, 6, 1422-1426, https://doi.org/10.1021/jf60220a037
. [all data]
Slizhov and Gavrilenko, 2001
Slizhov, Yu.G.; Gavrilenko, M.A.,
Effect of thermal treatment of poly(ethylene glycol) modified with europium acetylacetonate on its chromatographic properties,
Russ. J. Phys. Chem. (Engl. Transl.), 2001, 75, 6, 1012-1013. [all data]
Methven L., Tsoukka M., et al., 2007
Methven L.; Tsoukka M.; Oruna-Concha M.J.; Parker J.K.; Mottram D.S.,
Influence of sulfur amino acids on the volatile and nonvolatile components of cooked salmon (Salmo salar),
J. Agric. Food Chem., 2007, 55, 4, 1427-1436, https://doi.org/10.1021/jf0625611
. [all data]
Bylaite and Meyer, 2006
Bylaite, E.; Meyer, A.S.,
· Characterisation of volatile aroma compounds of orange juices by three dynamic and static headspace gas chromatography techniques,
Eur. Food Res. Technol., 2006, 222, 1-2, 176-184, https://doi.org/10.1007/s00217-005-0141-8
. [all data]
Osorio, Alarcon, et al., 2006
Osorio, C.; Alarcon, M.; Moreno, C.; Bonilla, A.; Barrios, J.; Garzon, C.; Duque, C.,
Characterization of Odor-Active Volatiles in Champa ( Campomanesia lineatifolia R. P.),
J. Agric. Food Chem., 2006, 54, 2, 509-516, https://doi.org/10.1021/jf052098c
. [all data]
Solina, Baumgartner, et al., 2005
Solina, M.; Baumgartner, P.; Johnson, R.L.; Whitfield, F.B.,
Volatile aroma components of soy protein isolate and acid-hydrolysed vegetable protein,
Food Chem., 2005, 90, 4, 861-873, https://doi.org/10.1016/j.foodchem.2004.06.005
. [all data]
Hierro, de la Hoz, et al., 2004
Hierro, E.; de la Hoz, L.; Ordóñez, J.A.,
Headspace volatile compounds from salted and occasionally smoked dried meats (cecinas) as affected by animal species,
Food Chem., 2004, 85, 4, 649-657, https://doi.org/10.1016/j.foodchem.2003.07.001
. [all data]
Píno, Marbot, et al., 2004
Píno, J.A.; Marbot, R.; Vázquez, C.,
Volatile components of the fruits of Vangueria madagascariensis J. F. Gmel. from Cuba,
J. Essent. Oil Res., 2004, 16, 4, 302-304, https://doi.org/10.1080/10412905.2004.9698727
. [all data]
Siegmund and Murkovic, 2004
Siegmund, B.; Murkovic, M.,
Changes in chemical composition of pumpkin seeds during the roasting process for production of pumpkin seed oil (Part 2: volatile compounds),
Food Chem., 2004, 84, 3, 367-374, https://doi.org/10.1016/S0308-8146(03)00241-3
. [all data]
Bruna, Hierro, et al., 2003
Bruna, J.M.; Hierro, E.M.; de la Hoz, L.; Mottram, D.S.; Fernández, M.; Ordóñez, J.A.,
Changes in selected biochemical and sensory parameters as affected by the superficial inoculation of Penicillium camemberti on dry fermented sausages,
Int. J. Food Microbiol., 2003, 85, 1-2, 111-125, https://doi.org/10.1016/S0168-1605(02)00505-6
. [all data]
Censullo, Jones, et al., 2003
Censullo, A.C.; Jones, D.R.; Wills, M.T.,
Speciation of the volatile organic compounds (VOCs) in solventborne aerosol coatings by solid phase microextraction-gas chromatography,
J. Coat. Technol., 2003, 75, 936, 47-53, https://doi.org/10.1007/BF02697922
. [all data]
Pino, Almora, et al., 2003
Pino, J.; Almora, K.; Marbot, R.,
Volatile components of papaya (Carica papaya L., maradol variety) fruit,
Flavour Fragr. J., 2003, 18, 6, 492-496, https://doi.org/10.1002/ffj.1248
. [all data]
Pino, Marbot, et al., 2003
Pino, J.; Marbot, R.; Rosado, A.; Vázquez, C.,
Volatile constituents of fruits of Garcinia dulcis Kurz. from Cuba,
Flavour Fragr. J., 2003, 18, 4, 271-274, https://doi.org/10.1002/ffj.1187
. [all data]
Xu, van Stee, et al., 2003
Xu, X.; van Stee, L.L.P.; Williams, J.; Beens, J.; Adahchour, M.; Vreuls, R.J.J.; Brinkman, U.A.Th.; Lelieveld, J.,
Comprehensive two-dimensional gas chromatography (GC×GC) measurements of volatile organic compounds in the atmosphere,
Atmos. Chem. Phys., 2003, 3, 3, 665-682, https://doi.org/10.5194/acp-3-665-2003
. [all data]
Elmore, Campo, et al., 2002
Elmore, J.S.; Campo, M.M.; Enser, M.; Mottram, D.S.,
Effect of lipid composition on meat-like model systems containing cysteine, ribose, and polyunsaturated fatty acids,
J. Agric. Food Chem., 2002, 50, 5, 1126-1132, https://doi.org/10.1021/jf0108718
. [all data]
Pino, Marbot, et al., 2002
Pino, J.A.; Marbot, R.; Bello, A.,
Volatile compounds of Psidium salutare (H.B.K.) Berg. fruit,
J. Agric. Food Chem., 2002, 50, 18, 5146-5148, https://doi.org/10.1021/jf0116303
. [all data]
Pino, Marbot, et al., 2002, 2
Pino, J.A.; Marbot, R.; Vázquez, C.,
Characterization of volatile in Cosa Rican Guava [Psidium friedrichsthalianum (Berg) Niedenzu] fruit,
J. Agric. Food Chem., 2002, 50, 21, 6023-6026, https://doi.org/10.1021/jf011456i
. [all data]
Ames, Guy, et al., 2001
Ames, J.M.; Guy, R.C.E.; Kipping, G.J.,
Effect of pH and temperature on the formation of volatile compounds in cysteine/reducing sugar/starch mixtures during extrusion cooking,
J. Agric. Food Chem., 2001, 49, 4, 1885-1894, https://doi.org/10.1021/jf0012547
. [all data]
Bruna, Hierro, et al., 2001
Bruna, J.M.; Hierro, E.M.; de la Hoz, L.; Mottram, D.S.; Fernández, M.; Ordóñez, J.A.,
The contribution of Penicillium aurantiogriseum to the volatile composition and sensory quality of dry fermented sausages,
Meat Sci., 2001, 59, 1, 97-107, https://doi.org/10.1016/S0309-1740(01)00058-4
. [all data]
Larráyoz, Addis, et al., 2001
Larráyoz, P.; Addis, M.; Gauch, R.; Bosset, J.O.,
Comparison of dynamic headspace and simultaneous distillation extraction techniques used for the analysis of the volatile components in three European PDO ewes milk cheeses,
Int. Dairy J., 2001, 11, 11-12, 911-926, https://doi.org/10.1016/S0958-6946(01)00144-3
. [all data]
Pino and Marbot, 2001
Pino, J.A.; Marbot, R.,
Volatile flavor constituents of acerola (Malpighia emarginata DC.) fruit,
J. Agric. Food Chem., 2001, 49, 12, 5880-5882, https://doi.org/10.1021/jf010270g
. [all data]
Pino, Marbot, et al., 2001
Pino, J.A.; Marbot, R.; Vázquez, C.,
Characterization of volatiles in strawberry guava (Psidium cattleianum Sabine) fruit,
J. Agric. Food Chem., 2001, 49, 12, 5883-5887, https://doi.org/10.1021/jf010414r
. [all data]
Elmore, Mottram, et al., 2000
Elmore, J.S.; Mottram, D.S.; Hierro, E.,
Two-fibre solid-phase microextraction combined with gas chromatography-mass spectrometry for the analysis of volatile aroma compounds in cooked pork,
J. Chromatogr. A, 2000, 905, 1-2, 233-240, https://doi.org/10.1016/S0021-9673(00)00990-0
. [all data]
Moio, Piombino, et al., 2000
Moio, L.; Piombino, P.; Addeo, F.,
Odour-impact compounds of Gorgonzola cheese,
J. Dairy Res., 2000, 67, 2, 273-285, https://doi.org/10.1017/S0022029900004106
. [all data]
Valero, Sanz, et al., 1999
Valero, E.; Sanz, J.; Martinez-Castro, I.,
Volatile components in microwave- and conventionally-heated milk,
Food Chem., 1999, 66, 3, 333-338, https://doi.org/10.1016/S0308-8146(99)00069-2
. [all data]
Aaslyng, Elmore, et al., 1998
Aaslyng, M.D.; Elmore, J.S.; Mottram, D.S.,
Comparison of the aroma characteristics of acid-hydrolyzed and enzyme-hydrolyzed vegetable proteins produced from soy,
J. Agric. Food Chem., 1998, 46, 12, 5225-5231, https://doi.org/10.1021/jf9806816
. [all data]
Verdier-Metz., Coulon, et al., 1998
Verdier-Metz., I.; Coulon, J.-B.; PPradel, P.; Viallon, C.; Berdague, J.-L.,
Effect of forage conservation (hay or silage) and cow breed on the coagulation properties of milks and on the characteristics of ripened cheeses,
J. Dairy Res., 1998, 65, 1, 9-21, https://doi.org/10.1017/S0022029997002616
. [all data]
Li, Wang, et al., 1998
Li, W.; Wang, H.; Sun, Y.; Huang, A.; Sun, Y.,
Capillary gas chromatographic analysis of volatile components in goat feces,
Fenxi Huaxue, 1998, 26, 8, 935-939. [all data]
Madruga and Mottram, 1998
Madruga, M.S.; Mottram, D.S.,
The effect of pH on the formation of volatile compounds produced by heating a model system containing 5'-imp and cysteine,
J. Braz. Chem. Soc., 1998, 9, 3, 261-271, https://doi.org/10.1590/S0103-50531998000300010
. [all data]
Moio and Addeo, 1998
Moio, L.; Addeo, F.,
Grana Padano cheese aroma,
J. Dairy Res., 1998, 65, 2, 317-333, https://doi.org/10.1017/S0022029997002768
. [all data]
Bartelt, 1997
Bartelt, R.J.,
Calibration of a commercial solid-phase microextraction device for measuring headspace concentrations of organic volatiles,
Anal. Chem., 1997, 69, 3, 364-372, https://doi.org/10.1021/ac960820n
. [all data]
Misharina, Golovnya, et al., 1992
Misharina, T.A.; Golovnya, R.V.; Artamonova, M.P.; Zhuravskaya, N.K.,
Identification of volatile components of a model system with meat aroma,
Zh. Anal. Khim., 1992, 47, 850-857. [all data]
Misharina, Aerove, et al., 1991
Misharina, T.A.; Aerove, A.F.; Golovnya, R.E.; Kalugina, V.I.; Rogovskaya, L.V.; Vysotskaya, L.E.; Shevtsov, V.K.,
Identification of volatile components of an aromatizer with a chicken odor by chromatography-mass spectrometry and chromatography-fourier transform infrared spectroscopy,
J. Anal. Chem. USSR (Engl. Transl.), 1991, 8, 1187-1193. [all data]
Wu, Kuo, et al., 1991
Wu, P.; Kuo, M.-C.; Hartman, T.G.; Rosen, R.T.; Ho, C.-T.,
Free and glycosidically bound aroma compounds in pineapple (Ananas comosus L. Merr.),
J. Agric. Food Chem., 1991, 39, 1, 170-172, https://doi.org/10.1021/jf00001a033
. [all data]
Guichard and Souty, 1988
Guichard, E.; Souty, M.,
Comparison of the relative quantities of aroma compounds found in fresh apricot (Prunus armeniaca) from six different varieties,
Z. Lebensm. Unters. Forsch., 1988, 186, 4, 301-307, https://doi.org/10.1007/BF01027031
. [all data]
Hendriks and Bruins, 1983
Hendriks, H.; Bruins, A.P.,
A tentative identification of components in the essential oil of Cannabis sativa L. by a combination of gas chromatography negative ion chemical ionization mass spectrometry and retention indices,
Biomed. Mass Spectrom., 1983, 10, 6, 377-381, https://doi.org/10.1002/bms.1200100607
. [all data]
Bonaiti, Irlinger, et al., 2005
Bonaiti, C.; Irlinger, F.; Spinnler, H.E.; Engel, E.,
An iterative sensory procedure to select odor-active associations in complex consortia of microorganisms: application to the construction of a cheese model,
J. Dairy Sci., 2005, 88, 5, 1671-1684, https://doi.org/10.3168/jds.S0022-0302(05)72839-3
. [all data]
Boscaini, van Ruth, et al., 2003
Boscaini, E.; van Ruth, S.; Biasioli, F.; Gasperi, F.; Märk, T.D.,
Gas chromatography-olfactometry (GC-O) and proton transfer reaction-mass spectrometry (PTR-MS) analysis of the flavor profile of grana padano, parmigiano reggiano, and grana trentino cheeses,
J. Agric. Food Chem., 2003, 51, 7, 1782-1790, https://doi.org/10.1021/jf020922g
. [all data]
Carrapiso, Ventanas, et al., 2002
Carrapiso, A.I.; Ventanas, J.; García, C.,
Characterization of the most odor-active compounds of Iberian ham headspace,
J. Agric. Food Chem., 2002, 50, 7, 1996-2000, https://doi.org/10.1021/jf011094e
. [all data]
Elmore, Mottram, et al., 2000, 2
Elmore, J.S.; Mottram, D.S.; Enser, M.; Wood, J.D.,
The effects of diet and breed on the volatile compounds of cooked lamb,
Meat Sci., 2000, 55, 2, 149-159, https://doi.org/10.1016/S0309-1740(99)00137-0
. [all data]
Elmore, Mottram, et al., 1999
Elmore, J.S.; Mottram, D.S.; Enser, M.; Wood, J.D.,
Effect of the polyunsaturated fatty acid composition of beef muscle on the profile of aroma volatiles,
J. Agric. Food Chem., 1999, 47, 4, 1619-1625, https://doi.org/10.1021/jf980718m
. [all data]
Owens J.D., Allagheny N., et al., 1997
Owens J.D.; Allagheny N.; Kipping G.; Ames J.M.,
Formation of volatile compounds during Bacillus subtilis fermentation of soya beans,
J. Sci. Food Agric., 1997, 74, 1, 132-140, https://doi.org/10.1002/(SICI)1097-0010(199705)74:1<132::AID-JSFA779>3.0.CO;2-8
. [all data]
Maignial, Pibarot, et al., 1992
Maignial, L.; Pibarot, P.; Bonetti, G.; Chaintreau, A.; Marion, J.P.,
Simultaneous distillation-extraction under static vacuum: isolation of volatile compounds at room temperature,
J. Chromatogr., 1992, 606, 1, 87-94, https://doi.org/10.1016/0021-9673(92)85260-Z
. [all data]
Wu, Zorn, et al., 2007
Wu, S.; Zorn, H.; Krings, U.; Berger, R.G.,
Volatiles from submerged and surface-cultured beefsteak fungus, Fistulina hepatica,
Flavour Fragr. J., 2007, 22, 1, 53-60, https://doi.org/10.1002/ffj.1758
. [all data]
Mahadevan and Farmer, 2006
Mahadevan, K.; Farmer, L.,
Key Odor Impact Compounds in Three Yeast Extract Pastes,
J. Agric. Food Chem., 2006, 54, 19, 7242-7250, https://doi.org/10.1021/jf061102x
. [all data]
Alasalvar, Taylor, et al., 2005
Alasalvar, C.; Taylor, K.D.A.; Shahidi, F.,
Comparison of volatiles of cultured and wild sea bream (Sparus aurata) during storage in ice by dynamic headspace analysis/gas chromatography-mass spectrometry,
J. Agric. Food Chem., 2005, 53, 7, 2616-2622, https://doi.org/10.1021/jf0483826
. [all data]
Elmore, Nisyrios, et al., 2005
Elmore, J.S.; Nisyrios, I.; Mottram, D.S.,
Analysis of the headspace aroma compounds of walnuts (Juglans regia L.),
Flavour Fragr. J., 2005, 20, 5, 501-506, https://doi.org/10.1002/ffj.1477
. [all data]
Malliaa, Fernandez-Garcia, et al., 2005
Malliaa, S.; Fernandez-Garcia, E.; Bosset, J.O.,
Comparison of purge and trap and solid phase microextraction techniques for studying the volatile aroma compounds of three European PDO hard cheeses,
Int. Dairy J., 2005, 15, 6-9, 741-758, https://doi.org/10.1016/j.idairyj.2004.11.007
. [all data]
Ménager, Jost, et al., 2004
Ménager, I.; Jost, M.; Aubert, C.,
Changes in physicochemical characteristics and volatile constituents of strawberry (Cv. Cigaline) during maturation,
J. Agric. Food Chem., 2004, 52, 5, 1248-1254, https://doi.org/10.1021/jf0350919
. [all data]
Shimoda, Yoshimura, et al., 2001
Shimoda, M.; Yoshimura, Y.; Yoshimura, T.; Noda, K.; Osajima, Y.,
Volatile flavor compounds of sweetened condensed milk,
J. Food Sci., 2001, 66, 6, 804-807, https://doi.org/10.1111/j.1365-2621.2001.tb15176.x
. [all data]
Ott, Fay, et al., 1997
Ott, A.; Fay, L.B.; Chaintreau, A.,
Determination and origin of the aroma impact compounds of yogurt flavor,
J. Agric. Food Chem., 1997, 45, 3, 850-858, https://doi.org/10.1021/jf960508e
. [all data]
Shimoda, Peralta, et al., 1996
Shimoda, M.; Peralta, R.R.; Osajima, Y.,
Headspace gas analysis of fish sauce,
J. Agric. Food Chem., 1996, 44, 11, 3601-3605, https://doi.org/10.1021/jf960345u
. [all data]
Shimoda, Wu, et al., 1996
Shimoda, M.; Wu, Y.; Osajima, Y.,
Aroma compounds from aqueous solution of Haze (Rhus succedanea) honey determined by adsorptive column chromatography,
J. Agric. Food Chem., 1996, 44, 12, 3913-3918, https://doi.org/10.1021/jf9601168
. [all data]
Iwaoka, Hagi, et al., 1994
Iwaoka, W.; Hagi, Y.; Umano, K.; Shibamoto, T.,
Volatile chemicals identified in fresh and cooked breadfruit,
J. Agric. Food Chem., 1994, 42, 4, 975-976, https://doi.org/10.1021/jf00040a026
. [all data]
Shiratsuchi, Shimoda, et al., 1994
Shiratsuchi, H.; Shimoda, M.; Imayoshi, K.; Noda, K.; Osajima, Y.,
Volatile flavor compounds in spray-dried skim milk powder,
J. Agric. Food Chem., 1994, 42, 4, 984-988, https://doi.org/10.1021/jf00040a028
. [all data]
Sumitani, Suekane, et al., 1994
Sumitani, H.; Suekane, S.; Nakatani, A.; Tatsuka, K.,
Changes in composition of volatile compounds in high pressure treated peach,
J. Agric. Food Chem., 1994, 42, 3, 785-790, https://doi.org/10.1021/jf00039a037
. [all data]
Frohlich and Schreier, 1990
Frohlich, O.; Schreier, P.,
Volatile Constituents of Loquat (Eriobotrya japonica Lindl.) Fruit,
J. Food Sci., 1990, 55, 1, 176-180, https://doi.org/10.1111/j.1365-2621.1990.tb06046.x
. [all data]
Matiella and Hsieh, 1990
Matiella, J.E.; Hsieh, T.C.-Y.,
Analysis of crabmeat volatile compounds,
J. Food Sci., 1990, 55, 4, 962-966, https://doi.org/10.1111/j.1365-2621.1990.tb01575.x
. [all data]
Fröhlich, Duque, et al., 1989
Fröhlich, O.; Duque, C.; Schreier, P.,
Volatile constituents of curuba (Passiflora mollissima) fruit,
J. Agric. Food Chem., 1989, 37, 2, 421-425, https://doi.org/10.1021/jf00086a033
. [all data]
Tanchotikul and Hsieh, 1989
Tanchotikul, U.; Hsieh, T.C.-Y.,
Volatile Flavor Components in Crayfish Waste,
J. Food Sci., 1989, 54, 6, 1515-1520, https://doi.org/10.1111/j.1365-2621.1989.tb05149.x
. [all data]
Chen, Kuo, et al., 1982
Chen, C.-C.; Kuo, M.-C.; Hwang, L.S.; Wu, J.S.-B.; Wu, C.-M.,
Headspace components of passion fruit juice,
J. Agric. Food Chem., 1982, 30, 6, 1211-1215, https://doi.org/10.1021/jf00114a052
. [all data]
Bianchi, Cantoni, et al., 2007
Bianchi, F.; Cantoni, C.; Careri, M.; Chiesa, L.; Musci, M.; Pinna, A.,
Characterization of the aromatic profile for the authentication and differentiation of typical Italian dry-sausages,
Talanta, 2007, 72, 4, 1552-1563, https://doi.org/10.1016/j.talanta.2007.02.019
. [all data]
Bianchi, Careri, et al., 2007
Bianchi, F.; Careri, M.; Mangia, A.; Musci, M.,
Retention indices in the analysis of food aroma volatile compounds in temperature-programmed gas chromatography: Database creation and evaluation of precision and robustness,
J. Sep. Sci., 2007, 39, 4, 563-572, https://doi.org/10.1002/jssc.200600393
. [all data]
Verzera, Ziino, et al., 2004
Verzera, A.; Ziino, M.; Condurso, C.; Romeo, V.; Zappala, M.,
Solid-phase microextraction and gas chromatography-mass spectrometry for rapid characterisation of semi-hard cheeses,
Anal. Bioanal. Chem., 2004, 380, 7-8, 930-936, https://doi.org/10.1007/s00216-004-2879-4
. [all data]
Alasalvar, Shahidi, et al., 2003
Alasalvar, C.; Shahidi, F.; Cadwallader, K.R.,
Comparison of natural and roasted Turkish Tombul hazelnut (Corylus avellana L.) volatiles and flavor by DHA/GC/MS and descriptive sensory analysis,
J. Agric. Food Chem., 2003, 51, 17, 5067-5072, https://doi.org/10.1021/jf0300846
. [all data]
Radovic, Careri, et al., 2001
Radovic, B.S.; Careri, M.; Mangia, A.; Musci, M.; Gerboles, M.; Anklam, E.,
Analytical, nutritional, and clinical methods section. Contribution of dynamic headspace GC-MS analysis of aroma compounds to authenticity testing of honey,
Food Chem., 2001, 72, 4, 511-520, https://doi.org/10.1016/S0308-8146(00)00263-6
. [all data]
Baek and Cadwallader, 1996
Baek, H.H.; Cadwallader, K.R.,
Volatile compounds in flavor concentrates produced from crayfish-processing byproducts with and without protease treatment,
J. Agric. Food Chem., 1996, 44, 10, 3262-3267, https://doi.org/10.1021/jf960023q
. [all data]
Tello, Lebron-Aguilar, et al., 2009
Tello, A.M.; Lebron-Aguilar, R.; Quintanilla-Lopez, J.E.; Santiuste, J.M.,
Isothermal retention indices on poly93-cyanopropylmethyl)siloxane stationary phases,
J. Chromatogr. A, 2009, 1216, 10, 1630-1639, https://doi.org/10.1016/j.chroma.2008.10.025
. [all data]
Lebrón-Aguilar, Quintanilla-López, et al., 2007
Lebrón-Aguilar, R.; Quintanilla-López, J.E.; Tello, A.M.; Santiuste, J.M.,
Isothermal retention indices on poly (3,3,3-trifluoropropylmethylsiloxane) stationary phases,
J. Chromatogr. A, 2007, 1160, 1-2, 276-288, https://doi.org/10.1016/j.chroma.2007.05.025
. [all data]
Amboni, Junkes, et al., 2002
Amboni, R.D.DeM.C.; Junkes, B. daS.; Yunes, R.A.; Heinzen, V.E.F.,
Quantitative structure-property relationships study of chromatographic retention indices and normal boiling points for oxo compounds using the semi-empirical topological method,
J. Mol. Struct. (Theochem), 2002, 586, 1-3, 71-80, https://doi.org/10.1016/S0166-1280(02)00062-3
. [all data]
Kurdina, Markovich, et al., 1969
Kurdina, Z.G.; Markovich, V.E.; Sakharov, V.M.,
Gas chromatography of cyclic O-containing compounds
in Gas chromatography, Issue # 10, NIITEKhim, Moscow, 1969, 128-133. [all data]
Anderson, 1968
Anderson, D.G.,
USe of Kovats retention indices and response factors for the qualitative and quantitative analysis of coating solvents,
J. Paint Technol., 1968, 40, 527, 549-557. [all data]
Goeminne, Vandendriessche, et al., 2012
Goeminne, P.C.; Vandendriessche, T.; Van Eldere, J.; Nicolai, B.M.; Hertog, M.L.; Dupont, L.J.,
Detection of Pseudomonas aeruginosa in sputum headspace through volatile organic compound analysis,
Respiratory Res., 2012, 13, 87, 1-9. [all data]
Cais-Sokolinska, Majcher, et al., 2011
Cais-Sokolinska, D.; Majcher, M.; Pikul, J.; Bielinska, S.; Czauderma, M.; Wojtowski, J.,
The effect of Camelia sativa cake diet supplementation on sensory and volatile profiles of ewe's milk,
African J. Biotechnol., 2011, 10, 37, 7245-7252. [all data]
Leffingwell and Alford, 2011
Leffingwell, J.; Alford, E.D.,
Volatile constituents of the giant pufball mushroom (Calvatia gigantea),
Leffingwell Rep., 2011, 4, 1-17. [all data]
Zenkevich, Eliseenkov, et al., 2011
Zenkevich, I.G.; Eliseenkov, E.V.; Kasatochkin, A.N.; Zhakovskaya, Z.A.; Khoroshko, L.O.,
Gas chromatographic identification of chlorination products of aliphatic ketones,
J. Chromatogr., 2011, 1218, 21, 3291-3299, https://doi.org/10.1016/j.chroma.2010.12.056
. [all data]
Kumazawa, Itobe, et al., 2008
Kumazawa, K.; Itobe, T.; Nishimura, O.; Hamaguchi, T.,
A new approach to estimate the in-mouth release characteristics of odorants in chewing gum,
Food Science and Technology Research, 2008, 14, 3, 269-276, https://doi.org/10.3136/fstr.14.269
. [all data]
Mildner-Szkudlarz and Jelen, 2008
Mildner-Szkudlarz, S.; Jelen, H.H.,
The potential of different techniques for volatile compounds analysis coupled with PCA for the detection of the adulteration of olive oil with hazelnut oil,
Food Chem., 2008, 110, 3, 751-761, https://doi.org/10.1016/j.foodchem.2008.02.053
. [all data]
Ramirez R. and Cava R., 2007
Ramirez R.; Cava R.,
Volatile profiles of dry-cured meat products from three different Iberian x Duroc genotypes,
J. Agric. Food Chem., 2007, 55, 5, 1923-1931, https://doi.org/10.1021/jf062810l
. [all data]
Vasta, Ratel, et al., 2007
Vasta, V.; Ratel, J.; Engel, E.,
Mass Spectrometry Analysis of Volatile Compounds in Raw Meat for the Authentication of the Feeding Background of Farm Animals,
J. Agric. Food Chem., 2007, 55, 12, 4630-4639, https://doi.org/10.1021/jf063432n
. [all data]
Berlioz, Cordella, et al., 2006
Berlioz, B.; Cordella, C.; Cavalli, J.-F.; Lizzani-Cuvelier, L.; Loiseau, A.-M.; Fernandez, X.,
Comparison of the amounts of volatile compounds in French protected designation of origin virgin olive oils,
J. Agric. Food Chem., 2006, 54, 26, 10092-10101, https://doi.org/10.1021/jf061796+
. [all data]
Fadel, Mageed, et al., 2006
Fadel, H.H.M.; Mageed, M.A.A.; Lotfy, S.N.,
Quality and flavour stability of coffee substitute prepared by extrusion of wheat germ and chicory roots,
Amino Acids, 2006, https://doi.org/10.1007/s007260200008
. [all data]
Fadel, Mageed, et al., 2006, 2
Fadel, H.H.M.; Mageed, M.A.A.; Samad, A.K.M.E.A.; Lotfy, S.N.,
Cocoa substitute: Evaluation of sensory qualities and flavour stability,
Eur. Food Res. Technol., 2006, 223, 1, 125-131, https://doi.org/10.1007/s00217-005-0162-3
. [all data]
Isidorov, Purzynska, et al., 2006
Isidorov, V.; Purzynska, A.; Modzelewska, A.; Serowiecka, M.,
Distribution coefficients of aliphatic alcohols, carbonyl compounds and esters between air and Carboxen/polydimethylsiloxane fiber coating,
Anal. Chim. Acta., 2006, 560, 1-2, 103-109, https://doi.org/10.1016/j.aca.2005.12.043
. [all data]
Pino, Marquez, et al., 2006
Pino, J.A.; Marquez, E.; Marbot, R.,
Volatile constituents from tea of roselle (Hibiscus sabdariffa L.),
Rev. CENIC Ciencias Quimicas, 2006, 37, 3, 127-129. [all data]
Fan and Qian, 2005
Fan, W.; Qian, M.C.,
Headspace Solid Phase Microextraction and Gas Chromatography-Olfactometry Dilution Analysis of Young and Aged Chinese Yanghe Daqu Liquors,
J. Agric. Food Chem., 2005, 53, 20, 7931-7938, https://doi.org/10.1021/jf051011k
. [all data]
Krist, Stuebiger, et al., 2005
Krist, S.; Stuebiger, G.; Unterweger, H.; Bandion, F.; Buchbauer, G.,
Analysis of volatile compounds and triglycerides of seed oils extracted from different poppy varieties (Papaver somniferum L.),
J. Agric. Food Chem., 2005, 53, 21, 8310-8316, https://doi.org/10.1021/jf0580869
. [all data]
van Loon, Linssen, et al., 2005
van Loon, W.A.M.; Linssen, J.P.H.; Legger, A.; Posthumus, M.A.; Voragen, A.G.J.,
Identification and olfactometry of French fries flavour extracted at mouth conditions,
Food Chem., 2005, 90, 3, 417-425, https://doi.org/10.1016/j.foodchem.2004.05.005
. [all data]
Cavalli, Fernandez, et al., 2004
Cavalli, J.-F.; Fernandez, X.; Lizzani-Cievelier, L.; Loiseau, A.-M.,
Characterization of volatile compounds of French and Spanish virgin olive oil by HS-SPME: identification of quality-freshness markers,
Food Chem., 2004, 88, 1, 151-157, https://doi.org/10.1016/j.foodchem.2004.04.003
. [all data]
Vichi, Pizzale, et al., 2003
Vichi, S.; Pizzale, L.; Conte, L.S.; Buxaderas, S.; López-Tamames, E.,
Solid-phase microextraction in the analysis of virgin olive oil volatile fraction: characterization of virgin olive oils from two distinct geographical areas of Northern Italy,
J. Agric. Food Chem., 2003, 51, 22, 6572-6577, https://doi.org/10.1021/jf030269c
. [all data]
Pérès, Begnaud, et al., 2002
Pérès, C.; Begnaud, F.; Berdagué, J.-L.,
Fast characterization of Camembert cheeses by static headspace-mass spectrometry,
Sens. Actuators, 2002, 87, 3, 491-497, https://doi.org/10.1016/S0925-4005(02)00298-8
. [all data]
Joffraud, Leroi, et al., 2001
Joffraud, J.J.; Leroi, F.; Roy, C.; Berdagué, J.L.,
Characterisation of volatile compounds produced by bacteria isolated from the spoilage flora of cold-smoked salmon,
Int. J. Food Microbiol., 2001, 66, 3, 175-184, https://doi.org/10.1016/S0168-1605(00)00532-8
. [all data]
García, Martín, et al., 2000
García, C.; Martín, A.; Timón, M.L.; Córdoba, J.J.,
Microbial populations and volatile compounds in the 'bone taint' spoilage of dry cured ham,
Lett. Appl. Microbiol., 2000, 30, 1, 61-66, https://doi.org/10.1046/j.1472-765x.2000.00663.x
. [all data]
Tamura, Boonbumrung, et al., 2000
Tamura, H.; Boonbumrung, S.; Yoshizawa, T.; Varanyanond, W.,
Volatile components of the essential oil in the pulp of four yellow mangoes (Mangifera indica L.) in Thailand,
Food Sci. Technol. Res., 2000, 6, 1, 68-73, https://doi.org/10.3136/fstr.6.68
. [all data]
Vendramini and Trugo, 2000
Vendramini, A.L.; Trugo, L.C.,
Chemical composition of acerola fruit (Malpighia punicifolia L.) at three stages of maturity,
Food Chem., 2000, 71, 2, 195-198, https://doi.org/10.1016/S0308-8146(00)00152-7
. [all data]
Meynier, Novelli, et al., 1999
Meynier, A.; Novelli, E.; Chissolinim, R.; Zanardi, E.; Gandemer, G.,
Volatile compounds of commercial Milano salami,
Meat Sci., 1999, 51, 2, 175-183, https://doi.org/10.1016/S0309-1740(98)00122-3
. [all data]
Ding, Deng, et al., 1998
Ding, Q.; Deng, Y.; Sun, Y.; Huagn, A.; Sun, Y.,
Analysis of volatile components in ox feces by capillary gas chromatography,
Beijing Daxue Xuebao Ziran Kexueban, 1998, 34, 6, 720-725. [all data]
Tai and Ho, 1998
Tai, C.-Y.; Ho, C.-T.,
Influence of glutathione oxidation and pH on thermal formation of Maillard-type volatile compounds,
J. Agric. Food Chem., 1998, 46, 6, 2260-2265, https://doi.org/10.1021/jf971111t
. [all data]
Robacker and Bartelt, 1997
Robacker, D.C.; Bartelt, R.J.,
Chemicals attractive to Mexican fruit fly from Klebsiella pneumoniae and Citrobacter freundii cultures sampled by solid-phase microextraction MICROEXTRACTION,
J. Chem. Ecol., 1997, 23, 12, 2897-2915, https://doi.org/10.1023/A:1022579414233
. [all data]
Larsen and Frisvad, 1995
Larsen, T.O.; Frisvad, J.C.,
Characterization of volatile metabolites from 47 Penicillium taxa,
Mycol. Res., 1995, 99, 10, 1153-1166, https://doi.org/10.1016/S0953-7562(09)80271-2
. [all data]
King, Hamilton, et al., 1993
King, M.-F.; Hamilton, B.L.; Matthews, M.A.; Rule, D.C.; Field, R.A.,
Isolation and identification of volatiles and condensable material in raw beef with supercritical carbon dioxide extraction,
J. Agric. Food Chem., 1993, 41, 11, 1974-1981, https://doi.org/10.1021/jf00035a030
. [all data]
Shiota, 1993
Shiota, H.,
New esteric components in the volatiles of banana fruit (Musa sapientum L.),
J. Agric. Food Chem., 1993, 41, 11, 2056-2062, https://doi.org/10.1021/jf00035a046
. [all data]
Lee, Macku, et al., 1991
Lee, S.-R.; Macku, C.; Shibamoto, T.,
Isolation and identification of headspace volatiles formed in heated butter,
J. Agric. Food Chem., 1991, 39, 11, 1972-1975, https://doi.org/10.1021/jf00011a017
. [all data]
Macku and Shibamoto, 1991
Macku, C.; Shibamoto, T.,
Headspace volatile compounds formed from heated corn oil and corn oil with glycine,
J. Agric. Food Chem., 1991, 39, 7, 1265-1269, https://doi.org/10.1021/jf00007a014
. [all data]
Macku and Shibamoto, 1991, 2
Macku, C.; Shibamoto, T.,
Volatile sulfur-containing compounds generated from the thermal interaction of corn oil and cysteine,
J. Agric. Food Chem., 1991, 39, 11, 1987-1989, https://doi.org/10.1021/jf00011a021
. [all data]
Anker, Jurs, et al., 1990
Anker, L.S.; Jurs, P.C.; Edwards, P.A.,
Quantitative structure-retention relationship studies of odor-active aliphatic compounds with oxygen-containing functional groups,
Anal. Chem., 1990, 62, 24, 2676-2684, https://doi.org/10.1021/ac00223a006
. [all data]
Binder, Turner, et al., 1990
Binder, R.G.; Turner, C.E.; Flath, R.A.,
Volatile components of purple starthistle,
J. Agric. Food Chem., 1990, 38, 4, 1053-1055, https://doi.org/10.1021/jf00094a030
. [all data]
Spadone, Takeoka, et al., 1990
Spadone, J.-C.; Takeoka, G.; Liardon, R.,
Analytical Investigation of Rio Off-Flavor in Green Coffee,
J. Agric. Food Chem., 1990, 38, 1, 226-233, https://doi.org/10.1021/jf00091a050
. [all data]
Buttery, Xu, et al., 1985
Buttery, R.G.; Xu, C.; Ling, L.C.,
Volatile components of wheat leaves (and stems): Possible insect attractants,
J. Agric. Food Chem., 1985, 33, 1, 115-117, https://doi.org/10.1021/jf00061a033
. [all data]
Habu, Flath, et al., 1985
Habu, T.; Flath, R.A.; Mon, T.R.; Morton, J.F.,
Volatile components of Rooibos tea (Aspalathus linearis),
J. Agric. Food Chem., 1985, 33, 2, 249-254, https://doi.org/10.1021/jf00062a024
. [all data]
del Rosario, de Lumen, et al., 1984
del Rosario, R.; de Lumen, B.O.; Habu, T.; Flath, R.A.; Mon, T.R.; Teranishi, R.,
Comparison of headspace volatiles from winged beans and soybeans,
J. Agric. Food Chem., 1984, 32, 5, 1011-1015, https://doi.org/10.1021/jf00125a015
. [all data]
Labropoulos, Palmer, et al., 1982
Labropoulos, A.E.; Palmer, J.K.; Tao, P.,
Flavor evaluation and characterization of yogurt as affected by ultra-high temperature and vat processes,
J. Dairy Sci., 1982, 65, 2, 191-196, https://doi.org/10.3168/jds.S0022-0302(82)82176-0
. [all data]
Alves and Jennings, 1979
Alves, S.; Jennings, W.G.,
Volatile composition of certain Amazonian fruits,
Food Chem., 1979, 4, 2, 149-159, https://doi.org/10.1016/0308-8146(79)90039-6
. [all data]
Donetzhuber, Johansson, et al., 1976
Donetzhuber, A.; Johansson, K.; Sandstroem, C.,
Gas phase characterization of wood, pulp, and paper,
Appl. Polymer Symp., 1976, 28, 889-901. [all data]
Fang, Pu, et al., 2012
Fang, S.; Pu, B.; Chen, A.; Kangzhou, Ao; Xu, D.,
A box-behnken design for characterizing Chineser truffles (Tuber indicum) aroma by HS-SPME-GC-MS,
J. Food Res., 2012, 1, 3, 219-229, https://doi.org/10.5539/jfr.v1n3p219
. [all data]
VOC BinBase, 2012
VOC BinBase,
The volatile compound BinBase (VOC BinBase), 2012, retrieved from http://fiehnlab.ucdavis.edu/projects/VocBinBase and http://binbase.sourceforge.net. [all data]
Miyazaki, Plotto, et al., 2011
Miyazaki, T.; Plotto, A.; Goodner, K.; Gmitter F.G.,
Distribution of aroma volatile compounds in tangerine hybrids and proposed inheritance,
J. Sci. Food Agric., 2011, 91, 3, 449-460, https://doi.org/10.1002/jsfa.4205
. [all data]
Skogerson, Wohlgemuth, et al., 2011
Skogerson, K.; Wohlgemuth, G.; Fiehn, O.,
VocBinNase, 2011, retrieved from http://fiehnlab.ucdavis.edu/projects//VocBinBase. [all data]
Pugliese, Sirtori, et al., 2009
Pugliese, C.; Sirtori, F.; Ruiz, J.; Martin, D.; Parenti, S.; Franci, O.,
Effect of pasture on chestnut or acorn on fatty acid composition and aromatic profile of fat of China Senece dry-cured ham,
Gracas y Aceites, 2009, 60, 3, 271-276, https://doi.org/10.3989/gya.130208
. [all data]
Rotsatschakul, Visesanguan, et al., 2009
Rotsatschakul, P.; Visesanguan, W.; Smitinont, T.; Chaiseri, S.,
Changes in volatile compounds during fermentation of nham (Thai fermented sausage),
Int. Food Res. J., 2009, 16, 391-414. [all data]
Chen, 2008
Chen, H.-F.,
Quantitative prediction of gas chromatography retention indices with support vector machines, radial basis neutral networks and multiple linear regression,
Anal. Chim. Acta, 2008, 609, 1, 24-36, https://doi.org/10.1016/j.aca.2008.01.003
. [all data]
Ventanas, Estevez, et al., 2008
Ventanas, S.; Estevez, M.; Andres, A.I.; Ruiz, J.,
Analysis of volatile compounds of Iberian dry-cured loins with different intramuscular fat contents using SPME-DED,
Meat Sci., 2008, 79, 1, 172-180, https://doi.org/10.1016/j.meatsci.2007.08.011
. [all data]
Zhao, Li, et al., 2008
Zhao, Y.; Li, J.; Xu, Y.; Duan, H.; Fan, W.; Zhao, G.,
EXtraction, preparation and identification of volatile compounds in Changyu XO brandy,
Chinese J. Chromatogr., 2008, 26, 2, 212-222, https://doi.org/10.1016/S1872-2059(08)60014-0
. [all data]
Carrapiso and Garsia, 2007
Carrapiso, A.I.; Garsia, C.,
Effect of sampling conditions on the odour-active compounds of iberian ham,
Cienc. Technol. Aliment., 2007, 5, 4, 287-290, https://doi.org/10.1080/11358120709487703
. [all data]
Chen and Feng, 2007
Chen, Y.; Feng, C.,
QSPR study on gas chromatography retention index of some organic pollutants,
Comput. Appl. Chem. (China), 2007, 24, 10, 1404-1408. [all data]
Feng and Mu, 2007
Feng, H.; Mu, L.-L.,
Quantitative structure-retention relationships for alkane and its derivatives based on electrotopological state index and molecular shape index,
Chem. Ind. Engineering (Chinese), 2007, 24, 2, 161-168. [all data]
Liu, Xu, et al., 2007
Liu, Y.; Xu, X.-L.; Zhou, G.-H.,
Comparative study of volatile compounds in traditional Chinese Nanjing marinated duck by different extraction techniques,
Int. J. Food Sci. Technol., 2007, 42, 5, 543-550, https://doi.org/10.1111/j.1365-2621.2006.01264.x
. [all data]
Pellicer, 2007
Pellicer, L.V.,
Comparison of Sensory Characteristics, and Instrumental flavor Compounds Analysis of Milk Produced by Three Proction Methods. A Thesis presented to the Faculty of the Graduate School University of Missouri-Columbia, 2007, retrieved from http://edit.missouri,edu/Winter2007/Theses/ValverdePellicerL-053107-T6722/research.pdf. [all data]
Splivallo, Bossi, et al., 2007
Splivallo, R.; Bossi, S.; Maffei, M.; Bonfante, P.,
Discrimination of truffle fruiting body versus mycelial aromas by stir bar sorptive extraction,
Phytochemistry, 2007, 68, 20, 2584-2598, https://doi.org/10.1016/j.phytochem.2007.03.030
. [all data]
Cramer, Mattinson, et al., 2005
Cramer, A.-C.J.; Mattinson, D.S.; Fellman, J.K.; Baik, B.-K.,
Analysis of volatile compounds from various types of barley cultivars,
J. Agric. Food Chem., 2005, 53, 19, 7526-7531, https://doi.org/10.1021/jf0506939
. [all data]
Thierry, Maillard, et al., 2005
Thierry, A.; Maillard, M.-B.; Bonnarme, P.; Roussel, E.,
The addition of Propionibacterium freudenreichii to raclette cheese induces biochemical changes and enhances flavor development,
J. Agric. Food Chem., 2005, 53, 10, 4157-4165, https://doi.org/10.1021/jf0481195
. [all data]
Garcia-Estaban, Ansorena, et al., 2004
Garcia-Estaban, M.; Ansorena, D.; Astiasaran, I.; Martin, D.; Ruiz, J.,
Comparison of simultaneous distillation extraction (SDE) and solid-phase microextraction (SPME) for the analysis of volatile compounds in dry-cured ham,
J. Sci. Food Agric., 2004, 84, 11, 1364-1370, https://doi.org/10.1002/jsfa.1826
. [all data]
Garcia-Estaban, Ansorena, et al., 2004, 2
Garcia-Estaban, M.; Ansorena, D.; Astiasarán, I.; Ruiz, J.,
Study of the effect of different fiber coatings and extraction conditions on dry cured ham volatile compounds extracted by solid-phase microextraction (SPME),
Talanta, 2004, 64, 2, 458-466, https://doi.org/10.1016/j.talanta.2004.03.007
. [all data]
Junkes, Amboni, et al., 2004
Junkes, B.S.; Amboni, R.D.M.C.; Yunes, R.A.; Heinzen, V.E.F.,
Application of the semi-empirical topological index in quantitative structure-chromatographic retention relationship (QSRR) studies of aliphatic ketones and aldehydes on stationary phases of different polarity,
J. Braz. Chem. Soc., 2004, 15, 2, 183-189, https://doi.org/10.1590/S0103-50532004000200005
. [all data]
Vinogradov, 2004
Vinogradov, B.A.,
Production, composition, properties and application of essential oils, 2004, retrieved from http://viness.narod.ru. [all data]
Begnaud, Pérès, et al., 2003
Begnaud, F.; Pérès, C.; Berdagué, J.-L.,
Characterization of volatile effluents of livestock buildings by solid-phase microextraction,
Int. J. Environ. Anal. Chem., 2003, 83, 10, 837-849, https://doi.org/10.1080/03067310310001603349
. [all data]
Jordán, Margaría, et al., 2003
Jordán, M.J.; Margaría, C.A.; Shaw, P.E.; Goodner, K.L.,
Volatile components and aroma active compounds in aqueous essence and fresh pink guava fruid puree (Psidium guajava L.) by GC-MS and multidimensional GC/GC-O,
J. Agric. Food Chem., 2003, 51, 5, 1421-1426, https://doi.org/10.1021/jf020765l
. [all data]
Junkes, Castanho, et al., 2003
Junkes, B.S.; Castanho, R.D.M.; Amboni, C.; Yunes, R.A.; Heinzen, V.E.F.,
Semiempirical Topological Index: A Novel Molecular Descriptor for Quantitative Structure-Retention Relationship Studies,
Internet Electronic Journal of Molecular Design, 2003, 2, 1, 33-49. [all data]
Machiels, van Ruth, et al., 2003
Machiels, D.; van Ruth, S.M.; Posthumus, M.A.; Istasse, L.,
Gas chromatography-olfactometry analysis of the volatile compounds of two commercial Irish beef meats,
Talanta, 2003, 60, 4, 755-764, https://doi.org/10.1016/S0039-9140(03)00133-4
. [all data]
Jordán, Goodner, et al., 2002
Jordán, M.J.; Goodner, K.L.; Shaw, P.E.,
Characterization of the aromatic profile in aqueous essence and fruit juice of yellow passion fruit (Passiflora edulis Sims F. Flavicarpa degner) by GC-MS and GC/O,
J. Agric. Food Chem., 2002, 50, 6, 1523-1528, https://doi.org/10.1021/jf011077p
. [all data]
Poligne, Collignan, et al., 2002
Poligne, I.; Collignan, A.; Trystram, G.,
Effects of salting, drying, cooking, and smoking operations on volatile compound formation and collor patterns in pork,
Food Eng. Physical Properties, 2002, 67, 8, 2976-2986. [all data]
Teai, Claude-Lafontaine, et al., 2001
Teai, T.; Claude-Lafontaine, A.; Schippa, C.; Cozzolino, F.,
Volatile compounds in fresh pulp of pineapple (Ananas comosus [L.] Merr.) from French Polynesia,
J. Essent. Oil Res., 2001, 13, 5, 314-318, https://doi.org/10.1080/10412905.2001.9712222
. [all data]
Estrada and Gutierrez, 1999
Estrada, E.; Gutierrez, Y.,
Modeling chromatographic parameters by a novel graph theoretical sub-structural approach,
J. Chromatogr. A, 1999, 858, 2, 187-199, https://doi.org/10.1016/S0021-9673(99)00808-0
. [all data]
Flanagan, Streete, et al., 1997
Flanagan, R.J.; Streete, P.J.; Ramsey, J.D.,
Volatile Substance Abuse, UNODC Technical Series, No 5, United Nations, Office on Drugs and Crime, Vienna International Centre, PO Box 500, A-1400 Vienna, Austria, 1997, 56, retrieved from http://www.odccp.org/pdf/technicalseries1997-01-011.pdf. [all data]
Zenkevich and Chupalov, 1996
Zenkevich, I.G.; Chupalov, A.A.,
New Possibilities of Chromato Mass Pectrometric Identification of Organic Compounds Using Increments of Gas Chromatographic Retention Indices of Molecular Structural Fragments,
Zh. Org. Khim. (Rus.), 1996, 32, 5, 656-666. [all data]
Misharina, 1995
Misharina, T.A.,
Sorption regularities of sulfur- and oxygen-containing compounds in chromatography and their application in identification of volatile organic compounds, Diss. degree of Dr. Sci. (Chemistry), 1995, 52. [all data]
Ciccioli, Cecinato, et al., 1994
Ciccioli, P.; Cecinato, A.; Brancaleoni, E.; Brachetti, A.; Frattoni, M.; Sparapani, R.,
Composition and Distribution of Polar and Non-Polar VOCs in Urban, Rural, Forest and Remote Areas,
Eur Commission EUR, 1994, 549-568. [all data]
Ciccioli, Brancaleoni, et al., 1993
Ciccioli, P.; Brancaleoni, E.; Cecinato, A.; Sparapani, R.; Frattoni, M.,
Identification and determination of biogenic and anthropogenic volatile organic compounds in forest areas of Northern and Southern Europe and a remote site of the Himalaya region by high-resolution gas chromatography-mass spectrometry,
J. Chromatogr., 1993, 643, 1-2, 55-69, https://doi.org/10.1016/0021-9673(93)80541-F
. [all data]
Strete, Ruprah, et al., 1992
Strete, P.J.; Ruprah, M.; Ramsey, J.D.; Flanagan, R.J.,
Detection and identification of volatile substances by headspace capillary gas chromatography to aid the diagnosis of acute poisoning,
Analyst, 1992, 117, 7, 1111-1127, https://doi.org/10.1039/an9921701111
. [all data]
Binder and Flath, 1989
Binder, R.G.; Flath, R.A.,
Volatile components of pineapple guava,
J. Agric. Food Chem., 1989, 37, 3, 734-736, https://doi.org/10.1021/jf00087a034
. [all data]
MacLeod and Snyder, 1988
MacLeod, A.J.; Snyder, C.H.,
Volatile components of mango preserved by deep freezing,
J. Agric. Food Chem., 1988, 36, 1, 137-139, https://doi.org/10.1021/jf00079a035
. [all data]
Schultz, Flath, et al., 1988
Schultz, T.H.; Flath, R.A.; Stern, D.J.; Mon, T.R.; Teranishi, R.; McKenna Kruse, S.; Butlder, B.; Howard, W.E.,
Coyote estrous urine volatiles,
J. Chem. Ecol., 1988, 14, 2, 701-712, https://doi.org/10.1007/BF01013917
. [all data]
Waggott and Davies, 1984
Waggott, A.; Davies, I.W.,
Identification of organic pollutants using linear temperature programmed retention indices (LTPRIs) - Part II, 1984, retrieved from http://dwi.defra.gov.uk/research/completed-research/reports/dwi0383.pdf. [all data]
Ramsey and Flanagan, 1982
Ramsey, J.D.; Flanagan, R.J.,
Detection and Identification of Volatile Organic Compounds in Blood by Headspace Gas Chromatography as an Aid to the Diagnosis of Solvent Abuse,
J. Chromatogr., 1982, 240, 2, 423-444, https://doi.org/10.1016/S0021-9673(00)99622-5
. [all data]
Alves, da Penha, et al., 2012
Alves, V.C.C.; da Penha, M.F.A.; Pinto, N. deO.F.; Garruti, D. dosS.,
Volatile compounds profile of Musa FHIA 02: an option to counter losses by Black Sigatoka,
Nat. Prod. J., 2012, 5, 55-60. [all data]
Nebesny, Budryn, et al., 2007
Nebesny, E.; Budryn, G.; Kula, J.; Majda, T.,
The effect of roasting method on headspace composition of robusta coffee bean aroma,
Eur. Food Res. Technol., 2007, 225, 1, 9-19, https://doi.org/10.1007/s00217-006-0375-0
. [all data]
Povolo, Contarini, et al., 2007
Povolo, M.; Contarini, G.; Mele, M.; Secchiari, P.,
Study on the influence of pasture on volatile fraction of Ewes' dairy products by solid-phase microextraction and gas chromatography-mass spectrometry,
J. Dairy Sci., 2007, 90, 2, 556-569, https://doi.org/10.3168/jds.S0022-0302(07)71539-4
. [all data]
Fan and Qian, 2006
Fan, W.; Qian, M.C.,
Characterization of Aroma Compounds of Chinese Wuliangye and Jiannanchun Liquors by Aroma Extract Dilution Analysis,
J. Agric. Food Chem., 2006, 54, 7, 2695-2704, https://doi.org/10.1021/jf052635t
. [all data]
Fan and Qian, 2006, 2
Fan, W.; Qian, M.C.,
Identification of aroma compounds in Chinese 'Yanghe Daqu' liquor by normal phase chromatography fractionation followed by gas chromatography/olfactometry,
Flavour Fragr. J., 2006, 21, 2, 333-342, https://doi.org/10.1002/ffj.1621
. [all data]
Qian and Wang, 2005
Qian, M.C.; Wang, Y.,
Seasonal Variations of Volatile Composition and Odor Activity Value of Marion (Rubus spp. hyb) and Thornless Evergreen (R.laciniatus L.) Blackberries,
J. Food. Sci., 2005, 70, 1, c13-c20, https://doi.org/10.1111/j.1365-2621.2005.tb09013.x
. [all data]
Rochat and Chaintreau, 2005
Rochat, S.; Chaintreau, A.,
Carbonyl Odorants Contributing to the In-Oven Roast Beef Top Note,
J. Agric. Food Chem., 2005, 53, 24, 9578-9585, https://doi.org/10.1021/jf058089l
. [all data]
Chida, Sone, et al., 2004
Chida, M.; Sone, Y.; Tamura, H.,
Aroma characteristics of stored tobacco cut leaves analyzed by a high vacuum distillation and canister system,
J. Agric. Food Chem., 2004, 52, 26, 7918-7924, https://doi.org/10.1021/jf049223p
. [all data]
Narain, Almeida, et al., 2004
Narain, N.; Almeida, J.N.; Galvão, M.S.; Madruga, M.S.; de Brito, E.S.,
Volatile compounds in passion fruit (Passiflora edulis forma Flavicarpa) and yellow mombin (Spondias mombin L.) fruits obtained by dynamic headspace technique,
Cienc. Tecnol. Aliment. Campinas, 2004, 24, 2, 212-216, https://doi.org/10.1590/S0101-20612004000200009
. [all data]
Alves and Franco, 2003
Alves, G.L.; Franco, M.R.B.,
Headspace gas chromatography-mass spectrometry of volatile compounds in murici (Byrsonima crassifolia L. Rich),
J. Chromatogr. A, 2003, 985, 1-2, 297-301, https://doi.org/10.1016/S0021-9673(02)01398-5
. [all data]
Lee and Noble, 2003
Lee, S.-J.; Noble, A.C.,
Characterization of odor-active compounds in Californian Chardonnay wines using GC-olfactometry and GC-mass spectrometry,
J. Agric. Food Chem., 2003, 51, 27, 8036-8044, https://doi.org/10.1021/jf034747v
. [all data]
Tanaka, Yamauchi, et al., 2003
Tanaka, T.; Yamauchi, T.; Katsumata, R.; Kiuchi, K.,
Comparison of volatile components in commercial Itohiki-Natto by solid phase microextraction and gas chromatography,
Nippon Shokuhin Kagaku Kogaku Kaishi, 2003, 50, 6, 278-285, https://doi.org/10.3136/nskkk.50.278
. [all data]
Fukami, Ishiyama, et al., 2002
Fukami, K.; Ishiyama, S.; Yaguramaki, H.; Masuzawa, T.; Nabeta, Y.; Endo, K.; Shimoda, M.,
Identification of distinctive volatile compounds in fish sauce,
J. Agric. Food Chem., 2002, 50, 19, 5412-5416, https://doi.org/10.1021/jf020405y
. [all data]
Lecanu, Ducruet, et al., 2002
Lecanu, L.; Ducruet, V.; Jouquand, C.; Gratadoux, J.J.; Feigenbaum, A.,
Optimization of headspace solid-phase microextraction (SPME) for the odor analysis of surface-ripened cheese,
J. Agric. Food Chem., 2002, 50, 13, 3810-3817, https://doi.org/10.1021/jf0117107
. [all data]
Suhardi, Suzuki, et al., 2002
Suhardi, S.; Suzuki, M.; Yoshida, K.; Muto, T.; Fujita, A.; Watanbe, N.,
Changes in the volatile compounds and in the chemical and physical properties of snake fruit (Salacca edulis Reinw) Cv. Pondoh during maturation,
J. Agric. Food Chem., 2002, 50, 26, 7627-7633, https://doi.org/10.1021/jf020620e
. [all data]
Duque, Bonilla, et al., 2001
Duque, C.; Bonilla, A.; Bautista, E.; Zea, S.,
Exudation of low molecular wight compounds (thiobismethane, methyl isocyanide, amd methyl isothiocyanate) as a possible chemical defense mechanism in the marine sponge Ircinia felix,
Biochem. Systematics Ecol., 2001, 29, 5, 459-467, https://doi.org/10.1016/S0305-1978(00)00081-8
. [all data]
Iwatsuki, Mizota, et al., 1999
Iwatsuki, K.; Mizota, Y.; Kubota, T.; Nishimura, O.; Masuda, H.; Sotoyama, K.; Tomita, M.,
Aroma extract dilution analysis. Evluation of aroma of pasteurized and UHT processed milk by aroma extract dilution analysis,
Nippon Shokuhin Kagaku Kogaku Kaishi, 1999, 46, 9, 587-597, https://doi.org/10.3136/nskkk.46.587
. [all data]
Campeanu, Burcea, et al., 1998
Campeanu, G.; Burcea, M.; Doneanu, C.; Namolosanu, I.; Visan, L.,
GC/MS characterization of the volatiles isolated from the wines obtained from the indigenous cultivar Feteasca Regala,
Analusis, 1998, 26, 2, 93-97, https://doi.org/10.1051/analusis:1998117
. [all data]
Horiuchi, Umano, et al., 1998
Horiuchi, M.; Umano, K.; Shibamoto, T.,
Analysis of volatile compounds formed from fish oil heated with cysteine and trimethylamine oxide,
J. Agric. Food Chem., 1998, 46, 12, 5232-5237, https://doi.org/10.1021/jf980482m
. [all data]
Molleken U., Sinnwell V., et al., 1998
Molleken U.; Sinnwell V.; Kubeczka K.H.,
TThe essential oil composition of fruits from Smyrnium perfoliatum,
Phytochemistry, 1998, 47, 6, 1079-1083, https://doi.org/10.1016/S0031-9422(98)80076-9
. [all data]
Sekiwa, Kubota, et al., 1997
Sekiwa, Y.; Kubota, K.; Kobayashi, A.,
Characteristic flavor components in the brew of cooked clam (Meretrix lusoria) and the effect of storage on flavor formation,
J. Agric. Food Chem., 1997, 45, 3, 826-830, https://doi.org/10.1021/jf960433e
. [all data]
Ulrich, Hoberg, et al., 1997
Ulrich, D.; Hoberg, E.; Rapp, A.; Kecke, S.,
Analysis of strawberry flavour - discrimination of aroma types by quantification of volatile compounds,
Z. Lebensm. Unters. Forsch. A, 1997, 205, 3, 218-223, https://doi.org/10.1007/s002170050154
. [all data]
Umano, Hagi, et al., 1995
Umano, K.; Hagi, Y.; Nakahara, K.; Shyoji, A.; Shibamoto, T.,
Volatile chemicals formed in the headspace of a heated D-glucose/L-cysteine Maillard model system,
J. Agric. Food Chem., 1995, 43, 8, 2212-2218, https://doi.org/10.1021/jf00056a046
. [all data]
De Llano D.G., Ramos M., et al., 1990
De Llano D.G.; Ramos M.; Polo C.; Sanz J.; Martinez-Castro I.,
Evolution of the volatile components of an artisanal blue cheese during ripening,
J. Dairy Sci., 1990, 73, 7, 1676-1683, https://doi.org/10.3168/jds.S0022-0302(90)78842-X
. [all data]
Gyawali and Kim, 2012
Gyawali, R.; Kim, K.-S.,
Bioactive volatile compounds of three medicinal plants from Nepal,
Kathmandu Univ. J. Sci., Engineering and Technol., 2012, 8, 1, 51-62. [all data]
Povolo, Cabassi, et al., 2011
Povolo, M.; Cabassi, G.; Profaizer, M.; Lanteri, S.,
Study on the use of evolved gas analysis FT-IR (EGA FT-IR) for the evaluation of cheese volatile fraction,
The Open Food Sci. J., 2011, 5, 1, 10-16, https://doi.org/10.2174/1874256401105010010
. [all data]
Gyawali and Kim, 2009
Gyawali, R.; Kim, K.-S.,
Volatile organic compounds of medicinal values from Nepalese Acorus calamus L.,
Kathmandu Univ. J. Sci. Eng. Technol., 2009, 5, II, 51-65. [all data]
Berard, Bianchi, et al., 2007
Berard, J.; Bianchi, F.; Careri, M.; Chatel, A.; Mangia, A.; Musci, M.,
Characterization of the volatile fraction and of free fatty acids of Fontina Valle d'Aosta, a protected designation of origin Italian cheese,
Food Chem., 2007, 105, 1, 293-300, https://doi.org/10.1016/j.foodchem.2006.11.041
. [all data]
Narain, Galvao, et al., 2007
Narain, N.; Galvao, M.S.; Madruga, M.S.,
Volatile compounds captured through purge and trap technique in caja-umbu (Spondias sp.) fruits during maturation,
Food Chem., 2007, 102, 3, 726-731, https://doi.org/10.1016/j.foodchem.2006.06.003
. [all data]
Kourkoutas, Kandylis, et al., 2006
Kourkoutas, Y.; Kandylis, P.; Panas, P.; Dooley, J.S.G.; Nigam, P.; Koutinas, A.A.,
Evaluation of freeze-dried kefir coculture as starter in feta-type cheese production,
Appl. Environ. Microbiol., 2006, 72, 9, 6124-6135, https://doi.org/10.1128/AEM.03078-05
. [all data]
Quijano and Pino, 2006
Quijano, C.E.; Pino, J.A.,
Changes in volatile constituents during the ripening of cocona (Solanum sessiliflorum Dunal) fruit,
Revista CENIC Ciencias Quimicas, 2006, 37, 3, 133-136. [all data]
Jales, Maia, et al., 2005
Jales, K.A.; Maia, G.A.; Garruti, D.S.; Neto, M.A.S.; Janzantti, N.S.; Franco, M.R.B.,
Evaluation de los compuestos odoriferos del jugo de maracuya amarillo por GC-MS y GC-O (OSME),
Alimentis y bebidas, 2005, 3, 12-14. [all data]
Kim. J.H., Ahn, et al., 2004
Kim. J.H.; Ahn, H.J.; Yook, H.S.; Kim, K.S.; Rhee, M.S.; Ryu, G.H.; Byun, M.W.,
Color, flavor, and sensory characteristics of gamma-irradiated salted and fermented anchovy sauce,
Radiation Phys. Chem., 2004, 69, 2, 179-187, https://doi.org/10.1016/S0969-806X(03)00400-6
. [all data]
Miranda, Nogueira, et al., 2001
Miranda, E.J.F.; Nogueira, R.I.; Pontes, S.M.; Rezende, C.M.,
Odour-active compounds of banana passa identified by aroma extract dilution analysis,
Flavour Fragr. J., 2001, 16, 4, 281-285, https://doi.org/10.1002/ffj.997
. [all data]
Muresan, Eillebrecht, et al., 2000
Muresan, S.; Eillebrecht, M.A.J.L.; de Rijk, T.C.; de Jonge, H.G.; Leguijt, T.; Nijhuis, H.H.,
Aroma profile development of intermediate chocolate products. I. Volatile constituents of block-milk,
Food Chem., 2000, 68, 2, 167-174, https://doi.org/10.1016/S0308-8146(99)00171-5
. [all data]
Peng, Yang, et al., 1991
Peng, C.T.; Yang, Z.C.; Ding, S.F.,
Prediction of rentention idexes. II. Structure-retention index relationship on polar columns,
J. Chromatogr., 1991, 586, 1, 85-112, https://doi.org/10.1016/0021-9673(91)80028-F
. [all data]