Benzene, hexyl-
- Formula: C12H18
- Molecular weight: 162.2713
- IUPAC Standard InChIKey: LTEQMZWBSYACLV-UHFFFAOYSA-N
- CAS Registry Number: 1077-16-3
- Chemical structure:
View 3d structure (requires JavaScript / HTML 5) - Other names: Hexane, 1-phenyl-; Hexylbenzene; 1-Phenylhexane; n-Hexylbenzene

Condensed phase thermochemistry data

Data compiled by: Eugene S. Domalski and Elizabeth D. Hearing
Constant pressure heat capacity of liquid
Cp,liquid (J/mol*K) | Temperature (K) | Reference |
---|---|---|
248. | 293. | Tschamler, 1948 |

Phase change data

Data compiled as indicated in comments:
BS - Robert L. Brown and Stephen E. Stein
TRC - Thermodynamics Research Center, NIST Boulder Laboratories, Chris Muzny director
AC - William E. Acree, Jr., James S. Chickos
Quantity | Value | Units | Method | Reference | Comment |
---|---|---|---|---|---|
Tboil | 494. ± 10. | K | AVG | N/A | Average of 23 values; Individual data points |
Quantity | Value | Units | Method | Reference | Comment |
Tfus | 209.7 | K | N/A | Mears, Stanley, et al., 1963 | Uncertainty assigned by TRC = 0.3 K; TRC |
Tfus | 209.7 | K | N/A | Jessup and Stanley, 1961 | Uncertainty assigned by TRC = 0.5 K; TRC |
Tfus | 206.4 | K | N/A | Simon, 1929 | Uncertainty assigned by TRC = 1.5 K; TRC |
Quantity | Value | Units | Method | Reference | Comment |
ΔvapH° | 60.2 | kJ/mol | N/A | Ru«7825»icka, Zábranský, et al., 1994 | AC |
ΔvapH° | 60.0 | kJ/mol | N/A | Reid, 1972 | AC |
Enthalpy of vaporization
ΔvapH (kJ/mol) | Temperature (K) | Reference | Comment |
---|---|---|---|
61.6 | 289. | Kasehgari, Mokbel, et al., 1993 | Based on data from 274. to 463. K.; AC |

Reaction thermochemistry data

Data compiled by: Hussein Y. Afeefy, Joel F. Liebman, and Stephen E. Stein
Individual Reactions
By formula: C12H14 + 2H2 = C12H18
Quantity | Value | Units | Method | Reference | Comment |
---|---|---|---|---|---|
ΔrH° | -262. ± 1. | kJ/mol | Chyd | Davis, Allinger, et al., 1985 | liquid phase; solvent: Hexane |

Normal alkane RI, non-polar column, temperature ramp

Data compiled by: NIST Mass Spectrometry Data Center, William E. Wallace, director

Column type CapillaryCapillaryCapillaryCapillaryCapillary
Active phase Polydimethyl siloxane: CP-Sil 5 CBPetrocol DHCP Sil 5 CBHP-5SF-96
Column length (m) 60.100.25.30.111.
Carrier gas HeliumHeliumHeHeNitrogen
Substrate
Column diameter (mm) 0.250.250.250.250.76
Phase thickness (μm) 1.00.500.40.25
Tstart (C) 45.20.60.35.
Tend (C) 210.220.260.300.130.
Heat rate (K/min) 3.615.5.10.3.
Initial hold (min) 1.4515.40.2.8.
Final hold (min) 2.7230. 10.40.
I 1262.1254.1242.1267.21244.
ReferenceBramston-Cook, 2013Supelco, 2012Baser, Özek, et al., 2000Wang and Fingas, 1995Donetzhuber, Johansson, et al., 1976
Comment MSDC-RI MSDC-RI MSDC-RI MSDC-RI MSDC-RI

Kovats' RI, non-polar column, temperature ramp

Data compiled by: NIST Mass Spectrometry Data Center, William E. Wallace, director

Column type CapillaryCapillaryCapillary
Active phase DB-1DB-1OV-101
Column length (m) 60.60.110.
Carrier gas   He
Substrate
Column diameter (mm) 0.250.250.25
Phase thickness (μm) 0.250.250.20
Tstart (C) 30.30.35.
Tend (C) 220.220.200.
Heat rate (K/min) 2.2.1.
Initial hold (min) 4.4.
Final hold (min)
I 1245.1245.1244.
ReferenceTakeoka, Perrino, et al., 1996Takeoka, Perrino, et al., 1996Hayes and Pitzer, 1982
Comment MSDC-RI MSDC-RI MSDC-RI

References

Tschamler, 1948
Tschamler, H.,
Uber binare flussige Mischungen I. Mischungswarment, Volumseffekte und Zustandsdiagramme von chlorex mit benzol und n-alkylbenzolen,
Monatsh. Chem., 1948, 79, 162-177. [all data]
Mears, Stanley, et al., 1963
Mears, T.W.; Stanley, C.L.; Compere, E.L.; Howard, F.L.,
Synthesis, purification, and physical properties of seven twelve-carbon hyd rocarbons,
J. Res. Natl. Bur. Stand., Sect. A, 1963, 67, 475. [all data]
Jessup and Stanley, 1961
Jessup, R.S.; Stanley, C.L.,
Heats and volumes of mixing in several c(12) hydrocarbon systems,
J. Chem. Eng. Data, 1961, 6, 368-71. [all data]
Simon, 1929
Simon, I.,
Freezing Temperature of Organic Compounds. XI. Compounds in C5 and C6.,
Bull. Soc. Chim. Belg., 1929, 38, 47-70. [all data]
Ru«7825»icka, Zábranský, et al., 1994
Ru«7825»icka, Vlastimil; Zábranský, Milan; Ru«7825»icka, Kvetoslav; Majer, Vladimír,
Vapor pressures for a group of high-boiling alkylbenzenes under environmental conditions,
Thermochimica Acta, 1994, 245, 121-144, https://doi.org/10.1016/0040-6031(94)85073-9
. [all data]
Reid, 1972
Reid, Robert C.,
Handbook on vapor pressure and heats of vaporization of hydrocarbons and related compounds, R. C. Wilhort and B. J. Zwolinski, Texas A Research Foundation. College Station, Texas(1971). 329 pages.$10.00,
AIChE J., 1972, 18, 6, 1278-1278, https://doi.org/10.1002/aic.690180637
. [all data]
Kasehgari, Mokbel, et al., 1993
Kasehgari, H.; Mokbel, I.; Viton, C.; Jose, J.,
Vapor pressure of 11 alkylbenzenes in the range 10-3 -- 280 torr, correlation by equation of state,
Fluid Phase Equilibria, 1993, 87, 1, 133-152, https://doi.org/10.1016/0378-3812(93)85022-E
. [all data]
Davis, Allinger, et al., 1985
Davis, H.E.; Allinger, N.L.; Rogers, D.W.,
Enthalpies of hydrogenation of phenylalkynes: indirect determination of the enthalpy of formation of diphenylcyclopropenone,
J. Org. Chem., 1985, 50, 3601-3604. [all data]